Show logfile
Automated smoke report for branch blead 5.31.2 patch c0ad3f089909eceaf6d442a6805e5b46d1fee0e0 v5.31.1-118-gc0ad3f0899
vier.local: Intel(R) Core(TM) i7-3820 CPU @ 3.60GHz (GenuineIntel 3702MHz) (x86_64/1[8 cores] cpus)
    on        linux 5.1.6-200.fc29.x86_64 [Fedora 30 (Server Edition)]
    using     clang version 4.2.1 Compatible Clang 8.0.0 (Fedora 8.0.0-1.fc30) (*1)
    smoketime 5 hours 49 minutes (average 1 hour 27 minutes)

Summary: FAIL(F)

O = OK  F = Failure(s), extended report at the bottom
X = Failure(s) under TEST but not under harness
? = still running or test results not (yet) available
Build failures during:       - = unknown or N/A
c = Configure, m = make, M = make (after miniperl), t = make test-prep

v5.31.1-118-gc0ad3f0899
---------------------- ----------------------------------------------------
F  O                    -Dcc=clang -Accflags="-Werror=declaration-after-statement -g -fno-omit-frame-pointer -fsanitize=address  -fno-common -fsanitize-blacklist=`pwd`/asan_ignore" -Aldflags="-fsanitize=address" (*1)
F  O                    -Dcc=clang -Accflags="-Werror=declaration-after-statement -g -fno-omit-frame-pointer -fsanitize=address  -fno-common -fsanitize-blacklist=`pwd`/asan_ignore" -Aldflags="-fsanitize=address" -Duseithreads (*1)
|  |
|  +------------------  stdio DEBUGGING
+---------------------  stdio

Applied patches:
  SMOKEc0ad3f089909eceaf6d442a6805e5b46d1fee0e0

Skipped tests:
  None

Test failures:
~~ ../t/re/substT.t ............................................ FAILED 164
  [stdio] -Dcc=clang -Accflags="-Werror=declaration-after-statement -g -fno-omit-frame-pointer -fsanitize=address  -fno-common -fsanitize-blacklist=`pwd`/asan_ignore" -Aldflags="-fsanitize=address"
~~ ../t/re/pat_rt_report.t ..................................... FAILED 2504
  [stdio] -Dcc=clang -Accflags="-Werror=declaration-after-statement -g -fno-omit-frame-pointer -fsanitize=address  -fno-common -fsanitize-blacklist=`pwd`/asan_ignore" -Aldflags="-fsanitize=address"
~~ ../ext/PerlIO-encoding/t/encoding.t ......................... FAILED Non-zero exit status: 1
  [stdio] -Dcc=clang -Accflags="-Werror=declaration-after-statement -g -fno-omit-frame-pointer -fsanitize=address  -fno-common -fsanitize-blacklist=`pwd`/asan_ignore" -Aldflags="-fsanitize=address" -Duseithreads
  [stdio] -Dcc=clang -Accflags="-Werror=declaration-after-statement -g -fno-omit-frame-pointer -fsanitize=address  -fno-common -fsanitize-blacklist=`pwd`/asan_ignore" -Aldflags="-fsanitize=address"
~~ ../t/re/regex_sets.t ........................................ FAILED 91
  [stdio] -Dcc=clang -Accflags="-Werror=declaration-after-statement -g -fno-omit-frame-pointer -fsanitize=address  -fno-common -fsanitize-blacklist=`pwd`/asan_ignore" -Aldflags="-fsanitize=address"
~~ ../t/re/reg_fold.t .......................................... FAILED Non-zero exit status: 1
  [stdio] -Dcc=clang -Accflags="-Werror=declaration-after-statement -g -fno-omit-frame-pointer -fsanitize=address  -fno-common -fsanitize-blacklist=`pwd`/asan_ignore" -Aldflags="-fsanitize=address"
~~ ../t/re/anyof.t ............................................. FAILED 1-3 No plan found in TAP output
  [stdio] -Dcc=clang -Accflags="-Werror=declaration-after-statement -g -fno-omit-frame-pointer -fsanitize=address  -fno-common -fsanitize-blacklist=`pwd`/asan_ignore" -Aldflags="-fsanitize=address"
~~ ../dist/threads-shared/t/sv_refs.t .......................... FAILED Non-zero exit status: 1
  [stdio] -Dcc=clang -Accflags="-Werror=declaration-after-statement -g -fno-omit-frame-pointer -fsanitize=address  -fno-common -fsanitize-blacklist=`pwd`/asan_ignore" -Aldflags="-fsanitize=address" -Duseithreads
~~ ../dist/threads-shared/t/clone.t ............................ FAILED Non-zero exit status: 1
  [stdio] -Dcc=clang -Accflags="-Werror=declaration-after-statement -g -fno-omit-frame-pointer -fsanitize=address  -fno-common -fsanitize-blacklist=`pwd`/asan_ignore" -Aldflags="-fsanitize=address" -Duseithreads

Test todo-passed:

MANIFEST messages:

Compiler messages:
  sv.c:12501:41: warning: adding 'int' to a string does not append to the string [-Wstring-plus-int]
  ./handy.h:508:37: note: expanded from macro 'strnEQ'
  sv.c:12501:41: note: use array indexing to silence this warning
  Encode.c:1356:5: warning: unused variable 'ix' [-Wunused-variable]
  ../../XSUB.h:185:20: note: expanded from macro 'dXSI32'
  Encode.c:1398:5: warning: unused variable 'ix' [-Wunused-variable]
  ./const-xs.inc:131:42: warning: AI_IDN_ALLOW_UNASSIGNED is deprecated [-W#pragma-messages]
  /usr/include/netdb.h:609:3: note: expanded from macro 'AI_IDN_ALLOW_UNASSIGNED'
  /usr/include/sys/cdefs.h:495:3: note: expanded from macro '__glibc_macro_warning'
  /usr/include/sys/cdefs.h:493:42: note: expanded from macro '__glibc_macro_warning1'
  :123:6: note: expanded from here
  ./const-xs.inc:134:46: warning: AI_IDN_USE_STD3_ASCII_RULES is deprecated [-W#pragma-messages]
  /usr/include/netdb.h:611:3: note: expanded from macro 'AI_IDN_USE_STD3_ASCII_RULES'
  :126:6: note: expanded from here
  ./const-xs.inc:386:42: warning: NI_IDN_ALLOW_UNASSIGNED is deprecated [-W#pragma-messages]
  /usr/include/netdb.h:650:3: note: expanded from macro 'NI_IDN_ALLOW_UNASSIGNED'
  :129:6: note: expanded from here
  ./const-xs.inc:389:46: warning: NI_IDN_USE_STD3_ASCII_RULES is deprecated [-W#pragma-messages]
  /usr/include/netdb.h:652:3: note: expanded from macro 'NI_IDN_USE_STD3_ASCII_RULES'
  :132:6: note: expanded from here

About this smoke:
    smoking-perl: 5.28.2
  smoker-version: 1.72/0.046
       timestamp: 2019-07-01 01:29:12+00
          tester: perl

Enabled stack-use-after-return (Linux/Darwin) and leak-detection (Linux).  Smoke logs available at http://m-l.org/~perl/smoke/perl/linux/blead_clang_quick_sanitize=address/logc0ad3f089909eceaf6d442a6805e5b46d1fee0e0.log.gz
-- 
Report generated by Test::Smoke::Gateway v0.09_01