Automated smoke report for branch blead 5.31.2 patch c6981b9a20742358c4af17bc46ba8d20a1c46d07 v5.31.1-54-gc6981b9a20
hydahydroid81: aarch64 (aarch64/? cpus)
    on        linux 4.4.120
    using     cc version 4.2.1 Compatible Clang 8.0.0 (tags/RELEASE_800/final) (*1)
    smoketime 1 day 14 hours 8 minutes (average 4 hours 46 minutes)

Summary: FAIL(FM)

O = OK  F = Failure(s), extended report at the bottom
X = Failure(s) under TEST but not under harness
? = still running or test results not (yet) available
Build failures during:       - = unknown or N/A
c = Configure, m = make, M = make (after miniperl), t = make test-prep

v5.31.1-54-gc6981b9a20
---------------------- ----------------------------------------------------
-  F  F  -  F  F        -Alibpth="/system/lib /vendor/lib" (*1)
-  F  F  -  F  F        -Alibpth="/system/lib /vendor/lib" -Duse64bitint (*1)
M  -  -  M  -  -        -Alibpth="/system/lib /vendor/lib" -Duseithreads (*1)
M  -  -  M  -  -        -Alibpth="/system/lib /vendor/lib" -Duseithreads -Duse64bitint (*1)
|  |  |  |  |  |
|  |  |  |  |  +------  perlio DEBUGGING
|  |  |  |  +---------  stdio DEBUGGING
|  |  |  +------------  minitest DEBUGGING
|  |  +---------------  perlio
|  +------------------  stdio
+---------------------  minitest

Applied patches:
  SMOKEc6981b9a20742358c4af17bc46ba8d20a1c46d07

Skipped tests:
      # One test name on a line
      t/op/readline.t

Test failures:
~~ ../dist/Net-Ping/t/510_ping_udp.t ........................... FAILED Non-zero exit status: 255 Bad plan.  You planned 3 tests but ran 1.
  [stdio/perlio] -Alibpth="/system/lib /vendor/lib" DEBUGGING
  [stdio/perlio] -Alibpth="/system/lib /vendor/lib" -Duse64bitint
  [stdio/perlio] -Alibpth="/system/lib /vendor/lib" -Duse64bitint DEBUGGING
  [stdio/perlio] -Alibpth="/system/lib /vendor/lib"
~~ ../cpan/ExtUtils-MakeMaker/t/02-xsdynamic.t ................. FAILED 17 Non-zero exit status: 5
  [stdio/perlio] -Alibpth="/system/lib /vendor/lib" DEBUGGING
  [stdio/perlio] -Alibpth="/system/lib /vendor/lib" -Duse64bitint
  [stdio/perlio] -Alibpth="/system/lib /vendor/lib" -Duse64bitint DEBUGGING
  [stdio/perlio] -Alibpth="/system/lib /vendor/lib"
~~ ../dist/Net-Ping/t/150_syn_inst.t ........................... FAILED Non-zero exit status: 255 Bad plan.  You planned 2 tests but ran 1.
  [stdio/perlio] -Alibpth="/system/lib /vendor/lib" DEBUGGING
  [stdio/perlio] -Alibpth="/system/lib /vendor/lib" -Duse64bitint
  [stdio/perlio] -Alibpth="/system/lib /vendor/lib" -Duse64bitint DEBUGGING
  [stdio/perlio] -Alibpth="/system/lib /vendor/lib"
~~ ../dist/Net-Ping/t/450_service.t ............................ FAILED Non-zero exit status: 255 Bad plan.  You planned 26 tests but ran 6.
  [stdio] -Alibpth="/system/lib /vendor/lib" DEBUGGING
  [stdio] -Alibpth="/system/lib /vendor/lib" -Duse64bitint
  [stdio] -Alibpth="/system/lib /vendor/lib" -Duse64bitint DEBUGGING
  [stdio] -Alibpth="/system/lib /vendor/lib"
~~ ../t/porting/test_bootstrap.t ............................... FAILED Non-zero exit status: 2
  [stdio/perlio] -Alibpth="/system/lib /vendor/lib" DEBUGGING
  [stdio/perlio] -Alibpth="/system/lib /vendor/lib" -Duse64bitint
  [stdio/perlio] -Alibpth="/system/lib /vendor/lib" -Duse64bitint DEBUGGING
  [stdio/perlio] -Alibpth="/system/lib /vendor/lib"
~~ ../dist/Net-Ping/t/120_udp_inst.t ........................... FAILED Non-zero exit status: 255 Bad plan.  You planned 2 tests but ran 1.
  [stdio/perlio] -Alibpth="/system/lib /vendor/lib" DEBUGGING
  [stdio/perlio] -Alibpth="/system/lib /vendor/lib" -Duse64bitint
  [stdio/perlio] -Alibpth="/system/lib /vendor/lib" -Duse64bitint DEBUGGING
  [stdio/perlio] -Alibpth="/system/lib /vendor/lib"
~~ ../dist/Net-Ping/t/001_new.t ................................ FAILED Non-zero exit status: 255
  [stdio/perlio] -Alibpth="/system/lib /vendor/lib" DEBUGGING
  [stdio/perlio] -Alibpth="/system/lib /vendor/lib" -Duse64bitint
  [stdio/perlio] -Alibpth="/system/lib /vendor/lib" -Duse64bitint DEBUGGING
  [stdio/perlio] -Alibpth="/system/lib /vendor/lib"
~~ ../dist/Net-Ping/t/010_pingecho.t ........................... FAILED Non-zero exit status: 255 Bad plan.  You planned 2 tests but ran 1.
  [stdio/perlio] -Alibpth="/system/lib /vendor/lib" DEBUGGING
  [stdio/perlio] -Alibpth="/system/lib /vendor/lib" -Duse64bitint
  [stdio/perlio] -Alibpth="/system/lib /vendor/lib" -Duse64bitint DEBUGGING
  [stdio/perlio] -Alibpth="/system/lib /vendor/lib"
~~ ../t/porting/manifest.t ..................................... FAILED 9500
  [stdio/perlio] -Alibpth="/system/lib /vendor/lib" DEBUGGING
  [stdio/perlio] -Alibpth="/system/lib /vendor/lib" -Duse64bitint
  [stdio/perlio] -Alibpth="/system/lib /vendor/lib" -Duse64bitint DEBUGGING
  [stdio/perlio] -Alibpth="/system/lib /vendor/lib"
~~ ../dist/Net-Ping/t/140_stream_inst.t ........................ FAILED Non-zero exit status: 255 Bad plan.  You planned 2 tests but ran 1.
  [stdio/perlio] -Alibpth="/system/lib /vendor/lib" DEBUGGING
  [stdio/perlio] -Alibpth="/system/lib /vendor/lib" -Duse64bitint
  [stdio/perlio] -Alibpth="/system/lib /vendor/lib" -Duse64bitint DEBUGGING
  [stdio/perlio] -Alibpth="/system/lib /vendor/lib"
~~ ../dist/Net-Ping/t/450_service.t ............................ FAILED Non-zero exit status: 29 Bad plan.  You planned 26 tests but ran 6.
  [perlio] -Alibpth="/system/lib /vendor/lib" DEBUGGING
  [perlio] -Alibpth="/system/lib /vendor/lib" -Duse64bitint
  [perlio] -Alibpth="/system/lib /vendor/lib" -Duse64bitint DEBUGGING
  [perlio] -Alibpth="/system/lib /vendor/lib"
~~ ../dist/Net-Ping/t/130_tcp_inst.t ........................... FAILED Non-zero exit status: 255 Bad plan.  You planned 2 tests but ran 1.
  [stdio/perlio] -Alibpth="/system/lib /vendor/lib" DEBUGGING
  [stdio/perlio] -Alibpth="/system/lib /vendor/lib" -Duse64bitint
  [stdio/perlio] -Alibpth="/system/lib /vendor/lib" -Duse64bitint DEBUGGING
  [stdio/perlio] -Alibpth="/system/lib /vendor/lib"

Test todo-passed:

MANIFEST messages:

Compiler messages:
  awk: cmd. line:1: warning: regexp escape sequence `\=' is not a known regexp operator
  sv.c:12501:41: warning: adding 'int' to a string does not append to the string [-Wstring-plus-int]
  ./handy.h:508:37: note: expanded from macro 'strnEQ'
  sv.c:12501:41: note: use array indexing to silence this warning
  pp_sys.c:4114:11: warning: implicit declaration of function 'seekdir' is invalid in C99 [-Wimplicit-function-declaration]
  ./iperlsys.h:446:33: note: expanded from macro 'PerlDir_seek'
  pp_sys.c:5359:2: warning: implicit declaration of function 'setpwent' is invalid in C99 [-Wimplicit-function-declaration]
  doio.c:261:2: warning: implicit declaration of function 'mkostemp' is invalid in C99 [-Wimplicit-function-declaration]
  ./util.h:252:45: note: expanded from macro 'Perl_my_mkostemp'
  doio.c:281:2: warning: implicit declaration of function 'pipe2' is invalid in C99 [-Wimplicit-function-declaration]
  doio.c:2759:15: warning: implicit declaration of function 'futimes' is invalid in C99 [-Wimplicit-function-declaration]
  doio.c:2911:9: warning: implicit declaration of function 'msgget' is invalid in C99 [-Wimplicit-function-declaration]
  doio.c:2900:9: warning: unused variable 'nsv' [-Wunused-variable]
  doio.c:3023:8: warning: implicit declaration of function 'msgctl' is invalid in C99 [-Wimplicit-function-declaration]
  doio.c:3081:14: warning: implicit declaration of function 'msgsnd' is invalid in C99 [-Wimplicit-function-declaration]
  doio.c:3119:15: warning: implicit declaration of function 'msgrcv' is invalid in C99 [-Wimplicit-function-declaration]
  doio.c:3141:26: warning: unused parameter 'mark' [-Wunused-parameter]
  doio.c:3141:37: warning: unused parameter 'sp' [-Wunused-parameter]
  doio.c:3186:25: warning: unused parameter 'optype' [-Wunused-parameter]
  doio.c:3186:38: warning: unused parameter 'mark' [-Wunused-parameter]
  doio.c:3186:49: warning: unused parameter 'sp' [-Wunused-parameter]
  Encode.c:1356:5: warning: unused variable 'ix' [-Wunused-variable]
  ../../XSUB.h:185:20: note: expanded from macro 'dXSI32'
  Encode.c:1398:5: warning: unused variable 'ix' [-Wunused-variable]
  ./const-c.inc:24:42: warning: unused parameter 'iv_return' [-Wunused-parameter]
  SysV.c:371:7: warning: unused variable 'obj' [-Wunused-variable]
  SysV.c:409:7: warning: unused variable 'obj' [-Wunused-variable]
  SysV.c:411:7: warning: unused variable 'ds' [-Wunused-variable]
  SysV.c:450:7: warning: unused variable 'obj' [-Wunused-variable]
  SysV.c:492:7: warning: unused variable 'obj' [-Wunused-variable]
  SysV.c:494:7: warning: unused variable 'ds' [-Wunused-variable]
  SysV.c:535:15: warning: unused variable 'path' [-Wunused-variable]
  SysV.xs:310:9: warning: unused variable 'proj_id' [-Wunused-variable]
  SysV.xs:311:11: warning: unused variable 'k' [-Wunused-variable]
  SysV.c:665:6: warning: unused variable 'id' [-Wunused-variable]
  SysV.c:667:7: warning: unused variable 'addr' [-Wunused-variable]
  SysV.c:669:6: warning: unused variable 'flag' [-Wunused-variable]
  SysV.c:699:7: warning: unused variable 'addr' [-Wunused-variable]
  SysV.xs:86:20: warning: unused variable 's_pkg_sem' [-Wunused-variable]
  SysV.xs:87:20: warning: unused variable 's_pkg_shm' [-Wunused-variable]
  reentr.c:331:16: warning: implicit declaration of function 'gethostbyaddr_r' is invalid in C99 [-Wimplicit-function-declaration]
  ./reentr.h:962:63: note: expanded from macro 'gethostbyaddr'
  reentr.c:436:16: warning: implicit declaration of function 'getpwent' is invalid in C99 [-Wimplicit-function-declaration]
  reentr.c:436:14: warning: incompatible integer to pointer conversion assigning to 'void *' from 'int' [-Wint-conversion]
  sv.c:13646:11: warning: implicit declaration of function 'telldir' is invalid in C99 [-Wimplicit-function-declaration]
  ./iperlsys.h:447:28: note: expanded from macro 'PerlDir_tell'
  sv.c:13647:19: warning: 'readdir_r' is deprecated: readdir_r is deprecated; use readdir instead [-Wdeprecated-declarations]
  ./iperlsys.h:444:28: note: expanded from macro 'PerlDir_read'
  ./reentr.h:1298:28: note: expanded from macro 'readdir'
  /data/data/com.termux/files/usr/include/dirent.h:87:92: note: 'readdir_r' has been explicitly marked deprecated here
  sv.c:13661:5: warning: implicit declaration of function 'seekdir' is invalid in C99 [-Wimplicit-function-declaration]
  sv.c:13668:10: warning: 'readdir_r' is deprecated: readdir_r is deprecated; use readdir instead [-Wdeprecated-declarations]
  sv.c:13676:20: warning: 'readdir_r' is deprecated: readdir_r is deprecated; use readdir instead [-Wdeprecated-declarations]
  pp_sys.c:4040:28: warning: 'readdir_r' is deprecated: readdir_r is deprecated; use readdir instead [-Wdeprecated-declarations]
  pp_sys.c:5002:9: warning: implicit declaration of function 'gethostbyaddr_r' is invalid in C99 [-Wimplicit-function-declaration]
  ./iperlsys.h:1366:41: note: expanded from macro 'PerlSock_gethostbyaddr'
  locale.c:5214:25: warning: implicit declaration of function 'strerror_l' is invalid in C99 [-Wimplicit-function-declaration]
  locale.c:5214:25: warning: incompatible integer to pointer conversion passing 'int' to parameter of type 'const char *' [-Wint-conversion]
  ./embed.h:697:38: note: expanded from macro 'savepv'
  ./proto.h:3074:51: note: passing argument to parameter 'pv' here

About this smoke:
    smoking-perl: 5.28.2
  smoker-version: 1.72/0.046
       timestamp: 2019-06-23 20:48:00+00
          tester: u0_a56

This smoker is on Android 8.1 (Oreo) using the Termux environment.
(It's a cheap TV box, so doesn't have much grunt.)
Contact: rich+perl@hyphen-dash-hyphen.info

Current test failures with known causes:
* ../cpan/ExtUtils-MakeMaker/t/02-xsdynamic.t - https://github.com/Perl-Toolchain-Gang/ExtUtils-MakeMaker/issues/337 (patch submitted)
* ../dist/Net-Ping/t/*         - https://rt.perl.org/Public/Bug/Display.html?id=134043  (patch submitted)
* io/pipe.t                    - https://rt.perl.org/Ticket/Display.html?id=122112 (Termux bug?)

Skipped tests:
* ../t/op/readline.t - works normally but hangs under stdio layer. Specifically, as per the following,  
PERLIO=stdio ./perl -e 'local $SIG{ALRM} = sub { die "Alarm!" }; alarm 1; readline(STDIN)'

Skipped builds:
uselongdouble & usemorebits - t/POSIX/math.t fails tan(1) == -tan(-1) test. Possible LLVM bug. Definite android bug in failure to printf long doubles correctly.
-- 
Report generated by Test::Smoke::Gateway v0.09_01