Show logfile
Automated smoke report for branch blead 5.31.2 patch e29a253e189dde26f93283ee93b3b8e44d46b7a3 v5.31.1-8-ge29a253e18
vier.local: Intel(R) Core(TM) i7-3820 CPU @ 3.60GHz (GenuineIntel 3702MHz) (x86_64/1[8 cores] cpus)
    on        linux 5.1.6-200.fc29.x86_64 [Fedora 29 (Server Edition)]
    using     clang version 4.2.1 Compatible Clang 7.0.1 (Fedora 7.0.1-6.fc29) (*1)
    smoketime 1 hour 53 minutes (average 28 minutes 25 seconds)

Summary: FAIL(F)

O = OK  F = Failure(s), extended report at the bottom
X = Failure(s) under TEST but not under harness
? = still running or test results not (yet) available
Build failures during:       - = unknown or N/A
c = Configure, m = make, M = make (after miniperl), t = make test-prep

v5.31.1-8-ge29a253e18
---------------------- ----------------------------------------------------
F  F                    -Dcc=clang -Accflags="-Werror=declaration-after-statement -g -fno-omit-frame-pointer -fno-sanitize-recover=undefined -fsanitize-blacklist=`pwd`/asan_ignore" -Aldflags="-fno-sanitize-recover=undefined" (*1)
F  F                    -Dcc=clang -Accflags="-Werror=declaration-after-statement -g -fno-omit-frame-pointer -fno-sanitize-recover=undefined -fsanitize-blacklist=`pwd`/asan_ignore" -Aldflags="-fno-sanitize-recover=undefined" -Duseithreads (*1)
|  |
|  +------------------  stdio DEBUGGING
+---------------------  stdio

Applied patches:
  SMOKEe29a253e189dde26f93283ee93b3b8e44d46b7a3

Skipped tests:
  None

Test failures:
~~ ../t/porting/regen.t ........................................ FAILED 27
  [stdio] -Dcc=clang -Accflags="-Werror=declaration-after-statement -g -fno-omit-frame-pointer -fno-sanitize-recover=undefined -fsanitize-blacklist=`pwd`/asan_ignore" -Aldflags="-fno-sanitize-recover=undefined" -Duseithreads DEBUGGING
  [stdio] -Dcc=clang -Accflags="-Werror=declaration-after-statement -g -fno-omit-frame-pointer -fno-sanitize-recover=undefined -fsanitize-blacklist=`pwd`/asan_ignore" -Aldflags="-fno-sanitize-recover=undefined"
  [stdio] -Dcc=clang -Accflags="-Werror=declaration-after-statement -g -fno-omit-frame-pointer -fno-sanitize-recover=undefined -fsanitize-blacklist=`pwd`/asan_ignore" -Aldflags="-fno-sanitize-recover=undefined" -Duseithreads
  [stdio] -Dcc=clang -Accflags="-Werror=declaration-after-statement -g -fno-omit-frame-pointer -fno-sanitize-recover=undefined -fsanitize-blacklist=`pwd`/asan_ignore" -Aldflags="-fno-sanitize-recover=undefined" DEBUGGING
~~ ../dist/Module-CoreList/t/is_core.t ......................... FAILED 2 Non-zero exit status: 2
  [stdio] -Dcc=clang -Accflags="-Werror=declaration-after-statement -g -fno-omit-frame-pointer -fno-sanitize-recover=undefined -fsanitize-blacklist=`pwd`/asan_ignore" -Aldflags="-fno-sanitize-recover=undefined" -Duseithreads DEBUGGING
  [stdio] -Dcc=clang -Accflags="-Werror=declaration-after-statement -g -fno-omit-frame-pointer -fno-sanitize-recover=undefined -fsanitize-blacklist=`pwd`/asan_ignore" -Aldflags="-fno-sanitize-recover=undefined"
  [stdio] -Dcc=clang -Accflags="-Werror=declaration-after-statement -g -fno-omit-frame-pointer -fno-sanitize-recover=undefined -fsanitize-blacklist=`pwd`/asan_ignore" -Aldflags="-fno-sanitize-recover=undefined" -Duseithreads
  [stdio] -Dcc=clang -Accflags="-Werror=declaration-after-statement -g -fno-omit-frame-pointer -fno-sanitize-recover=undefined -fsanitize-blacklist=`pwd`/asan_ignore" -Aldflags="-fno-sanitize-recover=undefined" DEBUGGING
~~ ../dist/Module-CoreList/t/maintainer.t ...................... FAILED 4-5 Non-zero exit status: 2
  [stdio] -Dcc=clang -Accflags="-Werror=declaration-after-statement -g -fno-omit-frame-pointer -fno-sanitize-recover=undefined -fsanitize-blacklist=`pwd`/asan_ignore" -Aldflags="-fno-sanitize-recover=undefined" -Duseithreads DEBUGGING
  [stdio] -Dcc=clang -Accflags="-Werror=declaration-after-statement -g -fno-omit-frame-pointer -fno-sanitize-recover=undefined -fsanitize-blacklist=`pwd`/asan_ignore" -Aldflags="-fno-sanitize-recover=undefined"
  [stdio] -Dcc=clang -Accflags="-Werror=declaration-after-statement -g -fno-omit-frame-pointer -fno-sanitize-recover=undefined -fsanitize-blacklist=`pwd`/asan_ignore" -Aldflags="-fno-sanitize-recover=undefined" -Duseithreads
  [stdio] -Dcc=clang -Accflags="-Werror=declaration-after-statement -g -fno-omit-frame-pointer -fno-sanitize-recover=undefined -fsanitize-blacklist=`pwd`/asan_ignore" -Aldflags="-fno-sanitize-recover=undefined" DEBUGGING
~~ ../t/porting/corelist.t ..................................... FAILED 3-5
  [stdio] -Dcc=clang -Accflags="-Werror=declaration-after-statement -g -fno-omit-frame-pointer -fno-sanitize-recover=undefined -fsanitize-blacklist=`pwd`/asan_ignore" -Aldflags="-fno-sanitize-recover=undefined" -Duseithreads DEBUGGING
  [stdio] -Dcc=clang -Accflags="-Werror=declaration-after-statement -g -fno-omit-frame-pointer -fno-sanitize-recover=undefined -fsanitize-blacklist=`pwd`/asan_ignore" -Aldflags="-fno-sanitize-recover=undefined"
  [stdio] -Dcc=clang -Accflags="-Werror=declaration-after-statement -g -fno-omit-frame-pointer -fno-sanitize-recover=undefined -fsanitize-blacklist=`pwd`/asan_ignore" -Aldflags="-fno-sanitize-recover=undefined" -Duseithreads
  [stdio] -Dcc=clang -Accflags="-Werror=declaration-after-statement -g -fno-omit-frame-pointer -fno-sanitize-recover=undefined -fsanitize-blacklist=`pwd`/asan_ignore" -Aldflags="-fno-sanitize-recover=undefined" DEBUGGING
~~ ../dist/Devel-PPPort/t/uv.t ................................. FAILED 25
  [stdio] -Dcc=clang -Accflags="-Werror=declaration-after-statement -g -fno-omit-frame-pointer -fno-sanitize-recover=undefined -fsanitize-blacklist=`pwd`/asan_ignore" -Aldflags="-fno-sanitize-recover=undefined" -Duseithreads DEBUGGING
  [stdio] -Dcc=clang -Accflags="-Werror=declaration-after-statement -g -fno-omit-frame-pointer -fno-sanitize-recover=undefined -fsanitize-blacklist=`pwd`/asan_ignore" -Aldflags="-fno-sanitize-recover=undefined"
  [stdio] -Dcc=clang -Accflags="-Werror=declaration-after-statement -g -fno-omit-frame-pointer -fno-sanitize-recover=undefined -fsanitize-blacklist=`pwd`/asan_ignore" -Aldflags="-fno-sanitize-recover=undefined" -Duseithreads
  [stdio] -Dcc=clang -Accflags="-Werror=declaration-after-statement -g -fno-omit-frame-pointer -fno-sanitize-recover=undefined -fsanitize-blacklist=`pwd`/asan_ignore" -Aldflags="-fno-sanitize-recover=undefined" DEBUGGING

Test todo-passed:

MANIFEST messages:

Compiler messages:
  Encode.c:1356:5: warning: unused variable 'ix' [-Wunused-variable]
  ../../XSUB.h:185:20: note: expanded from macro 'dXSI32'
  Encode.c:1398:5: warning: unused variable 'ix' [-Wunused-variable]
  ./const-xs.inc:131:42: warning: AI_IDN_ALLOW_UNASSIGNED is deprecated [-W#pragma-messages]
  /usr/include/netdb.h:609:3: note: expanded from macro 'AI_IDN_ALLOW_UNASSIGNED'
  /usr/include/sys/cdefs.h:485:3: note: expanded from macro '__glibc_macro_warning'
  /usr/include/sys/cdefs.h:483:42: note: expanded from macro '__glibc_macro_warning1'
  :114:6: note: expanded from here
  ./const-xs.inc:134:46: warning: AI_IDN_USE_STD3_ASCII_RULES is deprecated [-W#pragma-messages]
  /usr/include/netdb.h:611:3: note: expanded from macro 'AI_IDN_USE_STD3_ASCII_RULES'
  :117:6: note: expanded from here
  ./const-xs.inc:386:42: warning: NI_IDN_ALLOW_UNASSIGNED is deprecated [-W#pragma-messages]
  /usr/include/netdb.h:650:3: note: expanded from macro 'NI_IDN_ALLOW_UNASSIGNED'
  :120:6: note: expanded from here
  ./const-xs.inc:389:46: warning: NI_IDN_USE_STD3_ASCII_RULES is deprecated [-W#pragma-messages]
  /usr/include/netdb.h:652:3: note: expanded from macro 'NI_IDN_USE_STD3_ASCII_RULES'
  :123:6: note: expanded from here

About this smoke:
    smoking-perl: 5.28.2
  smoker-version: 1.72/0.046
       timestamp: 2019-06-21 14:52:18+00
          tester: perl

This now errors on undefined behavior instead of warning.  Smoke logs available at http://m-l.org/~perl/smoke/perl/linux/blead_clang_quick_sanitize=undefined/loge29a253e189dde26f93283ee93b3b8e44d46b7a3.log.gz
-- 
Report generated by Test::Smoke::Gateway v0.09_01