Show logfile
Automated smoke report for branch blead 5.31.2 patch 9649a8179cb2cf813532bc8050c4476c0e242a32 v5.31.1-6-g9649a8179c
cjg-mac.local: Mac mini (2.6 GHz) (Intel Core i5/1[2 cores] cpus)
    on        darwin 18.6.0 (Mac OS X - macOS 10.14.5 (18F132))
    using     cc version 4.2.1 Compatible Apple LLVM 10.0.1 (clang-1001.0.46.4) (*1)
    smoketime 3 hours 6 minutes (average 23 minutes 15 seconds)

Summary: FAIL(F)

O = OK  F = Failure(s), extended report at the bottom
X = Failure(s) under TEST but not under harness
? = still running or test results not (yet) available
Build failures during:       - = unknown or N/A
c = Configure, m = make, M = make (after miniperl), t = make test-prep

v5.31.1-6-g9649a8179c
---------------------- ----------------------------------------------------
F  F                    Dcc=clang++ (*1)
F  F                    Dcc=clang++ -Duse64bitall (*1)
F  F                    Dcc=clang++ -Duseithreads (*1)
F  F                    Dcc=clang++ -Duseithreads -Duse64bitall (*1)
|  |
|  +------------------  stdio DEBUGGING
+---------------------  stdio

Applied patches:
  SMOKE9649a8179cb2cf813532bc8050c4476c0e242a32

Skipped tests:
      # One test name on a line

Test failures:
~~ ../t/porting/regen.t ........................................ FAILED 27
  [stdio] Dcc=clang++ -Duseithreads -Duse64bitall DEBUGGING
  [stdio] Dcc=clang++ -Duseithreads DEBUGGING
  [stdio] Dcc=clang++ -Duse64bitall DEBUGGING
  [stdio] Dcc=clang++
  [stdio] Dcc=clang++ -Duseithreads
  [stdio] Dcc=clang++ -Duse64bitall
  [stdio] Dcc=clang++ DEBUGGING
  [stdio] Dcc=clang++ -Duseithreads -Duse64bitall
~~ ../dist/Module-CoreList/t/maintainer.t ...................... FAILED 4-5 Non-zero exit status: 2
  [stdio] Dcc=clang++ -Duseithreads -Duse64bitall DEBUGGING
  [stdio] Dcc=clang++ -Duseithreads DEBUGGING
  [stdio] Dcc=clang++ -Duse64bitall DEBUGGING
  [stdio] Dcc=clang++
  [stdio] Dcc=clang++ -Duseithreads
  [stdio] Dcc=clang++ -Duse64bitall
  [stdio] Dcc=clang++ DEBUGGING
  [stdio] Dcc=clang++ -Duseithreads -Duse64bitall
~~ ../t/porting/podcheck.t ..................................... FAILED 292
  [stdio] Dcc=clang++ -Duseithreads -Duse64bitall DEBUGGING
  [stdio] Dcc=clang++ -Duseithreads DEBUGGING
  [stdio] Dcc=clang++ -Duse64bitall DEBUGGING
  [stdio] Dcc=clang++
  [stdio] Dcc=clang++ -Duseithreads
  [stdio] Dcc=clang++ -Duse64bitall
  [stdio] Dcc=clang++ DEBUGGING
  [stdio] Dcc=clang++ -Duseithreads -Duse64bitall
~~ ../t/porting/corelist.t ..................................... FAILED 3-5
  [stdio] Dcc=clang++ -Duseithreads -Duse64bitall DEBUGGING
  [stdio] Dcc=clang++ -Duseithreads DEBUGGING
  [stdio] Dcc=clang++ -Duse64bitall DEBUGGING
  [stdio] Dcc=clang++
  [stdio] Dcc=clang++ -Duseithreads
  [stdio] Dcc=clang++ -Duse64bitall
  [stdio] Dcc=clang++ DEBUGGING
  [stdio] Dcc=clang++ -Duseithreads -Duse64bitall
~~ ../dist/Module-CoreList/t/is_core.t ......................... FAILED 2 Non-zero exit status: 2
  [stdio] Dcc=clang++ -Duseithreads -Duse64bitall DEBUGGING
  [stdio] Dcc=clang++ -Duseithreads DEBUGGING
  [stdio] Dcc=clang++ -Duse64bitall DEBUGGING
  [stdio] Dcc=clang++
  [stdio] Dcc=clang++ -Duseithreads
  [stdio] Dcc=clang++ -Duse64bitall
  [stdio] Dcc=clang++ DEBUGGING
  [stdio] Dcc=clang++ -Duseithreads -Duse64bitall
~~ ../dist/Devel-PPPort/t/uv.t ................................. FAILED 25
  [stdio] Dcc=clang++ -Duseithreads -Duse64bitall DEBUGGING
  [stdio] Dcc=clang++ -Duseithreads DEBUGGING
  [stdio] Dcc=clang++ -Duse64bitall DEBUGGING
  [stdio] Dcc=clang++
  [stdio] Dcc=clang++ -Duseithreads
  [stdio] Dcc=clang++ -Duse64bitall
  [stdio] Dcc=clang++ DEBUGGING
  [stdio] Dcc=clang++ -Duseithreads -Duse64bitall

Test todo-passed:

MANIFEST messages:

Compiler messages:
  Encode.c:1356:5: warning: unused variable 'ix' [-Wunused-variable]
  ../../XSUB.h:185:20: note: expanded from macro 'dXSI32'
  Encode.c:1398:5: warning: unused variable 'ix' [-Wunused-variable]

About this smoke:
    smoking-perl: 5.26.1
  smoker-version: 1.71/0.046
       timestamp: 2019-06-21 03:17:05+00
          tester: core

-- 
Report generated by Test::Smoke::Gateway v0.09_01