Show logfile
Automated smoke report for branch blead 5.31.1 patch 7c21f0042bbf5d88b72d07661d64903e627ccf29 v5.31.0-141-g7c21f0042b
r9: PA8900 (PA-RISC2.0/64/1 cpus)
    on        HP-UX B.11.11/64
    using     cc version B.11.11.18 (*1)
    smoketime 2 days 53 minutes (average 6 hours 6 minutes)

Summary: FAIL(F)

O = OK  F = Failure(s), extended report at the bottom
X = Failure(s) under TEST but not under harness
? = still running or test results not (yet) available
Build failures during:       - = unknown or N/A
c = Configure, m = make, M = make (after miniperl), t = make test-prep

v5.31.0-141-g7c21f0042b
---------------------- ----------------------------------------------------
F  F  F  F  F  F         (*1)
F  F  F  F  F  F        -Duse64bitall (*1)
F  F  F  F  F  F        -Duseithreads (*1)
F  F  F  F  F  F        -Duseithreads -Duse64bitall (*1)
|  |  |  |  |  |
|  |  |  |  |  +------  locale:univ.utf8 DEBUGGING
|  |  |  |  +---------  perlio DEBUGGING
|  |  |  +------------  stdio DEBUGGING
|  |  +---------------  locale:univ.utf8
|  +------------------  perlio
+---------------------  stdio

Applied patches:
  SMOKE7c21f0042bbf5d88b72d07661d64903e627ccf29

Skipped tests:
  None

Test failures:
~~ ../cpan/Pod-Simple/t/JustPod_corpus.t ....................... FAILED Non-zero exit status: 255 Bad plan.  You planned 16 tests but ran 5.
  [locale:univ.utf8] 
  [locale:univ.utf8] -Duseithreads DEBUGGING
  [locale:univ.utf8] -Duseithreads -Duse64bitall DEBUGGING
  [locale:univ.utf8] -Duse64bitall DEBUGGING
  [locale:univ.utf8]  DEBUGGING
  [locale:univ.utf8] -Duseithreads
  [locale:univ.utf8] -Duse64bitall
  [locale:univ.utf8] -Duseithreads -Duse64bitall
~~ ../lib/warnings.t ........................................... FAILED 769-770
  [stdio/perlio/locale:univ.utf8] 
  [stdio/perlio/locale:univ.utf8] -Duseithreads DEBUGGING
  [stdio/perlio/locale:univ.utf8]  DEBUGGING
  [stdio/perlio/locale:univ.utf8] -Duseithreads
~~ ../dist/Time-HiRes/t/alarm.t ................................ FAILED 8-9 Non-zero exit status: 2
  [perlio] -Duseithreads DEBUGGING
~~ ../t/re/fold_grind_8.t ...................................... FAILED No plan found in TAP output
  [perlio] -Duseithreads DEBUGGING
  [perlio]  DEBUGGING
~~ ../lib/warnings.t ........................................... FAILED 366 769-770
  [stdio/perlio/locale:univ.utf8] -Duseithreads -Duse64bitall DEBUGGING
  [stdio/perlio/locale:univ.utf8] -Duseithreads -Duse64bitall
  [stdio/perlio/locale:univ.utf8] -Duse64bitall DEBUGGING
  [stdio/perlio/locale:univ.utf8] -Duse64bitall
~~ ../t/io/nargv.t ............................................. FAILED Bad plan.  You planned 7 tests but ran 6.
  [locale:univ.utf8] -Duseithreads -Duse64bitall DEBUGGING
~~ ../cpan/Socket/t/Socket.t ................................... FAILED Non-zero exit status: 255 Bad plan.  You planned 6 tests but ran 2.
  [locale:univ.utf8] 
  [locale:univ.utf8] -Duseithreads DEBUGGING
  [locale:univ.utf8] -Duseithreads -Duse64bitall DEBUGGING
  [locale:univ.utf8] -Duse64bitall DEBUGGING
  [locale:univ.utf8]  DEBUGGING
  [locale:univ.utf8] -Duseithreads
  [locale:univ.utf8] -Duse64bitall
  [locale:univ.utf8] -Duseithreads -Duse64bitall
~~ ../lib/locale.t ............................................. FAILED 431-432 498
  [stdio/perlio/locale:univ.utf8] 
  [stdio/perlio/locale:univ.utf8] -Duseithreads DEBUGGING
  [stdio/perlio/locale:univ.utf8] -Duseithreads -Duse64bitall DEBUGGING
  [stdio/perlio/locale:univ.utf8] -Duse64bitall DEBUGGING
  [stdio/perlio/locale:univ.utf8]  DEBUGGING
  [stdio/perlio/locale:univ.utf8] -Duseithreads
  [stdio/perlio/locale:univ.utf8] -Duse64bitall
  [stdio/perlio/locale:univ.utf8] -Duseithreads -Duse64bitall
~~ ../t/io/argv.t .............................................. FAILED Bad plan.  You planned 37 tests but ran 10.
  [locale:univ.utf8] -Duseithreads -Duse64bitall DEBUGGING

Test todo-passed:
~~ ../lib/B/Deparse.t .......................................... PASSED 2
  [locale:univ.utf8] 
  [locale:univ.utf8] -Duseithreads DEBUGGING
  [locale:univ.utf8] -Duseithreads -Duse64bitall DEBUGGING
  [locale:univ.utf8] -Duse64bitall DEBUGGING
  [locale:univ.utf8]  DEBUGGING
  [locale:univ.utf8] -Duseithreads
  [locale:univ.utf8] -Duse64bitall
  [locale:univ.utf8] -Duseithreads -Duse64bitall
~~ ../dist/Net-Ping/t/450_service.t ............................ PASSED 9 18
  [stdio/perlio/locale:univ.utf8] 
  [stdio/perlio/locale:univ.utf8] -Duseithreads DEBUGGING
  [stdio/perlio/locale:univ.utf8] -Duseithreads -Duse64bitall DEBUGGING
  [stdio/perlio/locale:univ.utf8] -Duse64bitall DEBUGGING
  [stdio/perlio/locale:univ.utf8]  DEBUGGING
  [stdio/perlio/locale:univ.utf8] -Duseithreads
  [stdio/perlio/locale:univ.utf8] -Duse64bitall
  [stdio/perlio/locale:univ.utf8] -Duseithreads -Duse64bitall

MANIFEST messages:

Compiler messages:

About this smoke:
    smoking-perl: 5.14.2
  smoker-version: 1.72_06/0.046
       timestamp: 2019-06-08 20:00:08+00
          tester: merijn

Status overview available here: https://tux.nl/perl5/smoke/
-- 
Report generated by Test::Smoke::Gateway v0.09_01