Automated smoke report for branch blead 5.31.1 patch 0f3d8cd442f9b7ac5abd03743d2a372fa3d871d6 v5.31.0-35-g0f3d8cd442
localhost: aarch64 (aarch64/? cpus)
    on        linux 4.4.114
    using     cc version 4.2.1 Compatible Clang 8.0.0 (tags/RELEASE_800/final) (*1)
    smoketime 2 days 12 hours 1 minute (average 3 hours 45 minutes)

Summary: FAIL(F)

O = OK  F = Failure(s), extended report at the bottom
X = Failure(s) under TEST but not under harness
? = still running or test results not (yet) available
Build failures during:       - = unknown or N/A
c = Configure, m = make, M = make (after miniperl), t = make test-prep

v5.31.0-35-g0f3d8cd442
---------------------- ----------------------------------------------------
F  F  F  F              -Ud_newlocale -Alibpth="/system/lib /vendor/lib" (*1)
F  F  F  F              -Ud_newlocale -Alibpth="/system/lib /vendor/lib" -Duse64bitint (*1)
F  F  F  F              -Ud_newlocale -Alibpth="/system/lib /vendor/lib" -Duselongdouble (*1)
F  F  F  F              -Ud_newlocale -Alibpth="/system/lib /vendor/lib" -Dusemorebits (*1)
F  F  F  F              -Ud_newlocale -Alibpth="/system/lib /vendor/lib" -Duseithreads (*1)
F  F  F  F              -Ud_newlocale -Alibpth="/system/lib /vendor/lib" -Duseithreads -Duse64bitint (*1)
F  F  F  F              -Ud_newlocale -Alibpth="/system/lib /vendor/lib" -Duseithreads -Duselongdouble (*1)
F  F  F  F              -Ud_newlocale -Alibpth="/system/lib /vendor/lib" -Duseithreads -Dusemorebits (*1)
|  |  |  |
|  |  |  +------------  perlio DEBUGGING
|  |  +---------------  stdio DEBUGGING
|  +------------------  perlio
+---------------------  stdio

Applied patches:
  SMOKE0f3d8cd442f9b7ac5abd03743d2a372fa3d871d6

Skipped tests:
      # One test name on a line
      t/op/readline.t

Test failures:
~~ ../cpan/ExtUtils-MakeMaker/t/02-xsdynamic.t ................. FAILED 17 Non-zero exit status: 5
  [stdio/perlio] -Ud_newlocale -Alibpth="/system/lib /vendor/lib" -Duseithreads -Duse64bitint
  [stdio/perlio] -Ud_newlocale -Alibpth="/system/lib /vendor/lib" -Duselongdouble DEBUGGING
  [stdio/perlio] -Ud_newlocale -Alibpth="/system/lib /vendor/lib" -Duseithreads -Duselongdouble DEBUGGING
  [stdio/perlio] -Ud_newlocale -Alibpth="/system/lib /vendor/lib" -Duse64bitint DEBUGGING
  [stdio/perlio] -Ud_newlocale -Alibpth="/system/lib /vendor/lib" -Duseithreads DEBUGGING
  [stdio/perlio] -Ud_newlocale -Alibpth="/system/lib /vendor/lib" -Duse64bitint
  [stdio/perlio] -Ud_newlocale -Alibpth="/system/lib /vendor/lib"
  [stdio/perlio] -Ud_newlocale -Alibpth="/system/lib /vendor/lib" -Duseithreads
  [stdio/perlio] -Ud_newlocale -Alibpth="/system/lib /vendor/lib" DEBUGGING
  [stdio/perlio] -Ud_newlocale -Alibpth="/system/lib /vendor/lib" -Dusemorebits DEBUGGING
  [stdio/perlio] -Ud_newlocale -Alibpth="/system/lib /vendor/lib" -Duseithreads -Dusemorebits
  [stdio/perlio] -Ud_newlocale -Alibpth="/system/lib /vendor/lib" -Duseithreads -Dusemorebits DEBUGGING
  [stdio/perlio] -Ud_newlocale -Alibpth="/system/lib /vendor/lib" -Duseithreads -Duse64bitint DEBUGGING
  [stdio/perlio] -Ud_newlocale -Alibpth="/system/lib /vendor/lib" -Duselongdouble
  [stdio/perlio] -Ud_newlocale -Alibpth="/system/lib /vendor/lib" -Dusemorebits
  [stdio/perlio] -Ud_newlocale -Alibpth="/system/lib /vendor/lib" -Duseithreads -Duselongdouble
~~ ../cpan/Sys-Syslog/t/constants.t ............................ FAILED 1-3 25 45 65 85 Non-zero exit status: 46
  [stdio/perlio] -Ud_newlocale -Alibpth="/system/lib /vendor/lib" -Duseithreads -Duse64bitint
  [stdio/perlio] -Ud_newlocale -Alibpth="/system/lib /vendor/lib" -Duselongdouble DEBUGGING
  [stdio/perlio] -Ud_newlocale -Alibpth="/system/lib /vendor/lib" -Duseithreads -Duselongdouble DEBUGGING
  [stdio/perlio] -Ud_newlocale -Alibpth="/system/lib /vendor/lib" -Duse64bitint DEBUGGING
  [stdio/perlio] -Ud_newlocale -Alibpth="/system/lib /vendor/lib" -Duseithreads DEBUGGING
  [stdio/perlio] -Ud_newlocale -Alibpth="/system/lib /vendor/lib" -Duse64bitint
  [stdio/perlio] -Ud_newlocale -Alibpth="/system/lib /vendor/lib"
  [stdio/perlio] -Ud_newlocale -Alibpth="/system/lib /vendor/lib" -Duseithreads
  [stdio/perlio] -Ud_newlocale -Alibpth="/system/lib /vendor/lib" DEBUGGING
  [stdio/perlio] -Ud_newlocale -Alibpth="/system/lib /vendor/lib" -Dusemorebits DEBUGGING
  [stdio/perlio] -Ud_newlocale -Alibpth="/system/lib /vendor/lib" -Duseithreads -Dusemorebits
  [stdio/perlio] -Ud_newlocale -Alibpth="/system/lib /vendor/lib" -Duseithreads -Dusemorebits DEBUGGING
  [stdio/perlio] -Ud_newlocale -Alibpth="/system/lib /vendor/lib" -Duseithreads -Duse64bitint DEBUGGING
  [stdio/perlio] -Ud_newlocale -Alibpth="/system/lib /vendor/lib" -Duselongdouble
  [stdio/perlio] -Ud_newlocale -Alibpth="/system/lib /vendor/lib" -Dusemorebits
  [stdio/perlio] -Ud_newlocale -Alibpth="/system/lib /vendor/lib" -Duseithreads -Duselongdouble
~~ ../dist/Net-Ping/t/450_service.t ............................ FAILED Non-zero exit status: 255 Bad plan.  You planned 26 tests but ran 6.
  [stdio] -Ud_newlocale -Alibpth="/system/lib /vendor/lib" -Duseithreads -Duse64bitint
  [stdio] -Ud_newlocale -Alibpth="/system/lib /vendor/lib" -Duselongdouble DEBUGGING
  [stdio] -Ud_newlocale -Alibpth="/system/lib /vendor/lib" -Duseithreads -Duselongdouble DEBUGGING
  [stdio] -Ud_newlocale -Alibpth="/system/lib /vendor/lib" -Duse64bitint DEBUGGING
  [stdio] -Ud_newlocale -Alibpth="/system/lib /vendor/lib" -Duseithreads DEBUGGING
  [stdio] -Ud_newlocale -Alibpth="/system/lib /vendor/lib" -Duse64bitint
  [stdio] -Ud_newlocale -Alibpth="/system/lib /vendor/lib"
  [stdio] -Ud_newlocale -Alibpth="/system/lib /vendor/lib" -Duseithreads
  [stdio] -Ud_newlocale -Alibpth="/system/lib /vendor/lib" DEBUGGING
  [stdio] -Ud_newlocale -Alibpth="/system/lib /vendor/lib" -Dusemorebits DEBUGGING
  [stdio] -Ud_newlocale -Alibpth="/system/lib /vendor/lib" -Duseithreads -Dusemorebits
  [stdio] -Ud_newlocale -Alibpth="/system/lib /vendor/lib" -Duseithreads -Dusemorebits DEBUGGING
  [stdio] -Ud_newlocale -Alibpth="/system/lib /vendor/lib" -Duseithreads -Duse64bitint DEBUGGING
  [stdio] -Ud_newlocale -Alibpth="/system/lib /vendor/lib" -Duselongdouble
  [stdio] -Ud_newlocale -Alibpth="/system/lib /vendor/lib" -Dusemorebits
  [stdio] -Ud_newlocale -Alibpth="/system/lib /vendor/lib" -Duseithreads -Duselongdouble
~~ ../t/porting/test_bootstrap.t ............................... FAILED Non-zero exit status: 2
  [stdio/perlio] -Ud_newlocale -Alibpth="/system/lib /vendor/lib" -Duseithreads -Duse64bitint
  [stdio/perlio] -Ud_newlocale -Alibpth="/system/lib /vendor/lib" -Duselongdouble DEBUGGING
  [stdio/perlio] -Ud_newlocale -Alibpth="/system/lib /vendor/lib" -Duseithreads -Duselongdouble DEBUGGING
  [stdio/perlio] -Ud_newlocale -Alibpth="/system/lib /vendor/lib" -Duse64bitint DEBUGGING
  [stdio/perlio] -Ud_newlocale -Alibpth="/system/lib /vendor/lib" -Duseithreads DEBUGGING
  [stdio/perlio] -Ud_newlocale -Alibpth="/system/lib /vendor/lib" -Duse64bitint
  [stdio/perlio] -Ud_newlocale -Alibpth="/system/lib /vendor/lib"
  [stdio/perlio] -Ud_newlocale -Alibpth="/system/lib /vendor/lib" -Duseithreads
  [stdio/perlio] -Ud_newlocale -Alibpth="/system/lib /vendor/lib" DEBUGGING
  [stdio/perlio] -Ud_newlocale -Alibpth="/system/lib /vendor/lib" -Dusemorebits DEBUGGING
  [stdio/perlio] -Ud_newlocale -Alibpth="/system/lib /vendor/lib" -Duseithreads -Dusemorebits
  [stdio/perlio] -Ud_newlocale -Alibpth="/system/lib /vendor/lib" -Duseithreads -Dusemorebits DEBUGGING
  [stdio/perlio] -Ud_newlocale -Alibpth="/system/lib /vendor/lib" -Duseithreads -Duse64bitint DEBUGGING
  [stdio/perlio] -Ud_newlocale -Alibpth="/system/lib /vendor/lib" -Duselongdouble
  [stdio/perlio] -Ud_newlocale -Alibpth="/system/lib /vendor/lib" -Dusemorebits
  [stdio/perlio] -Ud_newlocale -Alibpth="/system/lib /vendor/lib" -Duseithreads -Duselongdouble
~~ ../ext/POSIX/t/math.t ....................................... FAILED 40 Non-zero exit status: 1
  [stdio/perlio] -Ud_newlocale -Alibpth="/system/lib /vendor/lib" -Duselongdouble DEBUGGING
  [stdio/perlio] -Ud_newlocale -Alibpth="/system/lib /vendor/lib" -Duseithreads -Duselongdouble DEBUGGING
  [stdio/perlio] -Ud_newlocale -Alibpth="/system/lib /vendor/lib" -Dusemorebits DEBUGGING
  [stdio/perlio] -Ud_newlocale -Alibpth="/system/lib /vendor/lib" -Duseithreads -Dusemorebits
  [stdio/perlio] -Ud_newlocale -Alibpth="/system/lib /vendor/lib" -Duseithreads -Dusemorebits DEBUGGING
  [stdio/perlio] -Ud_newlocale -Alibpth="/system/lib /vendor/lib" -Duselongdouble
  [stdio/perlio] -Ud_newlocale -Alibpth="/system/lib /vendor/lib" -Dusemorebits
  [stdio/perlio] -Ud_newlocale -Alibpth="/system/lib /vendor/lib" -Duseithreads -Duselongdouble
~~ ../dist/Net-Ping/t/010_pingecho.t ........................... FAILED Non-zero exit status: 255 Bad plan.  You planned 2 tests but ran 1.
  [stdio/perlio] -Ud_newlocale -Alibpth="/system/lib /vendor/lib" -Duseithreads -Duse64bitint
  [stdio/perlio] -Ud_newlocale -Alibpth="/system/lib /vendor/lib" -Duselongdouble DEBUGGING
  [stdio/perlio] -Ud_newlocale -Alibpth="/system/lib /vendor/lib" -Duseithreads -Duselongdouble DEBUGGING
  [stdio/perlio] -Ud_newlocale -Alibpth="/system/lib /vendor/lib" -Duse64bitint DEBUGGING
  [stdio/perlio] -Ud_newlocale -Alibpth="/system/lib /vendor/lib" -Duseithreads DEBUGGING
  [stdio/perlio] -Ud_newlocale -Alibpth="/system/lib /vendor/lib" -Duse64bitint
  [stdio/perlio] -Ud_newlocale -Alibpth="/system/lib /vendor/lib"
  [stdio/perlio] -Ud_newlocale -Alibpth="/system/lib /vendor/lib" -Duseithreads
  [stdio/perlio] -Ud_newlocale -Alibpth="/system/lib /vendor/lib" DEBUGGING
  [stdio/perlio] -Ud_newlocale -Alibpth="/system/lib /vendor/lib" -Dusemorebits DEBUGGING
  [stdio/perlio] -Ud_newlocale -Alibpth="/system/lib /vendor/lib" -Duseithreads -Dusemorebits
  [stdio/perlio] -Ud_newlocale -Alibpth="/system/lib /vendor/lib" -Duseithreads -Dusemorebits DEBUGGING
  [stdio/perlio] -Ud_newlocale -Alibpth="/system/lib /vendor/lib" -Duseithreads -Duse64bitint DEBUGGING
  [stdio/perlio] -Ud_newlocale -Alibpth="/system/lib /vendor/lib" -Duselongdouble
  [stdio/perlio] -Ud_newlocale -Alibpth="/system/lib /vendor/lib" -Dusemorebits
  [stdio/perlio] -Ud_newlocale -Alibpth="/system/lib /vendor/lib" -Duseithreads -Duselongdouble
~~ ../t/porting/manifest.t ..................................... FAILED 9582
  [stdio/perlio] -Ud_newlocale -Alibpth="/system/lib /vendor/lib" -Duseithreads -Duse64bitint
  [stdio/perlio] -Ud_newlocale -Alibpth="/system/lib /vendor/lib" -Duselongdouble DEBUGGING
  [stdio/perlio] -Ud_newlocale -Alibpth="/system/lib /vendor/lib" -Duseithreads -Duselongdouble DEBUGGING
  [stdio/perlio] -Ud_newlocale -Alibpth="/system/lib /vendor/lib" -Duse64bitint DEBUGGING
  [stdio/perlio] -Ud_newlocale -Alibpth="/system/lib /vendor/lib" -Duseithreads DEBUGGING
  [stdio/perlio] -Ud_newlocale -Alibpth="/system/lib /vendor/lib" -Duse64bitint
  [stdio/perlio] -Ud_newlocale -Alibpth="/system/lib /vendor/lib"
  [stdio/perlio] -Ud_newlocale -Alibpth="/system/lib /vendor/lib" -Duseithreads
  [stdio/perlio] -Ud_newlocale -Alibpth="/system/lib /vendor/lib" DEBUGGING
  [stdio/perlio] -Ud_newlocale -Alibpth="/system/lib /vendor/lib" -Dusemorebits DEBUGGING
  [stdio/perlio] -Ud_newlocale -Alibpth="/system/lib /vendor/lib" -Duseithreads -Dusemorebits
  [stdio/perlio] -Ud_newlocale -Alibpth="/system/lib /vendor/lib" -Duseithreads -Dusemorebits DEBUGGING
  [stdio/perlio] -Ud_newlocale -Alibpth="/system/lib /vendor/lib" -Duseithreads -Duse64bitint DEBUGGING
  [stdio/perlio] -Ud_newlocale -Alibpth="/system/lib /vendor/lib" -Duselongdouble
  [stdio/perlio] -Ud_newlocale -Alibpth="/system/lib /vendor/lib" -Dusemorebits
  [stdio/perlio] -Ud_newlocale -Alibpth="/system/lib /vendor/lib" -Duseithreads -Duselongdouble
~~ ../cpan/Sys-Syslog/t/00-load.t .............................. FAILED 1 Non-zero exit status: 1
  [stdio/perlio] -Ud_newlocale -Alibpth="/system/lib /vendor/lib" -Duseithreads -Duse64bitint
  [stdio/perlio] -Ud_newlocale -Alibpth="/system/lib /vendor/lib" -Duselongdouble DEBUGGING
  [stdio/perlio] -Ud_newlocale -Alibpth="/system/lib /vendor/lib" -Duseithreads -Duselongdouble DEBUGGING
  [stdio/perlio] -Ud_newlocale -Alibpth="/system/lib /vendor/lib" -Duse64bitint DEBUGGING
  [stdio/perlio] -Ud_newlocale -Alibpth="/system/lib /vendor/lib" -Duseithreads DEBUGGING
  [stdio/perlio] -Ud_newlocale -Alibpth="/system/lib /vendor/lib" -Duse64bitint
  [stdio/perlio] -Ud_newlocale -Alibpth="/system/lib /vendor/lib"
  [stdio/perlio] -Ud_newlocale -Alibpth="/system/lib /vendor/lib" -Duseithreads
  [stdio/perlio] -Ud_newlocale -Alibpth="/system/lib /vendor/lib" DEBUGGING
  [stdio/perlio] -Ud_newlocale -Alibpth="/system/lib /vendor/lib" -Dusemorebits DEBUGGING
  [stdio/perlio] -Ud_newlocale -Alibpth="/system/lib /vendor/lib" -Duseithreads -Dusemorebits
  [stdio/perlio] -Ud_newlocale -Alibpth="/system/lib /vendor/lib" -Duseithreads -Dusemorebits DEBUGGING
  [stdio/perlio] -Ud_newlocale -Alibpth="/system/lib /vendor/lib" -Duseithreads -Duse64bitint DEBUGGING
  [stdio/perlio] -Ud_newlocale -Alibpth="/system/lib /vendor/lib" -Duselongdouble
  [stdio/perlio] -Ud_newlocale -Alibpth="/system/lib /vendor/lib" -Dusemorebits
  [stdio/perlio] -Ud_newlocale -Alibpth="/system/lib /vendor/lib" -Duseithreads -Duselongdouble
~~ ../dist/Net-Ping/t/450_service.t ............................ FAILED Non-zero exit status: 29 Bad plan.  You planned 26 tests but ran 6.
  [perlio] -Ud_newlocale -Alibpth="/system/lib /vendor/lib" -Duseithreads -Duse64bitint
  [perlio] -Ud_newlocale -Alibpth="/system/lib /vendor/lib" -Duselongdouble DEBUGGING
  [perlio] -Ud_newlocale -Alibpth="/system/lib /vendor/lib" -Duseithreads -Duselongdouble DEBUGGING
  [perlio] -Ud_newlocale -Alibpth="/system/lib /vendor/lib" -Duse64bitint DEBUGGING
  [perlio] -Ud_newlocale -Alibpth="/system/lib /vendor/lib" -Duseithreads DEBUGGING
  [perlio] -Ud_newlocale -Alibpth="/system/lib /vendor/lib" -Duse64bitint
  [perlio] -Ud_newlocale -Alibpth="/system/lib /vendor/lib"
  [perlio] -Ud_newlocale -Alibpth="/system/lib /vendor/lib" -Duseithreads
  [perlio] -Ud_newlocale -Alibpth="/system/lib /vendor/lib" DEBUGGING
  [perlio] -Ud_newlocale -Alibpth="/system/lib /vendor/lib" -Dusemorebits DEBUGGING
  [perlio] -Ud_newlocale -Alibpth="/system/lib /vendor/lib" -Duseithreads -Dusemorebits
  [perlio] -Ud_newlocale -Alibpth="/system/lib /vendor/lib" -Duseithreads -Dusemorebits DEBUGGING
  [perlio] -Ud_newlocale -Alibpth="/system/lib /vendor/lib" -Duseithreads -Duse64bitint DEBUGGING
  [perlio] -Ud_newlocale -Alibpth="/system/lib /vendor/lib" -Duselongdouble
  [perlio] -Ud_newlocale -Alibpth="/system/lib /vendor/lib" -Dusemorebits
  [perlio] -Ud_newlocale -Alibpth="/system/lib /vendor/lib" -Duseithreads -Duselongdouble
~~ ../dist/Net-Ping/t/130_tcp_inst.t ........................... FAILED Non-zero exit status: 255 Bad plan.  You planned 2 tests but ran 1.
  [stdio/perlio] -Ud_newlocale -Alibpth="/system/lib /vendor/lib" -Duseithreads -Duse64bitint
  [stdio/perlio] -Ud_newlocale -Alibpth="/system/lib /vendor/lib" -Duselongdouble DEBUGGING
  [stdio/perlio] -Ud_newlocale -Alibpth="/system/lib /vendor/lib" -Duseithreads -Duselongdouble DEBUGGING
  [stdio/perlio] -Ud_newlocale -Alibpth="/system/lib /vendor/lib" -Duse64bitint DEBUGGING
  [stdio/perlio] -Ud_newlocale -Alibpth="/system/lib /vendor/lib" -Duseithreads DEBUGGING
  [stdio/perlio] -Ud_newlocale -Alibpth="/system/lib /vendor/lib" -Duse64bitint
  [stdio/perlio] -Ud_newlocale -Alibpth="/system/lib /vendor/lib"
  [stdio/perlio] -Ud_newlocale -Alibpth="/system/lib /vendor/lib" -Duseithreads
  [stdio/perlio] -Ud_newlocale -Alibpth="/system/lib /vendor/lib" DEBUGGING
  [stdio/perlio] -Ud_newlocale -Alibpth="/system/lib /vendor/lib" -Dusemorebits DEBUGGING
  [stdio/perlio] -Ud_newlocale -Alibpth="/system/lib /vendor/lib" -Duseithreads -Dusemorebits
  [stdio/perlio] -Ud_newlocale -Alibpth="/system/lib /vendor/lib" -Duseithreads -Dusemorebits DEBUGGING
  [stdio/perlio] -Ud_newlocale -Alibpth="/system/lib /vendor/lib" -Duseithreads -Duse64bitint DEBUGGING
  [stdio/perlio] -Ud_newlocale -Alibpth="/system/lib /vendor/lib" -Duselongdouble
  [stdio/perlio] -Ud_newlocale -Alibpth="/system/lib /vendor/lib" -Dusemorebits
  [stdio/perlio] -Ud_newlocale -Alibpth="/system/lib /vendor/lib" -Duseithreads -Duselongdouble
~~ ../dist/Net-Ping/t/510_ping_udp.t ........................... FAILED Non-zero exit status: 255 Bad plan.  You planned 3 tests but ran 1.
  [stdio/perlio] -Ud_newlocale -Alibpth="/system/lib /vendor/lib" -Duseithreads -Duse64bitint
  [stdio/perlio] -Ud_newlocale -Alibpth="/system/lib /vendor/lib" -Duselongdouble DEBUGGING
  [stdio/perlio] -Ud_newlocale -Alibpth="/system/lib /vendor/lib" -Duseithreads -Duselongdouble DEBUGGING
  [stdio/perlio] -Ud_newlocale -Alibpth="/system/lib /vendor/lib" -Duse64bitint DEBUGGING
  [stdio/perlio] -Ud_newlocale -Alibpth="/system/lib /vendor/lib" -Duseithreads DEBUGGING
  [stdio/perlio] -Ud_newlocale -Alibpth="/system/lib /vendor/lib" -Duse64bitint
  [stdio/perlio] -Ud_newlocale -Alibpth="/system/lib /vendor/lib"
  [stdio/perlio] -Ud_newlocale -Alibpth="/system/lib /vendor/lib" -Duseithreads
  [stdio/perlio] -Ud_newlocale -Alibpth="/system/lib /vendor/lib" DEBUGGING
  [stdio/perlio] -Ud_newlocale -Alibpth="/system/lib /vendor/lib" -Dusemorebits DEBUGGING
  [stdio/perlio] -Ud_newlocale -Alibpth="/system/lib /vendor/lib" -Duseithreads -Dusemorebits
  [stdio/perlio] -Ud_newlocale -Alibpth="/system/lib /vendor/lib" -Duseithreads -Dusemorebits DEBUGGING
  [stdio/perlio] -Ud_newlocale -Alibpth="/system/lib /vendor/lib" -Duseithreads -Duse64bitint DEBUGGING
  [stdio/perlio] -Ud_newlocale -Alibpth="/system/lib /vendor/lib" -Duselongdouble
  [stdio/perlio] -Ud_newlocale -Alibpth="/system/lib /vendor/lib" -Dusemorebits
  [stdio/perlio] -Ud_newlocale -Alibpth="/system/lib /vendor/lib" -Duseithreads -Duselongdouble
~~ ../dist/Net-Ping/t/150_syn_inst.t ........................... FAILED Non-zero exit status: 255 Bad plan.  You planned 2 tests but ran 1.
  [stdio/perlio] -Ud_newlocale -Alibpth="/system/lib /vendor/lib" -Duseithreads -Duse64bitint
  [stdio/perlio] -Ud_newlocale -Alibpth="/system/lib /vendor/lib" -Duselongdouble DEBUGGING
  [stdio/perlio] -Ud_newlocale -Alibpth="/system/lib /vendor/lib" -Duseithreads -Duselongdouble DEBUGGING
  [stdio/perlio] -Ud_newlocale -Alibpth="/system/lib /vendor/lib" -Duse64bitint DEBUGGING
  [stdio/perlio] -Ud_newlocale -Alibpth="/system/lib /vendor/lib" -Duseithreads DEBUGGING
  [stdio/perlio] -Ud_newlocale -Alibpth="/system/lib /vendor/lib" -Duse64bitint
  [stdio/perlio] -Ud_newlocale -Alibpth="/system/lib /vendor/lib"
  [stdio/perlio] -Ud_newlocale -Alibpth="/system/lib /vendor/lib" -Duseithreads
  [stdio/perlio] -Ud_newlocale -Alibpth="/system/lib /vendor/lib" DEBUGGING
  [stdio/perlio] -Ud_newlocale -Alibpth="/system/lib /vendor/lib" -Dusemorebits DEBUGGING
  [stdio/perlio] -Ud_newlocale -Alibpth="/system/lib /vendor/lib" -Duseithreads -Dusemorebits
  [stdio/perlio] -Ud_newlocale -Alibpth="/system/lib /vendor/lib" -Duseithreads -Dusemorebits DEBUGGING
  [stdio/perlio] -Ud_newlocale -Alibpth="/system/lib /vendor/lib" -Duseithreads -Duse64bitint DEBUGGING
  [stdio/perlio] -Ud_newlocale -Alibpth="/system/lib /vendor/lib" -Duselongdouble
  [stdio/perlio] -Ud_newlocale -Alibpth="/system/lib /vendor/lib" -Dusemorebits
  [stdio/perlio] -Ud_newlocale -Alibpth="/system/lib /vendor/lib" -Duseithreads -Duselongdouble
~~ ../cpan/Sys-Syslog/t/syslog.t ............................... FAILED 1 Non-zero exit status: 2 Bad plan.  You planned 225 tests but ran 9.
  [stdio/perlio] -Ud_newlocale -Alibpth="/system/lib /vendor/lib" -Duseithreads -Duse64bitint
  [stdio/perlio] -Ud_newlocale -Alibpth="/system/lib /vendor/lib" -Duselongdouble DEBUGGING
  [stdio/perlio] -Ud_newlocale -Alibpth="/system/lib /vendor/lib" -Duseithreads -Duselongdouble DEBUGGING
  [stdio/perlio] -Ud_newlocale -Alibpth="/system/lib /vendor/lib" -Duse64bitint DEBUGGING
  [stdio/perlio] -Ud_newlocale -Alibpth="/system/lib /vendor/lib" -Duseithreads DEBUGGING
  [stdio/perlio] -Ud_newlocale -Alibpth="/system/lib /vendor/lib" -Duse64bitint
  [stdio/perlio] -Ud_newlocale -Alibpth="/system/lib /vendor/lib"
  [stdio/perlio] -Ud_newlocale -Alibpth="/system/lib /vendor/lib" -Duseithreads
  [stdio/perlio] -Ud_newlocale -Alibpth="/system/lib /vendor/lib" DEBUGGING
  [stdio/perlio] -Ud_newlocale -Alibpth="/system/lib /vendor/lib" -Dusemorebits DEBUGGING
  [stdio/perlio] -Ud_newlocale -Alibpth="/system/lib /vendor/lib" -Duseithreads -Dusemorebits
  [stdio/perlio] -Ud_newlocale -Alibpth="/system/lib /vendor/lib" -Duseithreads -Dusemorebits DEBUGGING
  [stdio/perlio] -Ud_newlocale -Alibpth="/system/lib /vendor/lib" -Duseithreads -Duse64bitint DEBUGGING
  [stdio/perlio] -Ud_newlocale -Alibpth="/system/lib /vendor/lib" -Duselongdouble
  [stdio/perlio] -Ud_newlocale -Alibpth="/system/lib /vendor/lib" -Dusemorebits
  [stdio/perlio] -Ud_newlocale -Alibpth="/system/lib /vendor/lib" -Duseithreads -Duselongdouble
~~ ../dist/Net-Ping/t/001_new.t ................................ FAILED Non-zero exit status: 255
  [stdio/perlio] -Ud_newlocale -Alibpth="/system/lib /vendor/lib" -Duseithreads -Duse64bitint
  [stdio/perlio] -Ud_newlocale -Alibpth="/system/lib /vendor/lib" -Duselongdouble DEBUGGING
  [stdio/perlio] -Ud_newlocale -Alibpth="/system/lib /vendor/lib" -Duseithreads -Duselongdouble DEBUGGING
  [stdio/perlio] -Ud_newlocale -Alibpth="/system/lib /vendor/lib" -Duse64bitint DEBUGGING
  [stdio/perlio] -Ud_newlocale -Alibpth="/system/lib /vendor/lib" -Duseithreads DEBUGGING
  [stdio/perlio] -Ud_newlocale -Alibpth="/system/lib /vendor/lib" -Duse64bitint
  [stdio/perlio] -Ud_newlocale -Alibpth="/system/lib /vendor/lib"
  [stdio/perlio] -Ud_newlocale -Alibpth="/system/lib /vendor/lib" -Duseithreads
  [stdio/perlio] -Ud_newlocale -Alibpth="/system/lib /vendor/lib" DEBUGGING
  [stdio/perlio] -Ud_newlocale -Alibpth="/system/lib /vendor/lib" -Dusemorebits DEBUGGING
  [stdio/perlio] -Ud_newlocale -Alibpth="/system/lib /vendor/lib" -Duseithreads -Dusemorebits
  [stdio/perlio] -Ud_newlocale -Alibpth="/system/lib /vendor/lib" -Duseithreads -Dusemorebits DEBUGGING
  [stdio/perlio] -Ud_newlocale -Alibpth="/system/lib /vendor/lib" -Duseithreads -Duse64bitint DEBUGGING
  [stdio/perlio] -Ud_newlocale -Alibpth="/system/lib /vendor/lib" -Duselongdouble
  [stdio/perlio] -Ud_newlocale -Alibpth="/system/lib /vendor/lib" -Dusemorebits
  [stdio/perlio] -Ud_newlocale -Alibpth="/system/lib /vendor/lib" -Duseithreads -Duselongdouble
~~ ../dist/Net-Ping/t/120_udp_inst.t ........................... FAILED Non-zero exit status: 255 Bad plan.  You planned 2 tests but ran 1.
  [stdio/perlio] -Ud_newlocale -Alibpth="/system/lib /vendor/lib" -Duseithreads -Duse64bitint
  [stdio/perlio] -Ud_newlocale -Alibpth="/system/lib /vendor/lib" -Duselongdouble DEBUGGING
  [stdio/perlio] -Ud_newlocale -Alibpth="/system/lib /vendor/lib" -Duseithreads -Duselongdouble DEBUGGING
  [stdio/perlio] -Ud_newlocale -Alibpth="/system/lib /vendor/lib" -Duse64bitint DEBUGGING
  [stdio/perlio] -Ud_newlocale -Alibpth="/system/lib /vendor/lib" -Duseithreads DEBUGGING
  [stdio/perlio] -Ud_newlocale -Alibpth="/system/lib /vendor/lib" -Duse64bitint
  [stdio/perlio] -Ud_newlocale -Alibpth="/system/lib /vendor/lib"
  [stdio/perlio] -Ud_newlocale -Alibpth="/system/lib /vendor/lib" -Duseithreads
  [stdio/perlio] -Ud_newlocale -Alibpth="/system/lib /vendor/lib" DEBUGGING
  [stdio/perlio] -Ud_newlocale -Alibpth="/system/lib /vendor/lib" -Dusemorebits DEBUGGING
  [stdio/perlio] -Ud_newlocale -Alibpth="/system/lib /vendor/lib" -Duseithreads -Dusemorebits
  [stdio/perlio] -Ud_newlocale -Alibpth="/system/lib /vendor/lib" -Duseithreads -Dusemorebits DEBUGGING
  [stdio/perlio] -Ud_newlocale -Alibpth="/system/lib /vendor/lib" -Duseithreads -Duse64bitint DEBUGGING
  [stdio/perlio] -Ud_newlocale -Alibpth="/system/lib /vendor/lib" -Duselongdouble
  [stdio/perlio] -Ud_newlocale -Alibpth="/system/lib /vendor/lib" -Dusemorebits
  [stdio/perlio] -Ud_newlocale -Alibpth="/system/lib /vendor/lib" -Duseithreads -Duselongdouble
~~ ../cpan/Sys-Syslog/t/facilities-routing.t ................... FAILED Non-zero exit status: 2 No plan found in TAP output
  [stdio/perlio] -Ud_newlocale -Alibpth="/system/lib /vendor/lib" -Duseithreads -Duse64bitint
  [stdio/perlio] -Ud_newlocale -Alibpth="/system/lib /vendor/lib" -Duselongdouble DEBUGGING
  [stdio/perlio] -Ud_newlocale -Alibpth="/system/lib /vendor/lib" -Duseithreads -Duselongdouble DEBUGGING
  [stdio/perlio] -Ud_newlocale -Alibpth="/system/lib /vendor/lib" -Duse64bitint DEBUGGING
  [stdio/perlio] -Ud_newlocale -Alibpth="/system/lib /vendor/lib" -Duseithreads DEBUGGING
  [stdio/perlio] -Ud_newlocale -Alibpth="/system/lib /vendor/lib" -Duse64bitint
  [stdio/perlio] -Ud_newlocale -Alibpth="/system/lib /vendor/lib"
  [stdio/perlio] -Ud_newlocale -Alibpth="/system/lib /vendor/lib" -Duseithreads
  [stdio/perlio] -Ud_newlocale -Alibpth="/system/lib /vendor/lib" DEBUGGING
  [stdio/perlio] -Ud_newlocale -Alibpth="/system/lib /vendor/lib" -Dusemorebits DEBUGGING
  [stdio/perlio] -Ud_newlocale -Alibpth="/system/lib /vendor/lib" -Duseithreads -Dusemorebits
  [stdio/perlio] -Ud_newlocale -Alibpth="/system/lib /vendor/lib" -Duseithreads -Dusemorebits DEBUGGING
  [stdio/perlio] -Ud_newlocale -Alibpth="/system/lib /vendor/lib" -Duseithreads -Duse64bitint DEBUGGING
  [stdio/perlio] -Ud_newlocale -Alibpth="/system/lib /vendor/lib" -Duselongdouble
  [stdio/perlio] -Ud_newlocale -Alibpth="/system/lib /vendor/lib" -Dusemorebits
  [stdio/perlio] -Ud_newlocale -Alibpth="/system/lib /vendor/lib" -Duseithreads -Duselongdouble
~~ ../dist/Net-Ping/t/140_stream_inst.t ........................ FAILED Non-zero exit status: 255 Bad plan.  You planned 2 tests but ran 1.
  [stdio/perlio] -Ud_newlocale -Alibpth="/system/lib /vendor/lib" -Duseithreads -Duse64bitint
  [stdio/perlio] -Ud_newlocale -Alibpth="/system/lib /vendor/lib" -Duselongdouble DEBUGGING
  [stdio/perlio] -Ud_newlocale -Alibpth="/system/lib /vendor/lib" -Duseithreads -Duselongdouble DEBUGGING
  [stdio/perlio] -Ud_newlocale -Alibpth="/system/lib /vendor/lib" -Duse64bitint DEBUGGING
  [stdio/perlio] -Ud_newlocale -Alibpth="/system/lib /vendor/lib" -Duseithreads DEBUGGING
  [stdio/perlio] -Ud_newlocale -Alibpth="/system/lib /vendor/lib" -Duse64bitint
  [stdio/perlio] -Ud_newlocale -Alibpth="/system/lib /vendor/lib"
  [stdio/perlio] -Ud_newlocale -Alibpth="/system/lib /vendor/lib" -Duseithreads
  [stdio/perlio] -Ud_newlocale -Alibpth="/system/lib /vendor/lib" DEBUGGING
  [stdio/perlio] -Ud_newlocale -Alibpth="/system/lib /vendor/lib" -Dusemorebits DEBUGGING
  [stdio/perlio] -Ud_newlocale -Alibpth="/system/lib /vendor/lib" -Duseithreads -Dusemorebits
  [stdio/perlio] -Ud_newlocale -Alibpth="/system/lib /vendor/lib" -Duseithreads -Dusemorebits DEBUGGING
  [stdio/perlio] -Ud_newlocale -Alibpth="/system/lib /vendor/lib" -Duseithreads -Duse64bitint DEBUGGING
  [stdio/perlio] -Ud_newlocale -Alibpth="/system/lib /vendor/lib" -Duselongdouble
  [stdio/perlio] -Ud_newlocale -Alibpth="/system/lib /vendor/lib" -Dusemorebits
  [stdio/perlio] -Ud_newlocale -Alibpth="/system/lib /vendor/lib" -Duseithreads -Duselongdouble
~~ ../t/op/groups.t ............................................ FAILED 1
  [stdio/perlio] -Ud_newlocale -Alibpth="/system/lib /vendor/lib" -Duseithreads -Duse64bitint
  [stdio/perlio] -Ud_newlocale -Alibpth="/system/lib /vendor/lib" -Duseithreads -Duselongdouble DEBUGGING
  [stdio/perlio] -Ud_newlocale -Alibpth="/system/lib /vendor/lib" -Duseithreads
  [stdio/perlio] -Ud_newlocale -Alibpth="/system/lib /vendor/lib" -Duseithreads -Dusemorebits
  [stdio/perlio] -Ud_newlocale -Alibpth="/system/lib /vendor/lib" -Duseithreads -Dusemorebits DEBUGGING
  [stdio/perlio] -Ud_newlocale -Alibpth="/system/lib /vendor/lib" -Duseithreads -Duse64bitint DEBUGGING
  [stdio/perlio] -Ud_newlocale -Alibpth="/system/lib /vendor/lib" -Duseithreads DEBUGGING
  [stdio/perlio] -Ud_newlocale -Alibpth="/system/lib /vendor/lib" -Duseithreads -Duselongdouble

Test todo-passed:

MANIFEST messages:

Compiler messages:
  awk: cmd. line:1: warning: regexp escape sequence `\=' is not a known regexp operator
  sv.c:12490:41: warning: adding 'int' to a string does not append to the string [-Wstring-plus-int]
  ./handy.h:508:37: note: expanded from macro 'strnEQ'
  sv.c:12490:41: note: use array indexing to silence this warning
  pp_sys.c:4114:11: warning: implicit declaration of function 'seekdir' is invalid in C99 [-Wimplicit-function-declaration]
  ./iperlsys.h:446:33: note: expanded from macro 'PerlDir_seek'
  pp_sys.c:5359:2: warning: implicit declaration of function 'setpwent' is invalid in C99 [-Wimplicit-function-declaration]
  doio.c:261:2: warning: implicit declaration of function 'mkostemp' is invalid in C99 [-Wimplicit-function-declaration]
  ./util.h:250:45: note: expanded from macro 'Perl_my_mkostemp'
  doio.c:281:2: warning: implicit declaration of function 'pipe2' is invalid in C99 [-Wimplicit-function-declaration]
  doio.c:2749:15: warning: implicit declaration of function 'futimes' is invalid in C99 [-Wimplicit-function-declaration]
  doio.c:2901:9: warning: implicit declaration of function 'msgget' is invalid in C99 [-Wimplicit-function-declaration]
  doio.c:2890:9: warning: unused variable 'nsv' [-Wunused-variable]
  doio.c:3013:8: warning: implicit declaration of function 'msgctl' is invalid in C99 [-Wimplicit-function-declaration]
  doio.c:3071:14: warning: implicit declaration of function 'msgsnd' is invalid in C99 [-Wimplicit-function-declaration]
  doio.c:3109:15: warning: implicit declaration of function 'msgrcv' is invalid in C99 [-Wimplicit-function-declaration]
  doio.c:3131:26: warning: unused parameter 'mark' [-Wunused-parameter]
  doio.c:3131:37: warning: unused parameter 'sp' [-Wunused-parameter]
  doio.c:3176:25: warning: unused parameter 'optype' [-Wunused-parameter]
  doio.c:3176:38: warning: unused parameter 'mark' [-Wunused-parameter]
  doio.c:3176:49: warning: unused parameter 'sp' [-Wunused-parameter]
  Encode.c:1356:5: warning: unused variable 'ix' [-Wunused-variable]
  ../../XSUB.h:185:20: note: expanded from macro 'dXSI32'
  Encode.c:1398:5: warning: unused variable 'ix' [-Wunused-variable]
  ./const-c.inc:24:42: warning: unused parameter 'iv_return' [-Wunused-parameter]
  SysV.c:371:7: warning: unused variable 'obj' [-Wunused-variable]
  SysV.c:409:7: warning: unused variable 'obj' [-Wunused-variable]
  SysV.c:411:7: warning: unused variable 'ds' [-Wunused-variable]
  SysV.c:450:7: warning: unused variable 'obj' [-Wunused-variable]
  SysV.c:492:7: warning: unused variable 'obj' [-Wunused-variable]
  SysV.c:494:7: warning: unused variable 'ds' [-Wunused-variable]
  SysV.c:535:15: warning: unused variable 'path' [-Wunused-variable]
  SysV.xs:310:9: warning: unused variable 'proj_id' [-Wunused-variable]
  SysV.xs:311:11: warning: unused variable 'k' [-Wunused-variable]
  SysV.c:665:6: warning: unused variable 'id' [-Wunused-variable]
  SysV.c:667:7: warning: unused variable 'addr' [-Wunused-variable]
  SysV.c:669:6: warning: unused variable 'flag' [-Wunused-variable]
  SysV.c:699:7: warning: unused variable 'addr' [-Wunused-variable]
  SysV.xs:86:20: warning: unused variable 's_pkg_sem' [-Wunused-variable]
  SysV.xs:87:20: warning: unused variable 's_pkg_shm' [-Wunused-variable]
  ./inline.h:1930:18: warning: implicit declaration of function 'isnanl' is invalid in C99 [-Wimplicit-function-declaration]
  ./perl.h:1954:34: note: expanded from macro 'Perl_isnan'
  sv.c:2944:9: warning: implicit declaration of function 'isinfl' is invalid in C99 [-Wimplicit-function-declaration]
  ./perl.h:1961:34: note: expanded from macro 'Perl_isinf'
  sv.c:2956:14: warning: implicit declaration of function 'isnanl' is invalid in C99 [-Wimplicit-function-declaration]
  pp_sys.c:4734:24: warning: implicit declaration of function 'isnanl' is invalid in C99 [-Wimplicit-function-declaration]
  numeric.c:1463:25: warning: implicit declaration of function 'isinfl' is invalid in C99 [-Wimplicit-function-declaration]
  numeric.c:1477:25: warning: implicit declaration of function 'isnanl' is invalid in C99 [-Wimplicit-function-declaration]
  numeric.c:1740:9: warning: implicit declaration of function 'isinfl' is invalid in C99 [-Wimplicit-function-declaration]
  numeric.c:1744:9: warning: implicit declaration of function 'isnanl' is invalid in C99 [-Wimplicit-function-declaration]
  POSIX.xs:2590:15: warning: implicit declaration of function 'isinfl' is invalid in C99 [-Wimplicit-function-declaration]
  ../../perl.h:1961:34: note: expanded from macro 'Perl_isinf'
  POSIX.xs:2593:15: warning: implicit declaration of function 'isnanl' is invalid in C99 [-Wimplicit-function-declaration]
  ../../perl.h:1954:34: note: expanded from macro 'Perl_isnan'
  POSIX.xs:2683:11: warning: implicit declaration of function 'isnanl' is invalid in C99 [-Wimplicit-function-declaration]
  reentr.c:331:16: warning: implicit declaration of function 'gethostbyaddr_r' is invalid in C99 [-Wimplicit-function-declaration]
  ./reentr.h:962:63: note: expanded from macro 'gethostbyaddr'
  reentr.c:436:16: warning: implicit declaration of function 'getpwent' is invalid in C99 [-Wimplicit-function-declaration]
  reentr.c:436:14: warning: incompatible integer to pointer conversion assigning to 'void *' from 'int' [-Wint-conversion]
  sv.c:13628:11: warning: implicit declaration of function 'telldir' is invalid in C99 [-Wimplicit-function-declaration]
  ./iperlsys.h:447:28: note: expanded from macro 'PerlDir_tell'
  sv.c:13629:19: warning: 'readdir_r' is deprecated: readdir_r is deprecated; use readdir instead [-Wdeprecated-declarations]
  ./iperlsys.h:444:28: note: expanded from macro 'PerlDir_read'
  ./reentr.h:1298:28: note: expanded from macro 'readdir'
  /data/data/com.termux/files/usr/include/dirent.h:87:92: note: 'readdir_r' has been explicitly marked deprecated here
  sv.c:13643:5: warning: implicit declaration of function 'seekdir' is invalid in C99 [-Wimplicit-function-declaration]
  sv.c:13650:10: warning: 'readdir_r' is deprecated: readdir_r is deprecated; use readdir instead [-Wdeprecated-declarations]
  sv.c:13658:20: warning: 'readdir_r' is deprecated: readdir_r is deprecated; use readdir instead [-Wdeprecated-declarations]
  pp_sys.c:4040:28: warning: 'readdir_r' is deprecated: readdir_r is deprecated; use readdir instead [-Wdeprecated-declarations]
  pp_sys.c:5002:9: warning: implicit declaration of function 'gethostbyaddr_r' is invalid in C99 [-Wimplicit-function-declaration]
  ./iperlsys.h:1366:41: note: expanded from macro 'PerlSock_gethostbyaddr'

About this smoke:
    smoking-perl: 5.28.2
  smoker-version: 1.72/0.046
       timestamp: 2019-05-25 23:17:50+00
          tester: u0_a56

This smoker is on Android 8.1 (Oreo) using the Termux environment.
(It's a cheap TV box, so doesn't have much grunt.)
Contact: rich+perl@hyphen-dash-hyphen.info

Test failures with known causes:
* ../cpan/version/t/07locale.t - https://github.com/Perl/version.pm/pull/5
* ../cpan/Sys-Syslog/t/*       - https://rt.perl.org/Public/Bug/Display.html?id=134062
* ../dist/Net-Ping/t/*         - https://rt.perl.org/Public/Bug/Display.html?id=134043 
* lib/warnings/regexec         - https://rt.perl.org/Public/Bug/Display.html?id=134117
* ../cpan/ExtUtils-MakeMaker/t/02-xsdynamic.t - https://github.com/Perl-Toolchain-Gang/ExtUtils-MakeMaker/issues/337

Skipped tests:
* ../t/op/readline.t - works normally but hangs under stdio layer. Specifically, as per the following,  
PERLIO=stdio ./perl -e 'local $SIG{ALRM} = sub { die "Alarm!" }; alarm 1; readline(STDIN)'
-- 
Report generated by Test::Smoke::Gateway v0.09_01