Show logfile
Automated smoke report for branch blead 5.30.0 patch c72549cc470fce3311724c7235b9b92c67b633ea v5.30.0-RC1-6-gc72549cc47
x2: ia64 (ia64/4 cpus)
    on        HP-UX B.11.31/64
    using     gcc version 4.7.2 (*1)
    smoketime 10 hours 35 minutes (average 1 hour 19 minutes)

Summary: FAIL(F)

O = OK  F = Failure(s), extended report at the bottom
X = Failure(s) under TEST but not under harness
? = still running or test results not (yet) available
Build failures during:       - = unknown or N/A
c = Configure, m = make, M = make (after miniperl), t = make test-prep

v5.30.0-RC1-6-gc72549cc47
---------------------- ----------------------------------------------------
O  O  F  O  O  F        -Dcc=gcc (*1)
O  O  F  O  O  F        -Dcc=gcc -Duse64bitall (*1)
O  O  F  F  F  F        -Dcc=gcc -Duseithreads (*1)
O  F  F  F  F  F        -Dcc=gcc -Duseithreads -Duse64bitall (*1)
|  |  |  |  |  |
|  |  |  |  |  +------  locale:en_US.utf8 DEBUGGING
|  |  |  |  +---------  perlio DEBUGGING
|  |  |  +------------  stdio DEBUGGING
|  |  +---------------  locale:en_US.utf8
|  +------------------  perlio
+---------------------  stdio

Applied patches:
  SMOKEc72549cc470fce3311724c7235b9b92c67b633ea

Skipped tests:
  None

Test failures:
~~ ../ext/XS-APItest/t/exception.t ............................. FAILED Bad plan.  You planned 12 tests but ran 5.
  [stdio/perlio/locale:en_US.utf8] -Dcc=gcc -Duseithreads -Duse64bitall DEBUGGING
  [stdio/perlio/locale:en_US.utf8] -Dcc=gcc -Duseithreads DEBUGGING
~~ ../lib/locale.t ............................................. FAILED 448
  [perlio] -Dcc=gcc -Duseithreads -Duse64bitall
~~ ../t/re/speed.t ............................................. FAILED 58
  [locale:en_US.utf8] -Dcc=gcc -Duseithreads -Duse64bitall DEBUGGING
~~ ../dist/Devel-PPPort/t/exception.t .......................... FAILED Bad plan.  You planned 7 tests but ran 4.
  [stdio/perlio/locale:en_US.utf8] -Dcc=gcc -Duseithreads -Duse64bitall DEBUGGING
  [stdio/perlio/locale:en_US.utf8] -Dcc=gcc -Duseithreads DEBUGGING
~~ ../cpan/Socket/t/Socket.t ................................... FAILED Non-zero exit status: 255 Bad plan.  You planned 6 tests but ran 2.
  [locale:en_US.utf8] -Dcc=gcc
  [locale:en_US.utf8] -Dcc=gcc -Duse64bitall
  [locale:en_US.utf8] -Dcc=gcc -Duseithreads -Duse64bitall DEBUGGING
  [locale:en_US.utf8] -Dcc=gcc -Duseithreads DEBUGGING
  [locale:en_US.utf8] -Dcc=gcc -Duseithreads
  [locale:en_US.utf8] -Dcc=gcc DEBUGGING
  [locale:en_US.utf8] -Dcc=gcc -Duse64bitall DEBUGGING
  [locale:en_US.utf8] -Dcc=gcc -Duseithreads -Duse64bitall

Test todo-passed:
~~ ../lib/B/Deparse.t .......................................... PASSED 2
  [locale:en_US.utf8] -Dcc=gcc
  [locale:en_US.utf8] -Dcc=gcc -Duse64bitall
  [locale:en_US.utf8] -Dcc=gcc -Duseithreads -Duse64bitall DEBUGGING
  [locale:en_US.utf8] -Dcc=gcc -Duseithreads DEBUGGING
  [locale:en_US.utf8] -Dcc=gcc -Duseithreads
  [locale:en_US.utf8] -Dcc=gcc DEBUGGING
  [locale:en_US.utf8] -Dcc=gcc -Duse64bitall DEBUGGING
  [locale:en_US.utf8] -Dcc=gcc -Duseithreads -Duse64bitall
~~ ../dist/Net-Ping/t/450_service.t ............................ PASSED 9 18
  [stdio/perlio/locale:en_US.utf8] -Dcc=gcc
  [stdio/perlio/locale:en_US.utf8] -Dcc=gcc -Duse64bitall
  [stdio/perlio/locale:en_US.utf8] -Dcc=gcc -Duseithreads -Duse64bitall DEBUGGING
  [stdio/perlio/locale:en_US.utf8] -Dcc=gcc -Duseithreads DEBUGGING
  [stdio/perlio/locale:en_US.utf8] -Dcc=gcc -Duseithreads
  [stdio/perlio/locale:en_US.utf8] -Dcc=gcc DEBUGGING
  [stdio/perlio/locale:en_US.utf8] -Dcc=gcc -Duse64bitall DEBUGGING
  [stdio/perlio/locale:en_US.utf8] -Dcc=gcc -Duseithreads -Duse64bitall

MANIFEST messages:

Compiler messages:
  op.c: In function 'S_gen_constant_list':
  op.c:5750:31: warning: argument 'o' might be clobbered by 'longjmp' or 'vfork' [-Wclobbered]
  pp.c: In function 'Perl_pp_argelem':
  pp.c:7042:13: warning: value computed is not used [-Wunused-value]
  RealPPPort.xs: In function 'XS_Devel__PPPort_check_HeUTF8':
  RealPPPort.xs:1826:17: warning: value computed is not used [-Wunused-value]
  Encode.c: In function 'XS_Encode_decode':
  Encode.c:1356:5: warning: unused variable 'ix' [-Wunused-variable]
  Encode.c: In function 'XS_Encode_encode':
  Encode.c:1398:5: warning: unused variable 'ix' [-Wunused-variable]
  ./const-xs.inc: In function 'boot_Socket':
  ./const-xs.inc:980:20: warning: missing braces around initializer [-Wmissing-braces]
  ./const-xs.inc:980:20: warning: (near initialization for 'ip6_address._s6_un') [-Wmissing-braces]
  ./const-xs.inc:989:20: warning: missing braces around initializer [-Wmissing-braces]
  ./const-xs.inc:989:20: warning: (near initialization for 'ip6_address._s6_un') [-Wmissing-braces]
  Storable.xs: In function 'get_regexp':
  Storable.xs:3434:7: warning: format '%d' expects argument of type 'int', but argument 2 has type 'I32' [-Wformat]
  Storable.xs: In function 'retrieve_regexp':
  Storable.xs:6849:9: warning: format '%d' expects argument of type 'int', but argument 2 has type 'I32' [-Wformat]
  const-c.inc: In function 'constant_19':
  const-c.inc:351:42: warning: unused parameter 'iv_return' [-Wunused-parameter]
  toke.c: In function 'Perl_scan_num':
  toke.c:11226:54: warning: 'b' may be used uninitialized in this function [-Wmaybe-uninitialized]
  Storable.xs: In function 'store_hook':
  Storable.xs:4075:17: warning: format '%d' expects argument of type 'int', but argument 3 has type 'I32' [-Wformat]
  Storable.xs: In function 'store':
  Storable.xs:4450:6: warning: format '%d' expects argument of type 'int', but argument 3 has type 'I32' [-Wformat]

About this smoke:
    smoking-perl: 5.26.2
  smoker-version: 1.72_06/0.046
       timestamp: 2019-05-14 22:41:27+00
          tester: merijn

Status overview available here: https://tux.nl/perl5/smoke/
-- 
Report generated by Test::Smoke::Gateway v0.09_01