Automated smoke report for branch blead 5.29.10 patch 6e03bd4cab1429f54d97afcbf7e42c7ba9ec0753 v5.29.9-82-g6e03bd4cab
perl-reporter-04: Intel(R) Xeon(R) CPU E31220 @ 3.10GHz (3093 MHz) (amd64/2 cpus)
    on        openbsd 6.4
    using     cc version 4.2.1 Compatible OpenBSD Clang 6.0.0 (tags/RELEASE_600/final) (*1)
    smoketime 2 hours 47 minutes (average 41 minutes 54 seconds)

Summary: FAIL(F)

O = OK  F = Failure(s), extended report at the bottom
X = Failure(s) under TEST but not under harness
? = still running or test results not (yet) available
Build failures during:       - = unknown or N/A
c = Configure, m = make, M = make (after miniperl), t = make test-prep

v5.29.9-82-g6e03bd4cab
---------------------- ----------------------------------------------------
O  F  F  F               (*1)
O  O  O  F              -Duseithreads (*1)
|  |  |  |
|  |  |  +------------  perlio DEBUGGING
|  |  +---------------  stdio DEBUGGING
|  +------------------  perlio
+---------------------  stdio

Applied patches:
  SMOKE6e03bd4cab1429f54d97afcbf7e42c7ba9ec0753

Skipped tests:
      # One test name on a line

Test failures:
~~ ../cpan/Sys-Syslog/t/syslog.t ............................... FAILED 145 Non-zero exit status: 4
  [perlio] -Duseithreads DEBUGGING
~~ ../cpan/Sys-Syslog/t/syslog.t ............................... FAILED 147 Non-zero exit status: 3
  [perlio]  DEBUGGING
~~ ../cpan/Sys-Syslog/t/syslog.t ............................... FAILED 145 Non-zero exit status: 2
  [perlio] 
~~ ../cpan/Sys-Syslog/t/syslog.t ............................... FAILED 144-147 Non-zero exit status: 8
  [stdio]  DEBUGGING

Test todo-passed:
~~ ../cpan/Module-Metadata/t/extract-version.t ................. PASSED 7 51 91 130 165 203
  [stdio/perlio] 
  [stdio/perlio] -Duseithreads DEBUGGING
  [stdio/perlio]  DEBUGGING
  [stdio/perlio] -Duseithreads

MANIFEST messages:

Compiler messages:
  Encode.c:1356:5: warning: unused variable 'ix' [-Wunused-variable]
  ../../XSUB.h:185:20: note: expanded from macro 'dXSI32'
  Encode.c:1398:5: warning: unused variable 'ix' [-Wunused-variable]
  ./const-c.inc:351:42: warning: unused parameter 'iv_return' [-Wunused-parameter]

About this smoke:
    smoking-perl: 5.24.3
  smoker-version: 1.72/0.046
       timestamp: 2019-04-08 14:07:08+00
          tester: jkeenan

cpan/Sys-Syslog/t/syslog.t is frequently subject to false negatives.
See https://rt.cpan.org/Ticket/Display.html?id=127454.
-- 
Report generated by Test::Smoke::Gateway v0.09_01