Show logfile
Automated smoke report for branch blead 5.29.10 patch d9a91485293e1414746fd028b3782f699519105e v5.29.9-15-gd9a9148529
vier.local: Intel(R) Core(TM) i7-3820 CPU @ 3.60GHz (GenuineIntel 3702MHz) (x86_64/1[8 cores] cpus)
    on        linux 4.20.13-200.fc29.x86_64 [Fedora 29 (Server Edition)]
    using     clang version 4.2.1 Compatible Clang 7.0.1 (Fedora 7.0.1-6.fc29) (*1)
    smoketime 4 hours 26 minutes (average 1 hour 6 minutes)

Summary: FAIL(FM)

O = OK  F = Failure(s), extended report at the bottom
X = Failure(s) under TEST but not under harness
? = still running or test results not (yet) available
Build failures during:       - = unknown or N/A
c = Configure, m = make, M = make (after miniperl), t = make test-prep

v5.29.9-15-gd9a9148529
---------------------- ----------------------------------------------------
-  F  -  F              -Dcc=clang -Accflags="-Werror=declaration-after-statement -g -fno-omit-frame-pointer -fsanitize=address  -fno-common -fsanitize-blacklist=`pwd`/asan_ignore" -Aldflags="-fsanitize=address" (*1)
M  -  -  F              -Dcc=clang -Accflags="-Werror=declaration-after-statement -g -fno-omit-frame-pointer -fsanitize=address  -fno-common -fsanitize-blacklist=`pwd`/asan_ignore" -Aldflags="-fsanitize=address" -Duseithreads (*1)
|  |  |  |
|  |  |  +------------  stdio DEBUGGING
|  |  +---------------  minitest DEBUGGING
|  +------------------  stdio
+---------------------  minitest

Applied patches:
  SMOKEd9a91485293e1414746fd028b3782f699519105e

Skipped tests:
  None

Test failures:
~~ ../dist/threads/t/join.t .................................... FAILED Non-zero exit status: 1
  [stdio] -Dcc=clang -Accflags="-Werror=declaration-after-statement -g -fno-omit-frame-pointer -fsanitize=address  -fno-common -fsanitize-blacklist=`pwd`/asan_ignore" -Aldflags="-fsanitize=address" -Duseithreads DEBUGGING
~~ ../dist/Thread-Queue/t/09_ended.t ........................... FAILED Non-zero exit status: 1
  [stdio] -Dcc=clang -Accflags="-Werror=declaration-after-statement -g -fno-omit-frame-pointer -fsanitize=address  -fno-common -fsanitize-blacklist=`pwd`/asan_ignore" -Aldflags="-fsanitize=address" -Duseithreads DEBUGGING
~~ ../t/re/pat_special_cc_thr.t ................................ FAILED Non-zero exit status: 1
  [stdio] -Dcc=clang -Accflags="-Werror=declaration-after-statement -g -fno-omit-frame-pointer -fsanitize=address  -fno-common -fsanitize-blacklist=`pwd`/asan_ignore" -Aldflags="-fsanitize=address" -Duseithreads DEBUGGING
~~ ../dist/Data-Dumper/t/recurse.t ............................. FAILED Non-zero exit status: 1
  [stdio] -Dcc=clang -Accflags="-Werror=declaration-after-statement -g -fno-omit-frame-pointer -fsanitize=address  -fno-common -fsanitize-blacklist=`pwd`/asan_ignore" -Aldflags="-fsanitize=address" -Duseithreads DEBUGGING
  [stdio] -Dcc=clang -Accflags="-Werror=declaration-after-statement -g -fno-omit-frame-pointer -fsanitize=address  -fno-common -fsanitize-blacklist=`pwd`/asan_ignore" -Aldflags="-fsanitize=address" DEBUGGING
  [stdio] -Dcc=clang -Accflags="-Werror=declaration-after-statement -g -fno-omit-frame-pointer -fsanitize=address  -fno-common -fsanitize-blacklist=`pwd`/asan_ignore" -Aldflags="-fsanitize=address"
~~ ../t/re/pat_rt_report_thr.t ................................. FAILED Non-zero exit status: 1
  [stdio] -Dcc=clang -Accflags="-Werror=declaration-after-statement -g -fno-omit-frame-pointer -fsanitize=address  -fno-common -fsanitize-blacklist=`pwd`/asan_ignore" -Aldflags="-fsanitize=address" -Duseithreads DEBUGGING
~~ ../ext/XS-APItest/t/handy07.t ............................... FAILED Non-zero exit status: 1
  [stdio] -Dcc=clang -Accflags="-Werror=declaration-after-statement -g -fno-omit-frame-pointer -fsanitize=address  -fno-common -fsanitize-blacklist=`pwd`/asan_ignore" -Aldflags="-fsanitize=address" -Duseithreads DEBUGGING
  [stdio] -Dcc=clang -Accflags="-Werror=declaration-after-statement -g -fno-omit-frame-pointer -fsanitize=address  -fno-common -fsanitize-blacklist=`pwd`/asan_ignore" -Aldflags="-fsanitize=address" DEBUGGING
  [stdio] -Dcc=clang -Accflags="-Werror=declaration-after-statement -g -fno-omit-frame-pointer -fsanitize=address  -fno-common -fsanitize-blacklist=`pwd`/asan_ignore" -Aldflags="-fsanitize=address"
~~ ../t/re/pat_re_eval_thr.t ................................... FAILED Non-zero exit status: 1
  [stdio] -Dcc=clang -Accflags="-Werror=declaration-after-statement -g -fno-omit-frame-pointer -fsanitize=address  -fno-common -fsanitize-blacklist=`pwd`/asan_ignore" -Aldflags="-fsanitize=address" -Duseithreads DEBUGGING
~~ ../dist/threads/t/stress_cv.t ............................... FAILED Non-zero exit status: 1
  [stdio] -Dcc=clang -Accflags="-Werror=declaration-after-statement -g -fno-omit-frame-pointer -fsanitize=address  -fno-common -fsanitize-blacklist=`pwd`/asan_ignore" -Aldflags="-fsanitize=address" -Duseithreads DEBUGGING
~~ ../dist/Thread-Queue/t/05_extract.t ......................... FAILED Non-zero exit status: 1
  [stdio] -Dcc=clang -Accflags="-Werror=declaration-after-statement -g -fno-omit-frame-pointer -fsanitize=address  -fno-common -fsanitize-blacklist=`pwd`/asan_ignore" -Aldflags="-fsanitize=address" -Duseithreads DEBUGGING
~~ ../t/re/regexp_qr_embed_thr.t ............................... FAILED Non-zero exit status: 1
  [stdio] -Dcc=clang -Accflags="-Werror=declaration-after-statement -g -fno-omit-frame-pointer -fsanitize=address  -fno-common -fsanitize-blacklist=`pwd`/asan_ignore" -Aldflags="-fsanitize=address" -Duseithreads DEBUGGING
~~ ../dist/Devel-PPPort/t/misc.t ............................... FAILED Non-zero exit status: 1
  [stdio] -Dcc=clang -Accflags="-Werror=declaration-after-statement -g -fno-omit-frame-pointer -fsanitize=address  -fno-common -fsanitize-blacklist=`pwd`/asan_ignore" -Aldflags="-fsanitize=address" -Duseithreads DEBUGGING
  [stdio] -Dcc=clang -Accflags="-Werror=declaration-after-statement -g -fno-omit-frame-pointer -fsanitize=address  -fno-common -fsanitize-blacklist=`pwd`/asan_ignore" -Aldflags="-fsanitize=address" DEBUGGING
  [stdio] -Dcc=clang -Accflags="-Werror=declaration-after-statement -g -fno-omit-frame-pointer -fsanitize=address  -fno-common -fsanitize-blacklist=`pwd`/asan_ignore" -Aldflags="-fsanitize=address"
~~ ../dist/threads-shared/t/sv_simple.t ........................ FAILED Non-zero exit status: 1
  [stdio] -Dcc=clang -Accflags="-Werror=declaration-after-statement -g -fno-omit-frame-pointer -fsanitize=address  -fno-common -fsanitize-blacklist=`pwd`/asan_ignore" -Aldflags="-fsanitize=address" -Duseithreads DEBUGGING
~~ ../t/re/reg_email_thr.t ..................................... FAILED Non-zero exit status: 1
  [stdio] -Dcc=clang -Accflags="-Werror=declaration-after-statement -g -fno-omit-frame-pointer -fsanitize=address  -fno-common -fsanitize-blacklist=`pwd`/asan_ignore" -Aldflags="-fsanitize=address" -Duseithreads DEBUGGING
~~ ../t/op/inc.t ............................................... FAILED Non-zero exit status: 1
  [stdio] -Dcc=clang -Accflags="-Werror=declaration-after-statement -g -fno-omit-frame-pointer -fsanitize=address  -fno-common -fsanitize-blacklist=`pwd`/asan_ignore" -Aldflags="-fsanitize=address" -Duseithreads DEBUGGING
  [stdio] -Dcc=clang -Accflags="-Werror=declaration-after-statement -g -fno-omit-frame-pointer -fsanitize=address  -fno-common -fsanitize-blacklist=`pwd`/asan_ignore" -Aldflags="-fsanitize=address" DEBUGGING
  [stdio] -Dcc=clang -Accflags="-Werror=declaration-after-statement -g -fno-omit-frame-pointer -fsanitize=address  -fno-common -fsanitize-blacklist=`pwd`/asan_ignore" -Aldflags="-fsanitize=address"
~~ ../dist/threads/t/free.t .................................... FAILED Non-zero exit status: 1
  [stdio] -Dcc=clang -Accflags="-Werror=declaration-after-statement -g -fno-omit-frame-pointer -fsanitize=address  -fno-common -fsanitize-blacklist=`pwd`/asan_ignore" -Aldflags="-fsanitize=address" -Duseithreads DEBUGGING
~~ ../t/op/heredoc.t ........................................... FAILED 135-136
  [stdio] -Dcc=clang -Accflags="-Werror=declaration-after-statement -g -fno-omit-frame-pointer -fsanitize=address  -fno-common -fsanitize-blacklist=`pwd`/asan_ignore" -Aldflags="-fsanitize=address" -Duseithreads DEBUGGING
  [stdio] -Dcc=clang -Accflags="-Werror=declaration-after-statement -g -fno-omit-frame-pointer -fsanitize=address  -fno-common -fsanitize-blacklist=`pwd`/asan_ignore" -Aldflags="-fsanitize=address" DEBUGGING
  [stdio] -Dcc=clang -Accflags="-Werror=declaration-after-statement -g -fno-omit-frame-pointer -fsanitize=address  -fno-common -fsanitize-blacklist=`pwd`/asan_ignore" -Aldflags="-fsanitize=address"
~~ ../t/op/ref.t ............................................... FAILED Non-zero exit status: 1
  [stdio] -Dcc=clang -Accflags="-Werror=declaration-after-statement -g -fno-omit-frame-pointer -fsanitize=address  -fno-common -fsanitize-blacklist=`pwd`/asan_ignore" -Aldflags="-fsanitize=address" -Duseithreads DEBUGGING
  [stdio] -Dcc=clang -Accflags="-Werror=declaration-after-statement -g -fno-omit-frame-pointer -fsanitize=address  -fno-common -fsanitize-blacklist=`pwd`/asan_ignore" -Aldflags="-fsanitize=address" DEBUGGING
  [stdio] -Dcc=clang -Accflags="-Werror=declaration-after-statement -g -fno-omit-frame-pointer -fsanitize=address  -fno-common -fsanitize-blacklist=`pwd`/asan_ignore" -Aldflags="-fsanitize=address"
~~ ../t/op/index_thr.t ......................................... FAILED Non-zero exit status: 1
  [stdio] -Dcc=clang -Accflags="-Werror=declaration-after-statement -g -fno-omit-frame-pointer -fsanitize=address  -fno-common -fsanitize-blacklist=`pwd`/asan_ignore" -Aldflags="-fsanitize=address" -Duseithreads DEBUGGING
~~ ../ext/XS-APItest/t/stmtasexpr.t ............................ FAILED Non-zero exit status: 1
  [stdio] -Dcc=clang -Accflags="-Werror=declaration-after-statement -g -fno-omit-frame-pointer -fsanitize=address  -fno-common -fsanitize-blacklist=`pwd`/asan_ignore" -Aldflags="-fsanitize=address" -Duseithreads DEBUGGING
  [stdio] -Dcc=clang -Accflags="-Werror=declaration-after-statement -g -fno-omit-frame-pointer -fsanitize=address  -fno-common -fsanitize-blacklist=`pwd`/asan_ignore" -Aldflags="-fsanitize=address" DEBUGGING
  [stdio] -Dcc=clang -Accflags="-Werror=declaration-after-statement -g -fno-omit-frame-pointer -fsanitize=address  -fno-common -fsanitize-blacklist=`pwd`/asan_ignore" -Aldflags="-fsanitize=address"
~~ ../lib/B/Deparse.t .......................................... FAILED Non-zero exit status: 1
  [stdio] -Dcc=clang -Accflags="-Werror=declaration-after-statement -g -fno-omit-frame-pointer -fsanitize=address  -fno-common -fsanitize-blacklist=`pwd`/asan_ignore" -Aldflags="-fsanitize=address" -Duseithreads DEBUGGING
~~ ../t/op/stash_parse_gv.t .................................... FAILED 3
  [stdio] -Dcc=clang -Accflags="-Werror=declaration-after-statement -g -fno-omit-frame-pointer -fsanitize=address  -fno-common -fsanitize-blacklist=`pwd`/asan_ignore" -Aldflags="-fsanitize=address" -Duseithreads DEBUGGING
  [stdio] -Dcc=clang -Accflags="-Werror=declaration-after-statement -g -fno-omit-frame-pointer -fsanitize=address  -fno-common -fsanitize-blacklist=`pwd`/asan_ignore" -Aldflags="-fsanitize=address" DEBUGGING
  [stdio] -Dcc=clang -Accflags="-Werror=declaration-after-statement -g -fno-omit-frame-pointer -fsanitize=address  -fno-common -fsanitize-blacklist=`pwd`/asan_ignore" -Aldflags="-fsanitize=address"
~~ ../dist/Thread-Semaphore/t/01_basic.t ....................... FAILED Non-zero exit status: 1
  [stdio] -Dcc=clang -Accflags="-Werror=declaration-after-statement -g -fno-omit-frame-pointer -fsanitize=address  -fno-common -fsanitize-blacklist=`pwd`/asan_ignore" -Aldflags="-fsanitize=address" -Duseithreads DEBUGGING
~~ ../dist/threads/t/stress_re.t ............................... FAILED Non-zero exit status: 1
  [stdio] -Dcc=clang -Accflags="-Werror=declaration-after-statement -g -fno-omit-frame-pointer -fsanitize=address  -fno-common -fsanitize-blacklist=`pwd`/asan_ignore" -Aldflags="-fsanitize=address" -Duseithreads DEBUGGING
~~ ../dist/Thread-Queue/t/07_lock.t ............................ FAILED Non-zero exit status: 1
  [stdio] -Dcc=clang -Accflags="-Werror=declaration-after-statement -g -fno-omit-frame-pointer -fsanitize=address  -fno-common -fsanitize-blacklist=`pwd`/asan_ignore" -Aldflags="-fsanitize=address" -Duseithreads DEBUGGING
~~ ../dist/threads-shared/t/av_refs.t .......................... FAILED Non-zero exit status: 1
  [stdio] -Dcc=clang -Accflags="-Werror=declaration-after-statement -g -fno-omit-frame-pointer -fsanitize=address  -fno-common -fsanitize-blacklist=`pwd`/asan_ignore" -Aldflags="-fsanitize=address" -Duseithreads DEBUGGING
~~ ../cpan/Test-Simple/t/Test2/modules/Hub.t ................... FAILED Non-zero exit status: 1
  [stdio] -Dcc=clang -Accflags="-Werror=declaration-after-statement -g -fno-omit-frame-pointer -fsanitize=address  -fno-common -fsanitize-blacklist=`pwd`/asan_ignore" -Aldflags="-fsanitize=address" -Duseithreads DEBUGGING
~~ ../dist/Thread-Queue/t/10_timed.t ........................... FAILED Non-zero exit status: 1
  [stdio] -Dcc=clang -Accflags="-Werror=declaration-after-statement -g -fno-omit-frame-pointer -fsanitize=address  -fno-common -fsanitize-blacklist=`pwd`/asan_ignore" -Aldflags="-fsanitize=address" -Duseithreads DEBUGGING
~~ ../dist/threads-shared/t/no_share.t ......................... FAILED Non-zero exit status: 1
  [stdio] -Dcc=clang -Accflags="-Werror=declaration-after-statement -g -fno-omit-frame-pointer -fsanitize=address  -fno-common -fsanitize-blacklist=`pwd`/asan_ignore" -Aldflags="-fsanitize=address" -Duseithreads DEBUGGING
~~ ../t/op/coresubs.t .......................................... FAILED Non-zero exit status: 1
  [stdio] -Dcc=clang -Accflags="-Werror=declaration-after-statement -g -fno-omit-frame-pointer -fsanitize=address  -fno-common -fsanitize-blacklist=`pwd`/asan_ignore" -Aldflags="-fsanitize=address" -Duseithreads DEBUGGING
  [stdio] -Dcc=clang -Accflags="-Werror=declaration-after-statement -g -fno-omit-frame-pointer -fsanitize=address  -fno-common -fsanitize-blacklist=`pwd`/asan_ignore" -Aldflags="-fsanitize=address" DEBUGGING
~~ ../dist/Thread-Queue/t/11_limit.t ........................... FAILED Non-zero exit status: 1
  [stdio] -Dcc=clang -Accflags="-Werror=declaration-after-statement -g -fno-omit-frame-pointer -fsanitize=address  -fno-common -fsanitize-blacklist=`pwd`/asan_ignore" -Aldflags="-fsanitize=address" -Duseithreads DEBUGGING
~~ ../t/re/pat_thr.t ........................................... FAILED Non-zero exit status: 1
  [stdio] -Dcc=clang -Accflags="-Werror=declaration-after-statement -g -fno-omit-frame-pointer -fsanitize=address  -fno-common -fsanitize-blacklist=`pwd`/asan_ignore" -Aldflags="-fsanitize=address" -Duseithreads DEBUGGING
~~ ../ext/PerlIO-encoding/t/threads.t .......................... FAILED Non-zero exit status: 1
  [stdio] -Dcc=clang -Accflags="-Werror=declaration-after-statement -g -fno-omit-frame-pointer -fsanitize=address  -fno-common -fsanitize-blacklist=`pwd`/asan_ignore" -Aldflags="-fsanitize=address" -Duseithreads DEBUGGING
~~ ../dist/threads-shared/t/cond.t ............................. FAILED Non-zero exit status: 1
  [stdio] -Dcc=clang -Accflags="-Werror=declaration-after-statement -g -fno-omit-frame-pointer -fsanitize=address  -fno-common -fsanitize-blacklist=`pwd`/asan_ignore" -Aldflags="-fsanitize=address" -Duseithreads DEBUGGING
~~ ../dist/threads-shared/t/dualvar.t .......................... FAILED Non-zero exit status: 1
  [stdio] -Dcc=clang -Accflags="-Werror=declaration-after-statement -g -fno-omit-frame-pointer -fsanitize=address  -fno-common -fsanitize-blacklist=`pwd`/asan_ignore" -Aldflags="-fsanitize=address" -Duseithreads DEBUGGING
~~ ../t/re/regexp_unicode_prop_thr.t ........................... FAILED Non-zero exit status: 1
  [stdio] -Dcc=clang -Accflags="-Werror=declaration-after-statement -g -fno-omit-frame-pointer -fsanitize=address  -fno-common -fsanitize-blacklist=`pwd`/asan_ignore" -Aldflags="-fsanitize=address" -Duseithreads DEBUGGING
~~ ../ext/File-Glob/t/threads.t ................................ FAILED Non-zero exit status: 1
  [stdio] -Dcc=clang -Accflags="-Werror=declaration-after-statement -g -fno-omit-frame-pointer -fsanitize=address  -fno-common -fsanitize-blacklist=`pwd`/asan_ignore" -Aldflags="-fsanitize=address" -Duseithreads DEBUGGING
~~ ../dist/threads-shared/t/stress.t ........................... FAILED Non-zero exit status: 1
  [stdio] -Dcc=clang -Accflags="-Werror=declaration-after-statement -g -fno-omit-frame-pointer -fsanitize=address  -fno-common -fsanitize-blacklist=`pwd`/asan_ignore" -Aldflags="-fsanitize=address" -Duseithreads DEBUGGING
~~ ../cpan/Test-Simple/t/Test2/modules/API/Instance.t .......... FAILED Non-zero exit status: 1
  [stdio] -Dcc=clang -Accflags="-Werror=declaration-after-statement -g -fno-omit-frame-pointer -fsanitize=address  -fno-common -fsanitize-blacklist=`pwd`/asan_ignore" -Aldflags="-fsanitize=address" -Duseithreads DEBUGGING
~~ ../ext/XS-APItest/t/my_cxt.t ................................ FAILED Non-zero exit status: 1
  [stdio] -Dcc=clang -Accflags="-Werror=declaration-after-statement -g -fno-omit-frame-pointer -fsanitize=address  -fno-common -fsanitize-blacklist=`pwd`/asan_ignore" -Aldflags="-fsanitize=address" -Duseithreads DEBUGGING
~~ ../ext/XS-APItest/t/handy06.t ............................... FAILED Non-zero exit status: 1
  [stdio] -Dcc=clang -Accflags="-Werror=declaration-after-statement -g -fno-omit-frame-pointer -fsanitize=address  -fno-common -fsanitize-blacklist=`pwd`/asan_ignore" -Aldflags="-fsanitize=address" -Duseithreads DEBUGGING
  [stdio] -Dcc=clang -Accflags="-Werror=declaration-after-statement -g -fno-omit-frame-pointer -fsanitize=address  -fno-common -fsanitize-blacklist=`pwd`/asan_ignore" -Aldflags="-fsanitize=address" DEBUGGING
  [stdio] -Dcc=clang -Accflags="-Werror=declaration-after-statement -g -fno-omit-frame-pointer -fsanitize=address  -fno-common -fsanitize-blacklist=`pwd`/asan_ignore" -Aldflags="-fsanitize=address"
~~ ../ext/XS-APItest/t/handy01.t ............................... FAILED Non-zero exit status: 1
  [stdio] -Dcc=clang -Accflags="-Werror=declaration-after-statement -g -fno-omit-frame-pointer -fsanitize=address  -fno-common -fsanitize-blacklist=`pwd`/asan_ignore" -Aldflags="-fsanitize=address" -Duseithreads DEBUGGING
  [stdio] -Dcc=clang -Accflags="-Werror=declaration-after-statement -g -fno-omit-frame-pointer -fsanitize=address  -fno-common -fsanitize-blacklist=`pwd`/asan_ignore" -Aldflags="-fsanitize=address" DEBUGGING
  [stdio] -Dcc=clang -Accflags="-Werror=declaration-after-statement -g -fno-omit-frame-pointer -fsanitize=address  -fno-common -fsanitize-blacklist=`pwd`/asan_ignore" -Aldflags="-fsanitize=address"
~~ ../dist/Thread-Queue/t/01_basic.t ........................... FAILED Non-zero exit status: 1
  [stdio] -Dcc=clang -Accflags="-Werror=declaration-after-statement -g -fno-omit-frame-pointer -fsanitize=address  -fno-common -fsanitize-blacklist=`pwd`/asan_ignore" -Aldflags="-fsanitize=address" -Duseithreads DEBUGGING
~~ ../t/op/coreamp.t ........................................... FAILED Non-zero exit status: 1
  [stdio] -Dcc=clang -Accflags="-Werror=declaration-after-statement -g -fno-omit-frame-pointer -fsanitize=address  -fno-common -fsanitize-blacklist=`pwd`/asan_ignore" -Aldflags="-fsanitize=address" -Duseithreads DEBUGGING
  [stdio] -Dcc=clang -Accflags="-Werror=declaration-after-statement -g -fno-omit-frame-pointer -fsanitize=address  -fno-common -fsanitize-blacklist=`pwd`/asan_ignore" -Aldflags="-fsanitize=address" DEBUGGING
~~ ../ext/XS-APItest/t/handy05.t ............................... FAILED Non-zero exit status: 1
  [stdio] -Dcc=clang -Accflags="-Werror=declaration-after-statement -g -fno-omit-frame-pointer -fsanitize=address  -fno-common -fsanitize-blacklist=`pwd`/asan_ignore" -Aldflags="-fsanitize=address" -Duseithreads DEBUGGING
  [stdio] -Dcc=clang -Accflags="-Werror=declaration-after-statement -g -fno-omit-frame-pointer -fsanitize=address  -fno-common -fsanitize-blacklist=`pwd`/asan_ignore" -Aldflags="-fsanitize=address" DEBUGGING
  [stdio] -Dcc=clang -Accflags="-Werror=declaration-after-statement -g -fno-omit-frame-pointer -fsanitize=address  -fno-common -fsanitize-blacklist=`pwd`/asan_ignore" -Aldflags="-fsanitize=address"
~~ ../t/op/while.t ............................................. FAILED 26
  [stdio] -Dcc=clang -Accflags="-Werror=declaration-after-statement -g -fno-omit-frame-pointer -fsanitize=address  -fno-common -fsanitize-blacklist=`pwd`/asan_ignore" -Aldflags="-fsanitize=address" -Duseithreads DEBUGGING
  [stdio] -Dcc=clang -Accflags="-Werror=declaration-after-statement -g -fno-omit-frame-pointer -fsanitize=address  -fno-common -fsanitize-blacklist=`pwd`/asan_ignore" -Aldflags="-fsanitize=address" DEBUGGING
~~ ../dist/threads/t/list.t .................................... FAILED Non-zero exit status: 1
  [stdio] -Dcc=clang -Accflags="-Werror=declaration-after-statement -g -fno-omit-frame-pointer -fsanitize=address  -fno-common -fsanitize-blacklist=`pwd`/asan_ignore" -Aldflags="-fsanitize=address" -Duseithreads DEBUGGING
~~ ../cpan/Test-Simple/t/regression/fork_first.t ............... FAILED Non-zero exit status: 1
  [stdio] -Dcc=clang -Accflags="-Werror=declaration-after-statement -g -fno-omit-frame-pointer -fsanitize=address  -fno-common -fsanitize-blacklist=`pwd`/asan_ignore" -Aldflags="-fsanitize=address" -Duseithreads DEBUGGING
~~ ../dist/threads/t/context.t ................................. FAILED Non-zero exit status: 1
  [stdio] -Dcc=clang -Accflags="-Werror=declaration-after-statement -g -fno-omit-frame-pointer -fsanitize=address  -fno-common -fsanitize-blacklist=`pwd`/asan_ignore" -Aldflags="-fsanitize=address" -Duseithreads DEBUGGING
~~ ../ext/XS-APItest/t/handy00.t ............................... FAILED Non-zero exit status: 1
  [stdio] -Dcc=clang -Accflags="-Werror=declaration-after-statement -g -fno-omit-frame-pointer -fsanitize=address  -fno-common -fsanitize-blacklist=`pwd`/asan_ignore" -Aldflags="-fsanitize=address" -Duseithreads DEBUGGING
  [stdio] -Dcc=clang -Accflags="-Werror=declaration-after-statement -g -fno-omit-frame-pointer -fsanitize=address  -fno-common -fsanitize-blacklist=`pwd`/asan_ignore" -Aldflags="-fsanitize=address" DEBUGGING
  [stdio] -Dcc=clang -Accflags="-Werror=declaration-after-statement -g -fno-omit-frame-pointer -fsanitize=address  -fno-common -fsanitize-blacklist=`pwd`/asan_ignore" -Aldflags="-fsanitize=address"
~~ ../t/uni/parser.t ........................................... FAILED Non-zero exit status: 1
  [stdio] -Dcc=clang -Accflags="-Werror=declaration-after-statement -g -fno-omit-frame-pointer -fsanitize=address  -fno-common -fsanitize-blacklist=`pwd`/asan_ignore" -Aldflags="-fsanitize=address" -Duseithreads DEBUGGING
  [stdio] -Dcc=clang -Accflags="-Werror=declaration-after-statement -g -fno-omit-frame-pointer -fsanitize=address  -fno-common -fsanitize-blacklist=`pwd`/asan_ignore" -Aldflags="-fsanitize=address" DEBUGGING
  [stdio] -Dcc=clang -Accflags="-Werror=declaration-after-statement -g -fno-omit-frame-pointer -fsanitize=address  -fno-common -fsanitize-blacklist=`pwd`/asan_ignore" -Aldflags="-fsanitize=address"
~~ ../t/op/threads.t ........................................... FAILED 6 Non-zero exit status: 1
  [stdio] -Dcc=clang -Accflags="-Werror=declaration-after-statement -g -fno-omit-frame-pointer -fsanitize=address  -fno-common -fsanitize-blacklist=`pwd`/asan_ignore" -Aldflags="-fsanitize=address" -Duseithreads DEBUGGING
~~ ../lib/locale.t ............................................. FAILED Non-zero exit status: 1
  [stdio] -Dcc=clang -Accflags="-Werror=declaration-after-statement -g -fno-omit-frame-pointer -fsanitize=address  -fno-common -fsanitize-blacklist=`pwd`/asan_ignore" -Aldflags="-fsanitize=address" -Duseithreads DEBUGGING
  [stdio] -Dcc=clang -Accflags="-Werror=declaration-after-statement -g -fno-omit-frame-pointer -fsanitize=address  -fno-common -fsanitize-blacklist=`pwd`/asan_ignore" -Aldflags="-fsanitize=address" DEBUGGING
  [stdio] -Dcc=clang -Accflags="-Werror=declaration-after-statement -g -fno-omit-frame-pointer -fsanitize=address  -fno-common -fsanitize-blacklist=`pwd`/asan_ignore" -Aldflags="-fsanitize=address"
~~ ../t/re/reg_mesg.t .......................................... FAILED Non-zero exit status: 255 No plan found in TAP output
  [stdio] -Dcc=clang -Accflags="-Werror=declaration-after-statement -g -fno-omit-frame-pointer -fsanitize=address  -fno-common -fsanitize-blacklist=`pwd`/asan_ignore" -Aldflags="-fsanitize=address" -Duseithreads DEBUGGING
  [stdio] -Dcc=clang -Accflags="-Werror=declaration-after-statement -g -fno-omit-frame-pointer -fsanitize=address  -fno-common -fsanitize-blacklist=`pwd`/asan_ignore" -Aldflags="-fsanitize=address" DEBUGGING
  [stdio] -Dcc=clang -Accflags="-Werror=declaration-after-statement -g -fno-omit-frame-pointer -fsanitize=address  -fno-common -fsanitize-blacklist=`pwd`/asan_ignore" -Aldflags="-fsanitize=address"
~~ ../dist/threads/t/state.t ................................... FAILED Non-zero exit status: 1
  [stdio] -Dcc=clang -Accflags="-Werror=declaration-after-statement -g -fno-omit-frame-pointer -fsanitize=address  -fno-common -fsanitize-blacklist=`pwd`/asan_ignore" -Aldflags="-fsanitize=address" -Duseithreads DEBUGGING
~~ ../ext/PerlIO-via/t/thread.t ................................ FAILED Non-zero exit status: 1
  [stdio] -Dcc=clang -Accflags="-Werror=declaration-after-statement -g -fno-omit-frame-pointer -fsanitize=address  -fno-common -fsanitize-blacklist=`pwd`/asan_ignore" -Aldflags="-fsanitize=address" -Duseithreads DEBUGGING
~~ ../dist/threads/t/problems.t ................................ FAILED Non-zero exit status: 1
  [stdio] -Dcc=clang -Accflags="-Werror=declaration-after-statement -g -fno-omit-frame-pointer -fsanitize=address  -fno-common -fsanitize-blacklist=`pwd`/asan_ignore" -Aldflags="-fsanitize=address" -Duseithreads DEBUGGING
~~ ../dist/threads-shared/t/shared_attr.t ...................... FAILED Non-zero exit status: 1
  [stdio] -Dcc=clang -Accflags="-Werror=declaration-after-statement -g -fno-omit-frame-pointer -fsanitize=address  -fno-common -fsanitize-blacklist=`pwd`/asan_ignore" -Aldflags="-fsanitize=address" -Duseithreads DEBUGGING
~~ ../ext/XS-APItest/t/customop.t .............................. FAILED Non-zero exit status: 1
  [stdio] -Dcc=clang -Accflags="-Werror=declaration-after-statement -g -fno-omit-frame-pointer -fsanitize=address  -fno-common -fsanitize-blacklist=`pwd`/asan_ignore" -Aldflags="-fsanitize=address" -Duseithreads DEBUGGING
  [stdio] -Dcc=clang -Accflags="-Werror=declaration-after-statement -g -fno-omit-frame-pointer -fsanitize=address  -fno-common -fsanitize-blacklist=`pwd`/asan_ignore" -Aldflags="-fsanitize=address" DEBUGGING
  [stdio] -Dcc=clang -Accflags="-Werror=declaration-after-statement -g -fno-omit-frame-pointer -fsanitize=address  -fno-common -fsanitize-blacklist=`pwd`/asan_ignore" -Aldflags="-fsanitize=address"
~~ ../t/op/sub.t ............................................... FAILED Non-zero exit status: 1
  [stdio] -Dcc=clang -Accflags="-Werror=declaration-after-statement -g -fno-omit-frame-pointer -fsanitize=address  -fno-common -fsanitize-blacklist=`pwd`/asan_ignore" -Aldflags="-fsanitize=address" -Duseithreads DEBUGGING
  [stdio] -Dcc=clang -Accflags="-Werror=declaration-after-statement -g -fno-omit-frame-pointer -fsanitize=address  -fno-common -fsanitize-blacklist=`pwd`/asan_ignore" -Aldflags="-fsanitize=address" DEBUGGING
  [stdio] -Dcc=clang -Accflags="-Werror=declaration-after-statement -g -fno-omit-frame-pointer -fsanitize=address  -fno-common -fsanitize-blacklist=`pwd`/asan_ignore" -Aldflags="-fsanitize=address"
~~ ../dist/threads/t/thread.t .................................. FAILED Non-zero exit status: 1
  [stdio] -Dcc=clang -Accflags="-Werror=declaration-after-statement -g -fno-omit-frame-pointer -fsanitize=address  -fno-common -fsanitize-blacklist=`pwd`/asan_ignore" -Aldflags="-fsanitize=address" -Duseithreads DEBUGGING
~~ ../dist/threads/t/kill.t .................................... FAILED Non-zero exit status: 1
  [stdio] -Dcc=clang -Accflags="-Werror=declaration-after-statement -g -fno-omit-frame-pointer -fsanitize=address  -fno-common -fsanitize-blacklist=`pwd`/asan_ignore" -Aldflags="-fsanitize=address" -Duseithreads DEBUGGING
~~ ../cpan/Test-Simple/t/Test2/behavior/ipc_wait_timeout.t ..... FAILED Non-zero exit status: 1
  [stdio] -Dcc=clang -Accflags="-Werror=declaration-after-statement -g -fno-omit-frame-pointer -fsanitize=address  -fno-common -fsanitize-blacklist=`pwd`/asan_ignore" -Aldflags="-fsanitize=address" -Duseithreads DEBUGGING
~~ ../ext/XS-APItest/t/handy04.t ............................... FAILED Non-zero exit status: 1
  [stdio] -Dcc=clang -Accflags="-Werror=declaration-after-statement -g -fno-omit-frame-pointer -fsanitize=address  -fno-common -fsanitize-blacklist=`pwd`/asan_ignore" -Aldflags="-fsanitize=address" -Duseithreads DEBUGGING
  [stdio] -Dcc=clang -Accflags="-Werror=declaration-after-statement -g -fno-omit-frame-pointer -fsanitize=address  -fno-common -fsanitize-blacklist=`pwd`/asan_ignore" -Aldflags="-fsanitize=address" DEBUGGING
  [stdio] -Dcc=clang -Accflags="-Werror=declaration-after-statement -g -fno-omit-frame-pointer -fsanitize=address  -fno-common -fsanitize-blacklist=`pwd`/asan_ignore" -Aldflags="-fsanitize=address"
~~ ../dist/threads/t/kill3.t ................................... FAILED Non-zero exit status: 1
  [stdio] -Dcc=clang -Accflags="-Werror=declaration-after-statement -g -fno-omit-frame-pointer -fsanitize=address  -fno-common -fsanitize-blacklist=`pwd`/asan_ignore" -Aldflags="-fsanitize=address" -Duseithreads DEBUGGING
~~ ../dist/threads-shared/t/waithires.t ........................ FAILED Non-zero exit status: 1
  [stdio] -Dcc=clang -Accflags="-Werror=declaration-after-statement -g -fno-omit-frame-pointer -fsanitize=address  -fno-common -fsanitize-blacklist=`pwd`/asan_ignore" -Aldflags="-fsanitize=address" -Duseithreads DEBUGGING
~~ ../dist/threads/t/blocks.t .................................. FAILED Non-zero exit status: 1
  [stdio] -Dcc=clang -Accflags="-Werror=declaration-after-statement -g -fno-omit-frame-pointer -fsanitize=address  -fno-common -fsanitize-blacklist=`pwd`/asan_ignore" -Aldflags="-fsanitize=address" -Duseithreads DEBUGGING
~~ ../t/re/speed_thr.t ......................................... FAILED Non-zero exit status: 1
  [stdio] -Dcc=clang -Accflags="-Werror=declaration-after-statement -g -fno-omit-frame-pointer -fsanitize=address  -fno-common -fsanitize-blacklist=`pwd`/asan_ignore" -Aldflags="-fsanitize=address" -Duseithreads DEBUGGING
~~ ../t/op/threads-dirh.t ...................................... FAILED Non-zero exit status: 1
  [stdio] -Dcc=clang -Accflags="-Werror=declaration-after-statement -g -fno-omit-frame-pointer -fsanitize=address  -fno-common -fsanitize-blacklist=`pwd`/asan_ignore" -Aldflags="-fsanitize=address" -Duseithreads DEBUGGING
~~ ../ext/XS-APItest/t/handy03.t ............................... FAILED Non-zero exit status: 1
  [stdio] -Dcc=clang -Accflags="-Werror=declaration-after-statement -g -fno-omit-frame-pointer -fsanitize=address  -fno-common -fsanitize-blacklist=`pwd`/asan_ignore" -Aldflags="-fsanitize=address" -Duseithreads DEBUGGING
  [stdio] -Dcc=clang -Accflags="-Werror=declaration-after-statement -g -fno-omit-frame-pointer -fsanitize=address  -fno-common -fsanitize-blacklist=`pwd`/asan_ignore" -Aldflags="-fsanitize=address" DEBUGGING
  [stdio] -Dcc=clang -Accflags="-Werror=declaration-after-statement -g -fno-omit-frame-pointer -fsanitize=address  -fno-common -fsanitize-blacklist=`pwd`/asan_ignore" -Aldflags="-fsanitize=address"
~~ ../cpan/Test-Simple/t/Legacy/threads.t ...................... FAILED Non-zero exit status: 1
  [stdio] -Dcc=clang -Accflags="-Werror=declaration-after-statement -g -fno-omit-frame-pointer -fsanitize=address  -fno-common -fsanitize-blacklist=`pwd`/asan_ignore" -Aldflags="-fsanitize=address" -Duseithreads DEBUGGING
~~ ../ext/XS-APItest/t/clone-with-stack.t ...................... FAILED 5
  [stdio] -Dcc=clang -Accflags="-Werror=declaration-after-statement -g -fno-omit-frame-pointer -fsanitize=address  -fno-common -fsanitize-blacklist=`pwd`/asan_ignore" -Aldflags="-fsanitize=address" -Duseithreads DEBUGGING
~~ ../dist/threads/t/err.t ..................................... FAILED Non-zero exit status: 1
  [stdio] -Dcc=clang -Accflags="-Werror=declaration-after-statement -g -fno-omit-frame-pointer -fsanitize=address  -fno-common -fsanitize-blacklist=`pwd`/asan_ignore" -Aldflags="-fsanitize=address" -Duseithreads DEBUGGING
~~ ../cpan/Test-Simple/t/Test2/regression/693_ipc_ordering.t ... FAILED Non-zero exit status: 1
  [stdio] -Dcc=clang -Accflags="-Werror=declaration-after-statement -g -fno-omit-frame-pointer -fsanitize=address  -fno-common -fsanitize-blacklist=`pwd`/asan_ignore" -Aldflags="-fsanitize=address" -Duseithreads DEBUGGING
~~ ../lib/locale_threads.t ..................................... FAILED 2
  [stdio] -Dcc=clang -Accflags="-Werror=declaration-after-statement -g -fno-omit-frame-pointer -fsanitize=address  -fno-common -fsanitize-blacklist=`pwd`/asan_ignore" -Aldflags="-fsanitize=address" -Duseithreads DEBUGGING
~~ ../t/op/qr.t ................................................ FAILED Non-zero exit status: 1
  [stdio] -Dcc=clang -Accflags="-Werror=declaration-after-statement -g -fno-omit-frame-pointer -fsanitize=address  -fno-common -fsanitize-blacklist=`pwd`/asan_ignore" -Aldflags="-fsanitize=address" -Duseithreads DEBUGGING
  [stdio] -Dcc=clang -Accflags="-Werror=declaration-after-statement -g -fno-omit-frame-pointer -fsanitize=address  -fno-common -fsanitize-blacklist=`pwd`/asan_ignore" -Aldflags="-fsanitize=address" DEBUGGING
  [stdio] -Dcc=clang -Accflags="-Werror=declaration-after-statement -g -fno-omit-frame-pointer -fsanitize=address  -fno-common -fsanitize-blacklist=`pwd`/asan_ignore" -Aldflags="-fsanitize=address"
~~ ../dist/Thread-Queue/t/06_insert.t .......................... FAILED Non-zero exit status: 1
  [stdio] -Dcc=clang -Accflags="-Werror=declaration-after-statement -g -fno-omit-frame-pointer -fsanitize=address  -fno-common -fsanitize-blacklist=`pwd`/asan_ignore" -Aldflags="-fsanitize=address" -Duseithreads DEBUGGING
~~ ../dist/threads-shared/t/hv_simple.t ........................ FAILED Non-zero exit status: 1
  [stdio] -Dcc=clang -Accflags="-Werror=declaration-after-statement -g -fno-omit-frame-pointer -fsanitize=address  -fno-common -fsanitize-blacklist=`pwd`/asan_ignore" -Aldflags="-fsanitize=address" -Duseithreads DEBUGGING
~~ ../t/op/substr_thr.t ........................................ FAILED Non-zero exit status: 1
  [stdio] -Dcc=clang -Accflags="-Werror=declaration-after-statement -g -fno-omit-frame-pointer -fsanitize=address  -fno-common -fsanitize-blacklist=`pwd`/asan_ignore" -Aldflags="-fsanitize=address" -Duseithreads DEBUGGING
~~ ../dist/threads/t/libc.t .................................... FAILED Non-zero exit status: 1
  [stdio] -Dcc=clang -Accflags="-Werror=declaration-after-statement -g -fno-omit-frame-pointer -fsanitize=address  -fno-common -fsanitize-blacklist=`pwd`/asan_ignore" -Aldflags="-fsanitize=address" -Duseithreads DEBUGGING
~~ ../t/op/leaky-magic.t ....................................... FAILED Non-zero exit status: 1
  [stdio] -Dcc=clang -Accflags="-Werror=declaration-after-statement -g -fno-omit-frame-pointer -fsanitize=address  -fno-common -fsanitize-blacklist=`pwd`/asan_ignore" -Aldflags="-fsanitize=address" -Duseithreads DEBUGGING
  [stdio] -Dcc=clang -Accflags="-Werror=declaration-after-statement -g -fno-omit-frame-pointer -fsanitize=address  -fno-common -fsanitize-blacklist=`pwd`/asan_ignore" -Aldflags="-fsanitize=address" DEBUGGING
  [stdio] -Dcc=clang -Accflags="-Werror=declaration-after-statement -g -fno-omit-frame-pointer -fsanitize=address  -fno-common -fsanitize-blacklist=`pwd`/asan_ignore" -Aldflags="-fsanitize=address"
~~ ../dist/threads/t/exit.t .................................... FAILED Non-zero exit status: 1
  [stdio] -Dcc=clang -Accflags="-Werror=declaration-after-statement -g -fno-omit-frame-pointer -fsanitize=address  -fno-common -fsanitize-blacklist=`pwd`/asan_ignore" -Aldflags="-fsanitize=address" -Duseithreads DEBUGGING
~~ ../dist/threads/t/end.t ..................................... FAILED Non-zero exit status: 1
  [stdio] -Dcc=clang -Accflags="-Werror=declaration-after-statement -g -fno-omit-frame-pointer -fsanitize=address  -fno-common -fsanitize-blacklist=`pwd`/asan_ignore" -Aldflags="-fsanitize=address" -Duseithreads DEBUGGING
~~ ../dist/Thread-Semaphore/t/05_force.t ....................... FAILED Non-zero exit status: 1
  [stdio] -Dcc=clang -Accflags="-Werror=declaration-after-statement -g -fno-omit-frame-pointer -fsanitize=address  -fno-common -fsanitize-blacklist=`pwd`/asan_ignore" -Aldflags="-fsanitize=address" -Duseithreads DEBUGGING
~~ ../dist/Thread-Semaphore/t/06_timed.t ....................... FAILED Non-zero exit status: 1
  [stdio] -Dcc=clang -Accflags="-Werror=declaration-after-statement -g -fno-omit-frame-pointer -fsanitize=address  -fno-common -fsanitize-blacklist=`pwd`/asan_ignore" -Aldflags="-fsanitize=address" -Duseithreads DEBUGGING
~~ ../dist/threads-shared/t/wait.t ............................. FAILED Non-zero exit status: 1
  [stdio] -Dcc=clang -Accflags="-Werror=declaration-after-statement -g -fno-omit-frame-pointer -fsanitize=address  -fno-common -fsanitize-blacklist=`pwd`/asan_ignore" -Aldflags="-fsanitize=address" -Duseithreads DEBUGGING
~~ ../t/op/lexsub.t ............................................ FAILED Non-zero exit status: 1
  [stdio] -Dcc=clang -Accflags="-Werror=declaration-after-statement -g -fno-omit-frame-pointer -fsanitize=address  -fno-common -fsanitize-blacklist=`pwd`/asan_ignore" -Aldflags="-fsanitize=address" -Duseithreads DEBUGGING
~~ ../ext/XS-APItest/t/handy02.t ............................... FAILED Non-zero exit status: 1
  [stdio] -Dcc=clang -Accflags="-Werror=declaration-after-statement -g -fno-omit-frame-pointer -fsanitize=address  -fno-common -fsanitize-blacklist=`pwd`/asan_ignore" -Aldflags="-fsanitize=address" -Duseithreads DEBUGGING
  [stdio] -Dcc=clang -Accflags="-Werror=declaration-after-statement -g -fno-omit-frame-pointer -fsanitize=address  -fno-common -fsanitize-blacklist=`pwd`/asan_ignore" -Aldflags="-fsanitize=address" DEBUGGING
  [stdio] -Dcc=clang -Accflags="-Werror=declaration-after-statement -g -fno-omit-frame-pointer -fsanitize=address  -fno-common -fsanitize-blacklist=`pwd`/asan_ignore" -Aldflags="-fsanitize=address"
~~ ../cpan/Test-Simple/t/Test2/acceptance/try_it_threads.t ..... FAILED Non-zero exit status: 1
  [stdio] -Dcc=clang -Accflags="-Werror=declaration-after-statement -g -fno-omit-frame-pointer -fsanitize=address  -fno-common -fsanitize-blacklist=`pwd`/asan_ignore" -Aldflags="-fsanitize=address" -Duseithreads DEBUGGING
~~ ../ext/XS-APItest/t/swaplabel.t ............................. FAILED Non-zero exit status: 1
  [stdio] -Dcc=clang -Accflags="-Werror=declaration-after-statement -g -fno-omit-frame-pointer -fsanitize=address  -fno-common -fsanitize-blacklist=`pwd`/asan_ignore" -Aldflags="-fsanitize=address" -Duseithreads DEBUGGING
  [stdio] -Dcc=clang -Accflags="-Werror=declaration-after-statement -g -fno-omit-frame-pointer -fsanitize=address  -fno-common -fsanitize-blacklist=`pwd`/asan_ignore" -Aldflags="-fsanitize=address" DEBUGGING
  [stdio] -Dcc=clang -Accflags="-Werror=declaration-after-statement -g -fno-omit-frame-pointer -fsanitize=address  -fno-common -fsanitize-blacklist=`pwd`/asan_ignore" -Aldflags="-fsanitize=address"
~~ ../dist/threads-shared/t/object2.t .......................... FAILED Non-zero exit status: 1
  [stdio] -Dcc=clang -Accflags="-Werror=declaration-after-statement -g -fno-omit-frame-pointer -fsanitize=address  -fno-common -fsanitize-blacklist=`pwd`/asan_ignore" -Aldflags="-fsanitize=address" -Duseithreads DEBUGGING
~~ ../cpan/Test-Simple/t/Legacy/Regression/683_thread_todo.t ... FAILED Non-zero exit status: 1
  [stdio] -Dcc=clang -Accflags="-Werror=declaration-after-statement -g -fno-omit-frame-pointer -fsanitize=address  -fno-common -fsanitize-blacklist=`pwd`/asan_ignore" -Aldflags="-fsanitize=address" -Duseithreads DEBUGGING
~~ ../t/re/pat_psycho_thr.t .................................... FAILED Non-zero exit status: 1
  [stdio] -Dcc=clang -Accflags="-Werror=declaration-after-statement -g -fno-omit-frame-pointer -fsanitize=address  -fno-common -fsanitize-blacklist=`pwd`/asan_ignore" -Aldflags="-fsanitize=address" -Duseithreads DEBUGGING
~~ ../dist/Thread-Queue/t/03_peek.t ............................ FAILED Non-zero exit status: 1
  [stdio] -Dcc=clang -Accflags="-Werror=declaration-after-statement -g -fno-omit-frame-pointer -fsanitize=address  -fno-common -fsanitize-blacklist=`pwd`/asan_ignore" -Aldflags="-fsanitize=address" -Duseithreads DEBUGGING
~~ ../lib/Thread.t ............................................. FAILED Non-zero exit status: 1
  [stdio] -Dcc=clang -Accflags="-Werror=declaration-after-statement -g -fno-omit-frame-pointer -fsanitize=address  -fno-common -fsanitize-blacklist=`pwd`/asan_ignore" -Aldflags="-fsanitize=address" -Duseithreads DEBUGGING
~~ ../t/re/pat_advanced_thr.t .................................. FAILED Non-zero exit status: 1
  [stdio] -Dcc=clang -Accflags="-Werror=declaration-after-statement -g -fno-omit-frame-pointer -fsanitize=address  -fno-common -fsanitize-blacklist=`pwd`/asan_ignore" -Aldflags="-fsanitize=address" -Duseithreads DEBUGGING
~~ ../dist/threads/t/kill2.t ................................... FAILED Non-zero exit status: 1
  [stdio] -Dcc=clang -Accflags="-Werror=declaration-after-statement -g -fno-omit-frame-pointer -fsanitize=address  -fno-common -fsanitize-blacklist=`pwd`/asan_ignore" -Aldflags="-fsanitize=address" -Duseithreads DEBUGGING
~~ ../lib/warnings.t ........................................... FAILED 149-150
  [stdio] -Dcc=clang -Accflags="-Werror=declaration-after-statement -g -fno-omit-frame-pointer -fsanitize=address  -fno-common -fsanitize-blacklist=`pwd`/asan_ignore" -Aldflags="-fsanitize=address" -Duseithreads DEBUGGING
  [stdio] -Dcc=clang -Accflags="-Werror=declaration-after-statement -g -fno-omit-frame-pointer -fsanitize=address  -fno-common -fsanitize-blacklist=`pwd`/asan_ignore" -Aldflags="-fsanitize=address" DEBUGGING
  [stdio] -Dcc=clang -Accflags="-Werror=declaration-after-statement -g -fno-omit-frame-pointer -fsanitize=address  -fno-common -fsanitize-blacklist=`pwd`/asan_ignore" -Aldflags="-fsanitize=address"
~~ ../ext/XS-APItest/t/load-module.t ........................... FAILED Non-zero exit status: 1
  [stdio] -Dcc=clang -Accflags="-Werror=declaration-after-statement -g -fno-omit-frame-pointer -fsanitize=address  -fno-common -fsanitize-blacklist=`pwd`/asan_ignore" -Aldflags="-fsanitize=address" -Duseithreads DEBUGGING
  [stdio] -Dcc=clang -Accflags="-Werror=declaration-after-statement -g -fno-omit-frame-pointer -fsanitize=address  -fno-common -fsanitize-blacklist=`pwd`/asan_ignore" -Aldflags="-fsanitize=address" DEBUGGING
  [stdio] -Dcc=clang -Accflags="-Werror=declaration-after-statement -g -fno-omit-frame-pointer -fsanitize=address  -fno-common -fsanitize-blacklist=`pwd`/asan_ignore" -Aldflags="-fsanitize=address"
~~ ../dist/threads/t/stress_string.t ........................... FAILED Non-zero exit status: 1
  [stdio] -Dcc=clang -Accflags="-Werror=declaration-after-statement -g -fno-omit-frame-pointer -fsanitize=address  -fno-common -fsanitize-blacklist=`pwd`/asan_ignore" -Aldflags="-fsanitize=address" -Duseithreads DEBUGGING
~~ ../dist/threads/t/stack.t ................................... FAILED Non-zero exit status: 1
  [stdio] -Dcc=clang -Accflags="-Werror=declaration-after-statement -g -fno-omit-frame-pointer -fsanitize=address  -fno-common -fsanitize-blacklist=`pwd`/asan_ignore" -Aldflags="-fsanitize=address" -Duseithreads DEBUGGING
~~ ../dist/threads-shared/t/clone.t ............................ FAILED Non-zero exit status: 1
  [stdio] -Dcc=clang -Accflags="-Werror=declaration-after-statement -g -fno-omit-frame-pointer -fsanitize=address  -fno-common -fsanitize-blacklist=`pwd`/asan_ignore" -Aldflags="-fsanitize=address" -Duseithreads DEBUGGING
~~ ../dist/threads-shared/t/blessed.t .......................... FAILED Non-zero exit status: 1
  [stdio] -Dcc=clang -Accflags="-Werror=declaration-after-statement -g -fno-omit-frame-pointer -fsanitize=address  -fno-common -fsanitize-blacklist=`pwd`/asan_ignore" -Aldflags="-fsanitize=address" -Duseithreads DEBUGGING
~~ ../dist/Storable/t/blessed.t ................................ FAILED Non-zero exit status: 1
  [stdio] -Dcc=clang -Accflags="-Werror=declaration-after-statement -g -fno-omit-frame-pointer -fsanitize=address  -fno-common -fsanitize-blacklist=`pwd`/asan_ignore" -Aldflags="-fsanitize=address" -Duseithreads DEBUGGING
  [stdio] -Dcc=clang -Accflags="-Werror=declaration-after-statement -g -fno-omit-frame-pointer -fsanitize=address  -fno-common -fsanitize-blacklist=`pwd`/asan_ignore" -Aldflags="-fsanitize=address" DEBUGGING
~~ ../ext/re/t/re_funcs_u.t .................................... FAILED Non-zero exit status: 1
  [stdio] -Dcc=clang -Accflags="-Werror=declaration-after-statement -g -fno-omit-frame-pointer -fsanitize=address  -fno-common -fsanitize-blacklist=`pwd`/asan_ignore" -Aldflags="-fsanitize=address" -Duseithreads DEBUGGING
  [stdio] -Dcc=clang -Accflags="-Werror=declaration-after-statement -g -fno-omit-frame-pointer -fsanitize=address  -fno-common -fsanitize-blacklist=`pwd`/asan_ignore" -Aldflags="-fsanitize=address" DEBUGGING
  [stdio] -Dcc=clang -Accflags="-Werror=declaration-after-statement -g -fno-omit-frame-pointer -fsanitize=address  -fno-common -fsanitize-blacklist=`pwd`/asan_ignore" -Aldflags="-fsanitize=address"
~~ ../dist/threads-shared/t/object.t ........................... FAILED Non-zero exit status: 1
  [stdio] -Dcc=clang -Accflags="-Werror=declaration-after-statement -g -fno-omit-frame-pointer -fsanitize=address  -fno-common -fsanitize-blacklist=`pwd`/asan_ignore" -Aldflags="-fsanitize=address" -Duseithreads DEBUGGING
~~ ../dist/threads-shared/t/av_simple.t ........................ FAILED Non-zero exit status: 1
  [stdio] -Dcc=clang -Accflags="-Werror=declaration-after-statement -g -fno-omit-frame-pointer -fsanitize=address  -fno-common -fsanitize-blacklist=`pwd`/asan_ignore" -Aldflags="-fsanitize=address" -Duseithreads DEBUGGING
~~ ../dist/Thread-Queue/t/02_refs.t ............................ FAILED Non-zero exit status: 1
  [stdio] -Dcc=clang -Accflags="-Werror=declaration-after-statement -g -fno-omit-frame-pointer -fsanitize=address  -fno-common -fsanitize-blacklist=`pwd`/asan_ignore" -Aldflags="-fsanitize=address" -Duseithreads DEBUGGING
~~ ../dist/threads-shared/t/hv_refs.t .......................... FAILED Non-zero exit status: 1
  [stdio] -Dcc=clang -Accflags="-Werror=declaration-after-statement -g -fno-omit-frame-pointer -fsanitize=address  -fno-common -fsanitize-blacklist=`pwd`/asan_ignore" -Aldflags="-fsanitize=address" -Duseithreads DEBUGGING
~~ ../dist/Storable/t/threads.t ................................ FAILED Non-zero exit status: 1
  [stdio] -Dcc=clang -Accflags="-Werror=declaration-after-statement -g -fno-omit-frame-pointer -fsanitize=address  -fno-common -fsanitize-blacklist=`pwd`/asan_ignore" -Aldflags="-fsanitize=address" -Duseithreads DEBUGGING
~~ ../dist/threads/t/basic.t ................................... FAILED Non-zero exit status: 1
  [stdio] -Dcc=clang -Accflags="-Werror=declaration-after-statement -g -fno-omit-frame-pointer -fsanitize=address  -fno-common -fsanitize-blacklist=`pwd`/asan_ignore" -Aldflags="-fsanitize=address" -Duseithreads DEBUGGING
~~ ../dist/threads/t/free2.t ................................... FAILED Non-zero exit status: 1
  [stdio] -Dcc=clang -Accflags="-Werror=declaration-after-statement -g -fno-omit-frame-pointer -fsanitize=address  -fno-common -fsanitize-blacklist=`pwd`/asan_ignore" -Aldflags="-fsanitize=address" -Duseithreads DEBUGGING
~~ ../dist/threads-shared/t/sv_refs.t .......................... FAILED Non-zero exit status: 1
  [stdio] -Dcc=clang -Accflags="-Werror=declaration-after-statement -g -fno-omit-frame-pointer -fsanitize=address  -fno-common -fsanitize-blacklist=`pwd`/asan_ignore" -Aldflags="-fsanitize=address" -Duseithreads DEBUGGING
~~ ../dist/Thread-Semaphore/t/04_nonblocking.t ................. FAILED Non-zero exit status: 1
  [stdio] -Dcc=clang -Accflags="-Werror=declaration-after-statement -g -fno-omit-frame-pointer -fsanitize=address  -fno-common -fsanitize-blacklist=`pwd`/asan_ignore" -Aldflags="-fsanitize=address" -Duseithreads DEBUGGING

Test todo-passed:
~~ ../cpan/Module-Metadata/t/extract-version.t ................. PASSED 7 51 91 130 165 203
  [stdio] -Dcc=clang -Accflags="-Werror=declaration-after-statement -g -fno-omit-frame-pointer -fsanitize=address  -fno-common -fsanitize-blacklist=`pwd`/asan_ignore" -Aldflags="-fsanitize=address" -Duseithreads DEBUGGING
  [stdio] -Dcc=clang -Accflags="-Werror=declaration-after-statement -g -fno-omit-frame-pointer -fsanitize=address  -fno-common -fsanitize-blacklist=`pwd`/asan_ignore" -Aldflags="-fsanitize=address" DEBUGGING
  [stdio] -Dcc=clang -Accflags="-Werror=declaration-after-statement -g -fno-omit-frame-pointer -fsanitize=address  -fno-common -fsanitize-blacklist=`pwd`/asan_ignore" -Aldflags="-fsanitize=address"

MANIFEST messages:

Compiler messages:
  Encode.c:1356:5: warning: unused variable 'ix' [-Wunused-variable]
  ../../XSUB.h:185:20: note: expanded from macro 'dXSI32'
  Encode.c:1398:5: warning: unused variable 'ix' [-Wunused-variable]
  ./const-xs.inc:128:42: warning: AI_IDN_ALLOW_UNASSIGNED is deprecated [-W#pragma-messages]
  /usr/include/netdb.h:609:3: note: expanded from macro 'AI_IDN_ALLOW_UNASSIGNED'
  /usr/include/sys/cdefs.h:485:3: note: expanded from macro '__glibc_macro_warning'
  /usr/include/sys/cdefs.h:483:42: note: expanded from macro '__glibc_macro_warning1'
  :114:6: note: expanded from here
  ./const-xs.inc:131:46: warning: AI_IDN_USE_STD3_ASCII_RULES is deprecated [-W#pragma-messages]
  /usr/include/netdb.h:611:3: note: expanded from macro 'AI_IDN_USE_STD3_ASCII_RULES'
  :117:6: note: expanded from here
  ./const-xs.inc:383:42: warning: NI_IDN_ALLOW_UNASSIGNED is deprecated [-W#pragma-messages]
  /usr/include/netdb.h:650:3: note: expanded from macro 'NI_IDN_ALLOW_UNASSIGNED'
  :120:6: note: expanded from here
  ./const-xs.inc:386:46: warning: NI_IDN_USE_STD3_ASCII_RULES is deprecated [-W#pragma-messages]
  /usr/include/netdb.h:652:3: note: expanded from macro 'NI_IDN_USE_STD3_ASCII_RULES'
  :123:6: note: expanded from here

About this smoke:
    smoking-perl: 5.28.1
  smoker-version: 1.72/0.046
       timestamp: 2019-03-23 16:25:59+00
          tester: perl

Enabled stack-use-after-return (Linux/Darwin) and leak-detection (Linux).  Smoke logs available at http://m-l.org/~perl/smoke/perl/linux/blead_clang_quick_sanitize=address/logd9a91485293e1414746fd028b3782f699519105e.log.gz
-- 
Report generated by Test::Smoke::Gateway v0.09_01