Show logfile
Automated smoke report for branch blead 5.29.10 patch 39ce401c1db32fe69d69d11cfd7b62071e52f43a v5.29.9-14-g39ce401c1d
cjg-hipster: i86pc (2250MHz) (i386/1 cpus)
    on        Solaris 2.11
    using     gcc version 6.5.0 (*1)
    smoketime 6 hours 4 minutes (average 45 minutes 32 seconds)

Summary: FAIL(F)

O = OK  F = Failure(s), extended report at the bottom
X = Failure(s) under TEST but not under harness
? = still running or test results not (yet) available
Build failures during:       - = unknown or N/A
c = Configure, m = make, M = make (after miniperl), t = make test-prep

v5.29.9-14-g39ce401c1d
---------------------- ----------------------------------------------------
O  O                    -Dcc=gcc (*1)
O  O                    -Dcc=gcc -Duse64bitall (*1)
F  F                    -Dcc=gcc -Duseithreads (*1)
F  F                    -Dcc=gcc -Duseithreads -Duse64bitall (*1)
|  |
|  +------------------  stdio DEBUGGING
+---------------------  stdio

Applied patches:
  SMOKE39ce401c1db32fe69d69d11cfd7b62071e52f43a

Skipped tests:
      # One test name on a line

Test failures:
~~ ../dist/threads/t/stress_cv.t ............................... FAILED Bad plan.  You planned 61 tests but ran 20.
  [stdio] -Dcc=gcc -Duseithreads -Duse64bitall DEBUGGING
~~ ../cpan/Digest-MD5/t/threads.t .............................. FAILED Bad plan.  You planned 2 tests but ran 0.
  [stdio] -Dcc=gcc -Duseithreads
  [stdio] -Dcc=gcc -Duseithreads -Duse64bitall DEBUGGING
  [stdio] -Dcc=gcc -Duseithreads DEBUGGING
  [stdio] -Dcc=gcc -Duseithreads -Duse64bitall
~~ ../dist/threads/t/stress_cv.t ............................... FAILED Bad plan.  You planned 61 tests but ran 48.
  [stdio] -Dcc=gcc -Duseithreads DEBUGGING
~~ ../dist/threads-shared/t/hv_refs.t .......................... FAILED Bad plan.  You planned 20 tests but ran 5.
  [stdio] -Dcc=gcc -Duseithreads
  [stdio] -Dcc=gcc -Duseithreads -Duse64bitall DEBUGGING
  [stdio] -Dcc=gcc -Duseithreads DEBUGGING
  [stdio] -Dcc=gcc -Duseithreads -Duse64bitall
~~ ../dist/Thread-Queue/t/10_timed.t ........................... FAILED Bad plan.  You planned 19 tests but ran 2.
  [stdio] -Dcc=gcc -Duseithreads
  [stdio] -Dcc=gcc -Duseithreads -Duse64bitall DEBUGGING
  [stdio] -Dcc=gcc -Duseithreads DEBUGGING
  [stdio] -Dcc=gcc -Duseithreads -Duse64bitall
~~ ../cpan/DB_File/t/db-threads.t .............................. FAILED Bad plan.  You planned 7 tests but ran 4.
  [stdio] -Dcc=gcc -Duseithreads
  [stdio] -Dcc=gcc -Duseithreads -Duse64bitall DEBUGGING
  [stdio] -Dcc=gcc -Duseithreads DEBUGGING
  [stdio] -Dcc=gcc -Duseithreads -Duse64bitall
~~ ../dist/threads/t/stress_cv.t ............................... FAILED Bad plan.  You planned 61 tests but ran 15.
  [stdio] -Dcc=gcc -Duseithreads
~~ ../dist/Thread-Queue/t/09_ended.t ........................... FAILED Bad plan.  You planned 60 tests but ran 14.
  [stdio] -Dcc=gcc -Duseithreads
  [stdio] -Dcc=gcc -Duseithreads -Duse64bitall DEBUGGING
  [stdio] -Dcc=gcc -Duseithreads DEBUGGING
  [stdio] -Dcc=gcc -Duseithreads -Duse64bitall
~~ ../dist/Thread-Queue/t/03_peek.t ............................ FAILED Bad plan.  You planned 19 tests but ran 1.
  [stdio] -Dcc=gcc -Duseithreads
  [stdio] -Dcc=gcc -Duseithreads -Duse64bitall DEBUGGING
  [stdio] -Dcc=gcc -Duseithreads DEBUGGING
  [stdio] -Dcc=gcc -Duseithreads -Duse64bitall
~~ ../dist/threads/t/libc.t .................................... FAILED Bad plan.  You planned 11 tests but ran 1.
  [stdio] -Dcc=gcc -Duseithreads
  [stdio] -Dcc=gcc -Duseithreads -Duse64bitall DEBUGGING
  [stdio] -Dcc=gcc -Duseithreads DEBUGGING
  [stdio] -Dcc=gcc -Duseithreads -Duse64bitall
~~ ../t/run/switches.t ......................................... FAILED 121
  [stdio] -Dcc=gcc -Duseithreads
  [stdio] -Dcc=gcc -Duseithreads -Duse64bitall DEBUGGING
  [stdio] -Dcc=gcc -Duseithreads DEBUGGING
  [stdio] -Dcc=gcc -Duseithreads -Duse64bitall
~~ ../dist/threads/t/stress_string.t ........................... FAILED Bad plan.  You planned 61 tests but ran 31.
  [stdio] -Dcc=gcc -Duseithreads DEBUGGING
~~ ../dist/threads/t/exit.t .................................... FAILED Bad plan.  You planned 18 tests but ran 5.
  [stdio] -Dcc=gcc -Duseithreads
  [stdio] -Dcc=gcc -Duseithreads -Duse64bitall DEBUGGING
  [stdio] -Dcc=gcc -Duseithreads DEBUGGING
  [stdio] -Dcc=gcc -Duseithreads -Duse64bitall
~~ ../dist/threads-shared/t/wait.t ............................. FAILED Bad plan.  You planned 91 tests but ran 11.
  [stdio] -Dcc=gcc -Duseithreads
  [stdio] -Dcc=gcc -Duseithreads -Duse64bitall DEBUGGING
  [stdio] -Dcc=gcc -Duseithreads DEBUGGING
  [stdio] -Dcc=gcc -Duseithreads -Duse64bitall
~~ ../t/op/threads.t ........................................... FAILED 1 Bad plan.  You planned 30 tests but ran 9.
  [stdio] -Dcc=gcc -Duseithreads
  [stdio] -Dcc=gcc -Duseithreads -Duse64bitall DEBUGGING
  [stdio] -Dcc=gcc -Duseithreads DEBUGGING
  [stdio] -Dcc=gcc -Duseithreads -Duse64bitall
~~ ../cpan/Test-Simple/t/Test2/regression/693_ipc_ordering.t ... FAILED No plan found in TAP output
  [stdio] -Dcc=gcc -Duseithreads
  [stdio] -Dcc=gcc -Duseithreads -Duse64bitall DEBUGGING
  [stdio] -Dcc=gcc -Duseithreads DEBUGGING
  [stdio] -Dcc=gcc -Duseithreads -Duse64bitall
~~ ../dist/threads-shared/t/clone.t ............................ FAILED Bad plan.  You planned 40 tests but ran 6.
  [stdio] -Dcc=gcc -Duseithreads
  [stdio] -Dcc=gcc -Duseithreads -Duse64bitall DEBUGGING
  [stdio] -Dcc=gcc -Duseithreads DEBUGGING
  [stdio] -Dcc=gcc -Duseithreads -Duse64bitall
~~ ../ext/XS-APItest/t/my_cxt.t ................................ FAILED Bad plan.  You planned 16 tests but ran 7.
  [stdio] -Dcc=gcc -Duseithreads
  [stdio] -Dcc=gcc -Duseithreads -Duse64bitall DEBUGGING
  [stdio] -Dcc=gcc -Duseithreads DEBUGGING
  [stdio] -Dcc=gcc -Duseithreads -Duse64bitall
~~ ../dist/threads-shared/t/object.t ........................... FAILED Bad plan.  You planned 28 tests but ran 16.
  [stdio] -Dcc=gcc -Duseithreads
  [stdio] -Dcc=gcc -Duseithreads -Duse64bitall DEBUGGING
  [stdio] -Dcc=gcc -Duseithreads DEBUGGING
  [stdio] -Dcc=gcc -Duseithreads -Duse64bitall
~~ ../dist/threads/t/problems.t ................................ FAILED Bad plan.  You planned 10 tests but ran 5.
  [stdio] -Dcc=gcc -Duseithreads
  [stdio] -Dcc=gcc -Duseithreads -Duse64bitall DEBUGGING
  [stdio] -Dcc=gcc -Duseithreads DEBUGGING
  [stdio] -Dcc=gcc -Duseithreads -Duse64bitall
~~ ../dist/threads/t/free.t .................................... FAILED Bad plan.  You planned 29 tests but ran 1.
  [stdio] -Dcc=gcc -Duseithreads
  [stdio] -Dcc=gcc -Duseithreads -Duse64bitall DEBUGGING
  [stdio] -Dcc=gcc -Duseithreads DEBUGGING
  [stdio] -Dcc=gcc -Duseithreads -Duse64bitall
~~ ../ext/Hash-Util-FieldHash/t/03_class.t ..................... FAILED Bad plan.  You planned 7 tests but ran 2.
  [stdio] -Dcc=gcc -Duseithreads
  [stdio] -Dcc=gcc -Duseithreads -Duse64bitall DEBUGGING
  [stdio] -Dcc=gcc -Duseithreads DEBUGGING
  [stdio] -Dcc=gcc -Duseithreads -Duse64bitall
~~ ../cpan/Test-Simple/t/Test2/modules/API/Instance.t .......... FAILED No plan found in TAP output
  [stdio] -Dcc=gcc -Duseithreads
  [stdio] -Dcc=gcc -Duseithreads -Duse64bitall DEBUGGING
  [stdio] -Dcc=gcc -Duseithreads DEBUGGING
  [stdio] -Dcc=gcc -Duseithreads -Duse64bitall
~~ ../dist/threads-shared/t/blessed.t .......................... FAILED Bad plan.  You planned 37 tests but ran 25.
  [stdio] -Dcc=gcc -Duseithreads
  [stdio] -Dcc=gcc -Duseithreads -Duse64bitall DEBUGGING
  [stdio] -Dcc=gcc -Duseithreads DEBUGGING
  [stdio] -Dcc=gcc -Duseithreads -Duse64bitall
~~ ../dist/Thread-Semaphore/t/05_force.t ....................... FAILED Bad plan.  You planned 8 tests but ran 5.
  [stdio] -Dcc=gcc -Duseithreads
  [stdio] -Dcc=gcc -Duseithreads -Duse64bitall DEBUGGING
  [stdio] -Dcc=gcc -Duseithreads DEBUGGING
  [stdio] -Dcc=gcc -Duseithreads -Duse64bitall
~~ ../dist/Thread-Semaphore/t/01_basic.t ....................... FAILED Bad plan.  You planned 10 tests but ran 7.
  [stdio] -Dcc=gcc -Duseithreads
  [stdio] -Dcc=gcc -Duseithreads -Duse64bitall DEBUGGING
  [stdio] -Dcc=gcc -Duseithreads DEBUGGING
  [stdio] -Dcc=gcc -Duseithreads -Duse64bitall
~~ ../dist/threads/t/kill.t .................................... FAILED Bad plan.  You planned 18 tests but ran 2.
  [stdio] -Dcc=gcc -Duseithreads
  [stdio] -Dcc=gcc -Duseithreads -Duse64bitall DEBUGGING
  [stdio] -Dcc=gcc -Duseithreads DEBUGGING
  [stdio] -Dcc=gcc -Duseithreads -Duse64bitall
~~ ../ext/PerlIO-scalar/t/scalar.t ............................. FAILED Bad plan.  You planned 123 tests but ran 82.
  [stdio] -Dcc=gcc -Duseithreads
  [stdio] -Dcc=gcc -Duseithreads -Duse64bitall DEBUGGING
  [stdio] -Dcc=gcc -Duseithreads DEBUGGING
  [stdio] -Dcc=gcc -Duseithreads -Duse64bitall
~~ ../dist/threads-shared/t/sv_simple.t ........................ FAILED Bad plan.  You planned 11 tests but ran 8.
  [stdio] -Dcc=gcc -Duseithreads
  [stdio] -Dcc=gcc -Duseithreads -Duse64bitall DEBUGGING
  [stdio] -Dcc=gcc -Duseithreads DEBUGGING
  [stdio] -Dcc=gcc -Duseithreads -Duse64bitall
~~ ../dist/threads-shared/t/dualvar.t .......................... FAILED Bad plan.  You planned 226 tests but ran 224.
  [stdio] -Dcc=gcc -Duseithreads
  [stdio] -Dcc=gcc -Duseithreads -Duse64bitall DEBUGGING
  [stdio] -Dcc=gcc -Duseithreads DEBUGGING
  [stdio] -Dcc=gcc -Duseithreads -Duse64bitall
~~ ../dist/threads-shared/t/sv_refs.t .......................... FAILED Bad plan.  You planned 21 tests but ran 7.
  [stdio] -Dcc=gcc -Duseithreads
  [stdio] -Dcc=gcc -Duseithreads -Duse64bitall DEBUGGING
  [stdio] -Dcc=gcc -Duseithreads DEBUGGING
  [stdio] -Dcc=gcc -Duseithreads -Duse64bitall
~~ ../t/re/regexp_qr_embed_thr.t ............................... FAILED No plan found in TAP output
  [stdio] -Dcc=gcc -Duseithreads
  [stdio] -Dcc=gcc -Duseithreads -Duse64bitall DEBUGGING
  [stdio] -Dcc=gcc -Duseithreads DEBUGGING
  [stdio] -Dcc=gcc -Duseithreads -Duse64bitall
~~ ../dist/threads/t/stress_string.t ........................... FAILED Bad plan.  You planned 61 tests but ran 30.
  [stdio] -Dcc=gcc -Duseithreads
~~ ../dist/Thread-Queue/t/06_insert.t .......................... FAILED Bad plan.  You planned 16 tests but ran 1.
  [stdio] -Dcc=gcc -Duseithreads
  [stdio] -Dcc=gcc -Duseithreads -Duse64bitall DEBUGGING
  [stdio] -Dcc=gcc -Duseithreads DEBUGGING
  [stdio] -Dcc=gcc -Duseithreads -Duse64bitall
~~ ../dist/Thread-Queue/t/11_limit.t ........................... FAILED Bad plan.  You planned 13 tests but ran 7.
  [stdio] -Dcc=gcc -Duseithreads
  [stdio] -Dcc=gcc -Duseithreads -Duse64bitall DEBUGGING
  [stdio] -Dcc=gcc -Duseithreads DEBUGGING
  [stdio] -Dcc=gcc -Duseithreads -Duse64bitall
~~ ../dist/Thread-Queue/t/02_refs.t ............................ FAILED Bad plan.  You planned 46 tests but ran 6.
  [stdio] -Dcc=gcc -Duseithreads
  [stdio] -Dcc=gcc -Duseithreads -Duse64bitall DEBUGGING
  [stdio] -Dcc=gcc -Duseithreads DEBUGGING
  [stdio] -Dcc=gcc -Duseithreads -Duse64bitall
~~ ../dist/threads/t/stress_string.t ........................... FAILED Bad plan.  You planned 61 tests but ran 11.
  [stdio] -Dcc=gcc -Duseithreads -Duse64bitall DEBUGGING
~~ ../dist/threads/t/basic.t ................................... FAILED Bad plan.  You planned 34 tests but ran 3.
  [stdio] -Dcc=gcc -Duseithreads
  [stdio] -Dcc=gcc -Duseithreads -Duse64bitall DEBUGGING
  [stdio] -Dcc=gcc -Duseithreads DEBUGGING
  [stdio] -Dcc=gcc -Duseithreads -Duse64bitall
~~ ../dist/threads-shared/t/shared_attr.t ...................... FAILED Bad plan.  You planned 101 tests but ran 4.
  [stdio] -Dcc=gcc -Duseithreads
  [stdio] -Dcc=gcc -Duseithreads -Duse64bitall DEBUGGING
  [stdio] -Dcc=gcc -Duseithreads DEBUGGING
  [stdio] -Dcc=gcc -Duseithreads -Duse64bitall
~~ ../lib/Thread.t ............................................. FAILED Bad plan.  You planned 13 tests but ran 4.
  [stdio] -Dcc=gcc -Duseithreads
  [stdio] -Dcc=gcc -Duseithreads -Duse64bitall DEBUGGING
  [stdio] -Dcc=gcc -Duseithreads DEBUGGING
  [stdio] -Dcc=gcc -Duseithreads -Duse64bitall
~~ ../dist/threads-shared/t/hv_simple.t ........................ FAILED Bad plan.  You planned 16 tests but ran 2.
  [stdio] -Dcc=gcc -Duseithreads
  [stdio] -Dcc=gcc -Duseithreads -Duse64bitall DEBUGGING
  [stdio] -Dcc=gcc -Duseithreads DEBUGGING
  [stdio] -Dcc=gcc -Duseithreads -Duse64bitall
~~ ../dist/Thread-Queue/t/01_basic.t ........................... FAILED Bad plan.  You planned 81 tests but ran 2.
  [stdio] -Dcc=gcc -Duseithreads
  [stdio] -Dcc=gcc -Duseithreads -Duse64bitall DEBUGGING
  [stdio] -Dcc=gcc -Duseithreads DEBUGGING
  [stdio] -Dcc=gcc -Duseithreads -Duse64bitall
~~ ../dist/threads/t/stack.t ................................... FAILED Bad plan.  You planned 18 tests but ran 10.
  [stdio] -Dcc=gcc -Duseithreads
  [stdio] -Dcc=gcc -Duseithreads -Duse64bitall DEBUGGING
  [stdio] -Dcc=gcc -Duseithreads DEBUGGING
  [stdio] -Dcc=gcc -Duseithreads -Duse64bitall
~~ ../cpan/Test-Simple/t/Legacy/Regression/683_thread_todo.t ... FAILED No plan found in TAP output
  [stdio] -Dcc=gcc -Duseithreads
  [stdio] -Dcc=gcc -Duseithreads -Duse64bitall DEBUGGING
  [stdio] -Dcc=gcc -Duseithreads DEBUGGING
  [stdio] -Dcc=gcc -Duseithreads -Duse64bitall
~~ ../dist/threads/t/stress_re.t ............................... FAILED Bad plan.  You planned 61 tests but ran 17.
  [stdio] -Dcc=gcc -Duseithreads
~~ ../ext/Hash-Util-FieldHash/t/04_thread.t .................... FAILED Bad plan.  You planned 30 tests but ran 6.
  [stdio] -Dcc=gcc -Duseithreads
  [stdio] -Dcc=gcc -Duseithreads -Duse64bitall DEBUGGING
  [stdio] -Dcc=gcc -Duseithreads DEBUGGING
  [stdio] -Dcc=gcc -Duseithreads -Duse64bitall
~~ ../dist/threads-shared/t/cond.t ............................. FAILED Bad plan.  You planned 32 tests but ran 5.
  [stdio] -Dcc=gcc -Duseithreads
  [stdio] -Dcc=gcc -Duseithreads -Duse64bitall DEBUGGING
  [stdio] -Dcc=gcc -Duseithreads DEBUGGING
  [stdio] -Dcc=gcc -Duseithreads -Duse64bitall
~~ ../dist/threads/t/stress_re.t ............................... FAILED Bad plan.  You planned 61 tests but ran 31.
  [stdio] -Dcc=gcc -Duseithreads DEBUGGING
~~ ../ext/PerlIO-encoding/t/threads.t .......................... FAILED Bad plan.  You planned 4 tests but ran 0.
  [stdio] -Dcc=gcc -Duseithreads
  [stdio] -Dcc=gcc -Duseithreads -Duse64bitall DEBUGGING
  [stdio] -Dcc=gcc -Duseithreads DEBUGGING
  [stdio] -Dcc=gcc -Duseithreads -Duse64bitall
~~ ../cpan/Test-Simple/t/Test2/acceptance/try_it_threads.t ..... FAILED Bad plan.  You planned 6 tests but ran 0.
  [stdio] -Dcc=gcc -Duseithreads
  [stdio] -Dcc=gcc -Duseithreads -Duse64bitall DEBUGGING
  [stdio] -Dcc=gcc -Duseithreads DEBUGGING
  [stdio] -Dcc=gcc -Duseithreads -Duse64bitall
~~ ../dist/threads/t/blocks.t .................................. FAILED Bad plan.  You planned 5 tests but ran 0.
  [stdio] -Dcc=gcc -Duseithreads
  [stdio] -Dcc=gcc -Duseithreads -Duse64bitall DEBUGGING
  [stdio] -Dcc=gcc -Duseithreads DEBUGGING
  [stdio] -Dcc=gcc -Duseithreads -Duse64bitall
~~ ../dist/threads/t/stress_string.t ........................... FAILED Bad plan.  You planned 61 tests but ran 14.
  [stdio] -Dcc=gcc -Duseithreads -Duse64bitall
~~ ../dist/Thread-Queue/t/05_extract.t ......................... FAILED Bad plan.  You planned 20 tests but ran 1.
  [stdio] -Dcc=gcc -Duseithreads
  [stdio] -Dcc=gcc -Duseithreads -Duse64bitall DEBUGGING
  [stdio] -Dcc=gcc -Duseithreads DEBUGGING
  [stdio] -Dcc=gcc -Duseithreads -Duse64bitall
~~ ../dist/Thread-Queue/t/07_lock.t ............................ FAILED Bad plan.  You planned 3 tests but ran 1.
  [stdio] -Dcc=gcc -Duseithreads
  [stdio] -Dcc=gcc -Duseithreads -Duse64bitall DEBUGGING
  [stdio] -Dcc=gcc -Duseithreads DEBUGGING
  [stdio] -Dcc=gcc -Duseithreads -Duse64bitall
~~ ../cpan/Test-Simple/t/regression/fork_first.t ............... FAILED No plan found in TAP output
  [stdio] -Dcc=gcc -Duseithreads
  [stdio] -Dcc=gcc -Duseithreads -Duse64bitall DEBUGGING
  [stdio] -Dcc=gcc -Duseithreads DEBUGGING
  [stdio] -Dcc=gcc -Duseithreads -Duse64bitall
~~ ../dist/threads-shared/t/av_simple.t ........................ FAILED Bad plan.  You planned 47 tests but ran 14.
  [stdio] -Dcc=gcc -Duseithreads
  [stdio] -Dcc=gcc -Duseithreads -Duse64bitall DEBUGGING
  [stdio] -Dcc=gcc -Duseithreads DEBUGGING
  [stdio] -Dcc=gcc -Duseithreads -Duse64bitall
~~ ../dist/threads/t/stress_cv.t ............................... FAILED Bad plan.  You planned 61 tests but ran 11.
  [stdio] -Dcc=gcc -Duseithreads -Duse64bitall
~~ ../ext/File-Glob/t/threads.t ................................ FAILED No plan found in TAP output
  [stdio] -Dcc=gcc -Duseithreads
  [stdio] -Dcc=gcc -Duseithreads -Duse64bitall DEBUGGING
  [stdio] -Dcc=gcc -Duseithreads DEBUGGING
  [stdio] -Dcc=gcc -Duseithreads -Duse64bitall
~~ ../cpan/Test-Simple/t/Test2/modules/Hub.t ................... FAILED No plan found in TAP output
  [stdio] -Dcc=gcc -Duseithreads
  [stdio] -Dcc=gcc -Duseithreads -Duse64bitall DEBUGGING
  [stdio] -Dcc=gcc -Duseithreads DEBUGGING
  [stdio] -Dcc=gcc -Duseithreads -Duse64bitall
~~ ../dist/threads/t/thread.t .................................. FAILED Bad plan.  You planned 35 tests but ran 4.
  [stdio] -Dcc=gcc -Duseithreads
  [stdio] -Dcc=gcc -Duseithreads -Duse64bitall DEBUGGING
  [stdio] -Dcc=gcc -Duseithreads DEBUGGING
  [stdio] -Dcc=gcc -Duseithreads -Duse64bitall
~~ ../dist/Thread-Semaphore/t/04_nonblocking.t ................. FAILED Bad plan.  You planned 12 tests but ran 5.
  [stdio] -Dcc=gcc -Duseithreads
  [stdio] -Dcc=gcc -Duseithreads -Duse64bitall DEBUGGING
  [stdio] -Dcc=gcc -Duseithreads DEBUGGING
  [stdio] -Dcc=gcc -Duseithreads -Duse64bitall
~~ ../dist/Thread-Semaphore/t/06_timed.t ....................... FAILED Bad plan.  You planned 10 tests but ran 7.
  [stdio] -Dcc=gcc -Duseithreads
  [stdio] -Dcc=gcc -Duseithreads -Duse64bitall DEBUGGING
  [stdio] -Dcc=gcc -Duseithreads DEBUGGING
  [stdio] -Dcc=gcc -Duseithreads -Duse64bitall
~~ ../dist/threads-shared/t/av_refs.t .......................... FAILED Bad plan.  You planned 14 tests but ran 5.
  [stdio] -Dcc=gcc -Duseithreads
  [stdio] -Dcc=gcc -Duseithreads -Duse64bitall DEBUGGING
  [stdio] -Dcc=gcc -Duseithreads DEBUGGING
  [stdio] -Dcc=gcc -Duseithreads -Duse64bitall
~~ ../dist/threads/t/state.t ................................... FAILED Bad plan.  You planned 59 tests but ran 25.
  [stdio] -Dcc=gcc -Duseithreads
  [stdio] -Dcc=gcc -Duseithreads -Duse64bitall DEBUGGING
  [stdio] -Dcc=gcc -Duseithreads DEBUGGING
  [stdio] -Dcc=gcc -Duseithreads -Duse64bitall
~~ ../dist/threads/t/stress_re.t ............................... FAILED Bad plan.  You planned 61 tests but ran 29.
  [stdio] -Dcc=gcc -Duseithreads -Duse64bitall DEBUGGING
  [stdio] -Dcc=gcc -Duseithreads -Duse64bitall
~~ ../cpan/Test-Simple/t/Legacy/threads.t ...................... FAILED Bad plan.  You planned 6 tests but ran 0.
  [stdio] -Dcc=gcc -Duseithreads
  [stdio] -Dcc=gcc -Duseithreads -Duse64bitall DEBUGGING
  [stdio] -Dcc=gcc -Duseithreads DEBUGGING
  [stdio] -Dcc=gcc -Duseithreads -Duse64bitall
~~ ../dist/threads/t/context.t ................................. FAILED Bad plan.  You planned 31 tests but ran 3.
  [stdio] -Dcc=gcc -Duseithreads
  [stdio] -Dcc=gcc -Duseithreads -Duse64bitall DEBUGGING
  [stdio] -Dcc=gcc -Duseithreads DEBUGGING
  [stdio] -Dcc=gcc -Duseithreads -Duse64bitall
~~ ../dist/threads/t/join.t .................................... FAILED Bad plan.  You planned 20 tests but ran 2.
  [stdio] -Dcc=gcc -Duseithreads
  [stdio] -Dcc=gcc -Duseithreads -Duse64bitall DEBUGGING
  [stdio] -Dcc=gcc -Duseithreads DEBUGGING
  [stdio] -Dcc=gcc -Duseithreads -Duse64bitall
~~ ../dist/threads-shared/t/object2.t .......................... FAILED Bad plan.  You planned 133 tests but ran 131.
  [stdio] -Dcc=gcc -Duseithreads
  [stdio] -Dcc=gcc -Duseithreads -Duse64bitall DEBUGGING
  [stdio] -Dcc=gcc -Duseithreads DEBUGGING
  [stdio] -Dcc=gcc -Duseithreads -Duse64bitall
~~ ../dist/Storable/t/threads.t ................................ FAILED Bad plan.  You planned 2 tests but ran 0.
  [stdio] -Dcc=gcc -Duseithreads
  [stdio] -Dcc=gcc -Duseithreads -Duse64bitall DEBUGGING
  [stdio] -Dcc=gcc -Duseithreads DEBUGGING
  [stdio] -Dcc=gcc -Duseithreads -Duse64bitall
~~ ../dist/threads/t/list.t .................................... FAILED Bad plan.  You planned 15 tests but ran 5.
  [stdio] -Dcc=gcc -Duseithreads
  [stdio] -Dcc=gcc -Duseithreads -Duse64bitall DEBUGGING
  [stdio] -Dcc=gcc -Duseithreads DEBUGGING
  [stdio] -Dcc=gcc -Duseithreads -Duse64bitall
~~ ../t/op/threads-dirh.t ...................................... FAILED 1 Bad plan.  You planned 6 tests but ran 3.
  [stdio] -Dcc=gcc -Duseithreads
  [stdio] -Dcc=gcc -Duseithreads -Duse64bitall DEBUGGING
  [stdio] -Dcc=gcc -Duseithreads DEBUGGING
  [stdio] -Dcc=gcc -Duseithreads -Duse64bitall
~~ ../dist/threads/t/end.t ..................................... FAILED Bad plan.  You planned 6 tests but ran 2.
  [stdio] -Dcc=gcc -Duseithreads
  [stdio] -Dcc=gcc -Duseithreads -Duse64bitall DEBUGGING
  [stdio] -Dcc=gcc -Duseithreads DEBUGGING
  [stdio] -Dcc=gcc -Duseithreads -Duse64bitall
~~ ../ext/XS-APItest/t/keyword_plugin_threads.t ................ FAILED 1
  [stdio] -Dcc=gcc -Duseithreads
  [stdio] -Dcc=gcc -Duseithreads -Duse64bitall DEBUGGING
  [stdio] -Dcc=gcc -Duseithreads DEBUGGING
  [stdio] -Dcc=gcc -Duseithreads -Duse64bitall
~~ ../lib/perl5db.t ............................................ FAILED 129
  [stdio] -Dcc=gcc -Duseithreads
  [stdio] -Dcc=gcc -Duseithreads -Duse64bitall DEBUGGING
  [stdio] -Dcc=gcc -Duseithreads DEBUGGING
  [stdio] -Dcc=gcc -Duseithreads -Duse64bitall
~~ ../dist/threads-shared/t/waithires.t ........................ FAILED Bad plan.  You planned 63 tests but ran 8.
  [stdio] -Dcc=gcc -Duseithreads
  [stdio] -Dcc=gcc -Duseithreads -Duse64bitall DEBUGGING
  [stdio] -Dcc=gcc -Duseithreads DEBUGGING
  [stdio] -Dcc=gcc -Duseithreads -Duse64bitall
~~ ../dist/threads/t/err.t ..................................... FAILED Bad plan.  You planned 10 tests but ran 4.
  [stdio] -Dcc=gcc -Duseithreads
  [stdio] -Dcc=gcc -Duseithreads -Duse64bitall DEBUGGING
  [stdio] -Dcc=gcc -Duseithreads DEBUGGING
  [stdio] -Dcc=gcc -Duseithreads -Duse64bitall

Test todo-passed:
~~ ../cpan/Module-Metadata/t/extract-version.t ................. PASSED 7 51 91 130 165 203
  [stdio] -Dcc=gcc
  [stdio] -Dcc=gcc -Duse64bitall
  [stdio] -Dcc=gcc -Duseithreads -Duse64bitall DEBUGGING
  [stdio] -Dcc=gcc -Duseithreads DEBUGGING
  [stdio] -Dcc=gcc -Duseithreads
  [stdio] -Dcc=gcc DEBUGGING
  [stdio] -Dcc=gcc -Duse64bitall DEBUGGING
  [stdio] -Dcc=gcc -Duseithreads -Duse64bitall

MANIFEST messages:

Compiler messages:
  op.c: In function 'Perl_custom_op_get_field':
  op.c:16729:9: warning: 'any.xop_name' may be used uninitialized in this function [-Wmaybe-uninitialized]
  op.c: In function 'S_gen_constant_list':
  op.c:5750:31: warning: argument 'o' might be clobbered by 'longjmp' or 'vfork' [-Wclobbered]
  regcomp.c: In function 'S_study_chunk':
  regcomp.c:5452:33: warning: comparison between signed and unsigned integer expressions [-Wsign-compare]
  regcomp.c: In function 'S_reg':
  regcomp.c:11056:15: warning: comparison between signed and unsigned integer expressions [-Wsign-compare]
  regcomp.c: In function 'S_regpiece':
  regcomp.c:12617:46: warning: comparison between signed and unsigned integer expressions [-Wsign-compare]
  regcomp.c: In function 'S_regtail':
  regcomp.c:19780:24: warning: comparison between signed and unsigned integer expressions [-Wsign-compare]
  regexec.c: In function 'S_regmatch':
  regexec.c:8015:37: warning: comparison between signed and unsigned integer expressions [-Wsign-compare]
  regexec.c:8038:34: warning: comparison between signed and unsigned integer expressions [-Wsign-compare]
  B.c: In function 'XS_B__PADNAME_TYPE':
  B.xs:2218:8: warning: 'ret' may be used uninitialized in this function [-Wmaybe-uninitialized]
  B.xs:2202:6: note: 'ret' was declared here
  Cwd.xs:23:0: warning: "SYSNAME" redefined
  /usr/include/sys/param.h:184:0: note: this is the location of the previous definition
  Encode.c: In function 'XS_Encode_decode':
  ../../XSUB.h:185:20: warning: unused variable 'ix' [-Wunused-variable]
  ../../XSUB.h:185:20: note: in definition of macro 'dXSI32'
  Encode.c: In function 'XS_Encode_encode':
  SysV.xs: In function 'XS_IPC__SysV_shmdt':
  SysV.xs:415:20: warning: request for implicit conversion from 'void *' to 'char *' not permitted in C++ [-Wc++-compat]
  ODBM_File.xs:24:5: warning: identifier 'delete' conflicts with C++ keyword [-Wc++-compat]
  ODBM_File.c: In function 'XS_ODBM_File_DELETE':
  ODBM_File.xs:64:31: warning: identifier 'delete' conflicts with C++ keyword [-Wc++-compat]
  ODBM_File.xs:64:31: note: in definition of macro 'odbm_DELETE'
  ./const-xs.inc: In function 'boot_Socket':
  ./const-xs.inc:980:43: warning: missing braces around initializer [-Wmissing-braces]
  ./const-xs.inc:980:43: note: (near initialization for 'ip6_address')
  ./const-xs.inc:989:43: warning: missing braces around initializer [-Wmissing-braces]
  ./const-xs.inc:989:43: note: (near initialization for 'ip6_address')
  Storable.xs: In function 'get_regexp':
  Storable.xs:3434:14: warning: format '%d' expects argument of type 'int', but argument 2 has type 'I32 {aka long int}' [-Wformat=]
  Storable.xs:577:55: note: in definition of macro 'CROAK'
  Storable.xs: In function 'retrieve_regexp':
  Storable.xs:6849:16: warning: format '%d' expects argument of type 'int', but argument 2 has type 'I32 {aka long int}' [-Wformat=]
  const-c.inc: In function 'constant_19':
  const-c.inc:351:42: warning: unused parameter 'iv_return' [-Wunused-parameter]
  re_exec.c: In function 'S_regmatch':
  re_exec.c:8015:37: warning: comparison between signed and unsigned integer expressions [-Wsign-compare]
  re_exec.c:8038:34: warning: comparison between signed and unsigned integer expressions [-Wsign-compare]
  re_comp.c: In function 'S_study_chunk':
  re_comp.c:5452:33: warning: comparison between signed and unsigned integer expressions [-Wsign-compare]
  re_comp.c: In function 'S_reg':
  re_comp.c:11056:15: warning: comparison between signed and unsigned integer expressions [-Wsign-compare]
  re_comp.c: In function 'S_regpiece':
  re_comp.c:12617:46: warning: comparison between signed and unsigned integer expressions [-Wsign-compare]
  re_comp.c: In function 'S_regtail':
  re_comp.c:19776:27: warning: comparison between signed and unsigned integer expressions [-Wsign-compare]
  re_comp.c:19780:24: warning: comparison between signed and unsigned integer expressions [-Wsign-compare]
  re_comp.c: In function 'S_regtail_study':
  re_comp.c:19888:27: warning: comparison between signed and unsigned integer expressions [-Wsign-compare]
  re_comp.c:19892:24: warning: comparison between signed and unsigned integer expressions [-Wsign-compare]
  regcomp.c:19776:27: warning: comparison between signed and unsigned integer expressions [-Wsign-compare]
  regcomp.c: In function 'S_regtail_study':
  regcomp.c:19888:27: warning: comparison between signed and unsigned integer expressions [-Wsign-compare]
  regcomp.c:19892:24: warning: comparison between signed and unsigned integer expressions [-Wsign-compare]
  Storable.xs: In function 'store_ref':
  Storable.xs:729:18: warning: format '%ld' expects argument of type 'long int', but argument 3 has type 'STRLEN {aka unsigned int}' [-Wformat=]
  Storable.xs:125:30: note: in definition of macro 'TRACEME'
  Storable.xs:811:13: note: in expansion of macro 'MBUF_XTEND'
  Storable.xs:1042:13: note: in expansion of macro 'MBUF_PUTC'
  Storable.xs:2380:13: note: in expansion of macro 'PUTMARK'
  Storable.xs:2382:13: note: in expansion of macro 'PUTMARK'
  Storable.xs:2384:9: note: in expansion of macro 'PUTMARK'
  Storable.xs: In function 'store_scalar':
  Storable.xs:2441:13: note: in expansion of macro 'PUTMARK'
  Storable.xs:2444:13: note: in expansion of macro 'PUTMARK'
  Storable.xs:2483:13: note: in expansion of macro 'PUTMARK'
  Storable.xs:2486:13: note: in expansion of macro 'PUTMARK'
  Storable.xs:2530:13: note: in expansion of macro 'PUTMARK'
  Storable.xs:2531:13: note: in expansion of macro 'PUTMARK'
  Storable.xs:2556:13: note: in expansion of macro 'PUTMARK'
  Storable.xs:740:13: note: in expansion of macro 'MBUF_XTEND'
  Storable.xs:826:9: note: in expansion of macro 'MBUF_CHK'
  Storable.xs:1051:13: note: in expansion of macro 'MBUF_PUTINT'
  Storable.xs:2557:13: note: in expansion of macro 'WRITE_I32'
  Storable.xs:2560:13: note: in expansion of macro 'PUTMARK'
  Storable.xs:843:9: note: in expansion of macro 'MBUF_CHK'
  Storable.xs:1127:13: note: in expansion of macro 'MBUF_WRITE'
  Storable.xs:2561:13: note: in expansion of macro 'WRITE'
  Storable.xs:2600:9: note: in expansion of macro 'PUTMARK'
  Storable.xs:2601:9: note: in expansion of macro 'WRITE'
  Storable.xs:1137:13: note: in expansion of macro 'PUTMARK'
  Storable.xs:2625:13: note: in expansion of macro 'STORE_PV_LEN'
  Storable.xs:1138:13: note: in expansion of macro 'PUTMARK'
  Storable.xs:1140:17: note: in expansion of macro 'WRITE'
  Storable.xs:1142:13: note: in expansion of macro 'PUTMARK'
  Storable.xs:1143:13: note: in expansion of macro 'PUTMARK'
  Storable.xs:1145:13: note: in expansion of macro 'WRITE'
  Storable.xs:1148:13: note: in expansion of macro 'PUTMARK'
  Storable.xs:1074:17: note: in expansion of macro 'MBUF_PUTINT'
  Storable.xs:1149:13: note: in expansion of macro 'WLEN'
  Storable.xs:1079:17: note: in expansion of macro 'MBUF_PUTINT'
  Storable.xs:1150:13: note: in expansion of macro 'WRITE'
  Storable.xs:304:32: note: in expansion of macro 'STORE_PV_LEN'
  Storable.xs:2632:13: note: in expansion of macro 'STORE_UTF8STR'
  Storable.xs:1154:31: note: in expansion of macro 'STORE_PV_LEN'
  Storable.xs:2634:13: note: in expansion of macro 'STORE_SCALAR'
  Storable.xs: In function 'store_array':
  Storable.xs:2680:9: note: in expansion of macro 'PUTMARK'
  Storable.xs:2681:9: note: in expansion of macro 'WLEN'
  Storable.xs:1164:2: note: in expansion of macro 'PUTMARK'
  Storable.xs:2705:13: note: in expansion of macro 'STORE_SV_UNDEF'
  Storable.xs:2717:13: note: in expansion of macro 'PUTMARK'
  Storable.xs: In function 'store_hash':
  Storable.xs:2836:13: note: in expansion of macro 'PUTMARK'
  Storable.xs:2837:13: note: in expansion of macro 'PUTMARK'
  Storable.xs:2840:13: note: in expansion of macro 'PUTMARK'
  Storable.xs:2842:9: note: in expansion of macro 'WLEN'
  Storable.xs:3010:17: note: in expansion of macro 'PUTMARK'
  Storable.xs:3022:13: note: in expansion of macro 'WLEN'
  Storable.xs:3024:17: note: in expansion of macro 'WRITE'
  Storable.xs: In function 'store_hentry':
  Storable.xs:3204:13: note: in expansion of macro 'PUTMARK'
  Storable.xs:3220:13: note: in expansion of macro 'WLEN'
  Storable.xs:3222:17: note: in expansion of macro 'WRITE'
  Storable.xs: In function 'store_code':
  Storable.xs:3378:5: note: in expansion of macro 'PUTMARK'
  Storable.xs:3388:9: note: in expansion of macro 'STORE_UTF8STR'
  Storable.xs:3390:9: note: in expansion of macro 'STORE_SCALAR'
  Storable.xs: In function 'store_regexp':
  Storable.xs:3466:5: note: in expansion of macro 'PUTMARK'
  Storable.xs:3467:5: note: in expansion of macro 'PUTMARK'
  Storable.xs:3470:7: note: in expansion of macro 'WLEN'
  Storable.xs:3473:7: note: in expansion of macro 'PUTMARK'
  Storable.xs:3474:5: note: in expansion of macro 'WRITE'
  Storable.xs:3475:5: note: in expansion of macro 'PUTMARK'
  Storable.xs:3476:5: note: in expansion of macro 'WRITE'
  Storable.xs: In function 'store_tied':
  Storable.xs:3511:9: note: in expansion of macro 'PUTMARK'
  Storable.xs:3514:9: note: in expansion of macro 'PUTMARK'
  Storable.xs:3517:9: note: in expansion of macro 'PUTMARK'
  Storable.xs: In function 'store_tied_item':
  Storable.xs:3576:9: note: in expansion of macro 'PUTMARK'
  Storable.xs:3590:9: note: in expansion of macro 'PUTMARK'
  Storable.xs:3598:9: note: in expansion of macro 'WLEN'
  Storable.xs: In function 'store_hook':
  Storable.xs:3878:6: note: in expansion of macro 'PUTMARK'
  Storable.xs:3879:13: note: in expansion of macro 'PUTMARK'
  Storable.xs:3881:17: note: in expansion of macro 'PUTMARK'
  Storable.xs:3883:13: note: in expansion of macro 'PUTMARK'
  Storable.xs:3998:2: note: in expansion of macro 'PUTMARK'
  Storable.xs:3999:9: note: in expansion of macro 'PUTMARK'
  Storable.xs:4001:13: note: in expansion of macro 'PUTMARK'
  Storable.xs:4003:9: note: in expansion of macro 'PUTMARK'
  Storable.xs:4008:13: note: in expansion of macro 'WLEN'
  Storable.xs:4011:13: note: in expansion of macro 'PUTMARK'
  Storable.xs:4015:13: note: in expansion of macro 'WLEN'
  Storable.xs:4018:13: note: in expansion of macro 'PUTMARK'
  Storable.xs:4020:9: note: in expansion of macro 'WRITE'
  Storable.xs:4032:9: note: in expansion of macro 'WLEN'
  Storable.xs:4035:9: note: in expansion of macro 'PUTMARK'
  Storable.xs:4038:9: note: in expansion of macro 'WRITE'
  Storable.xs:4048:13: note: in expansion of macro 'WLEN'
  Storable.xs:4053:13: note: in expansion of macro 'PUTMARK'
  Storable.xs:4074:17: note: in expansion of macro 'WRITE_I32'
  Storable.xs: In function 'store_blessed':
  Storable.xs:4183:9: note: in expansion of macro 'PUTMARK'
  Storable.xs:4186:13: note: in expansion of macro 'PUTMARK'
  Storable.xs:4189:13: note: in expansion of macro 'PUTMARK'
  Storable.xs:4190:13: note: in expansion of macro 'WLEN'
  Storable.xs:4195:9: note: in expansion of macro 'PUTMARK'
  Storable.xs:4198:13: note: in expansion of macro 'PUTMARK'
  Storable.xs:4201:13: note: in expansion of macro 'PUTMARK'
  Storable.xs:4202:13: note: in expansion of macro 'WLEN'
  Storable.xs:4204:9: note: in expansion of macro 'WRITE'
  Storable.xs: In function 'store_other':
  Storable.xs:4255:9: note: in expansion of macro 'STORE_SCALAR'
  Storable.xs: In function 'store':
  Storable.xs:4453:6: note: in expansion of macro 'PUTMARK'
  Storable.xs:4454:6: note: in expansion of macro 'WRITE_I32'
  Storable.xs: In function 'magic_write':
  Storable.xs:4588:5: note: in expansion of macro 'WRITE'
  Piece.xs: In function '_strptime':
  Piece.xs:719:8: warning: 'len' may be used uninitialized in this function [-Wmaybe-uninitialized]
  reentr.c: In function 'Perl_reentrant_retry':
  reentr.c:331:30: warning: request for implicit conversion from 'void *' to 'const char *' not permitted in C++ [-Wc++-compat]
  reentr.h:974:56: note: in definition of macro 'gethostbyaddr'

About this smoke:
    smoking-perl: 5.26.1
  smoker-version: 1.71/0.046
       timestamp: 2019-03-22 22:22:22+00
          tester: core

-- 
Report generated by Test::Smoke::Gateway v0.09_01