Show logfile
Automated smoke report for branch smoke-me/jkeenan/133771-repair-file-find-tests 5.29.8 patch a89df5e81b3b0903bcde25fad6a193fdf754d726 v5.29.7-14-ga89df5e81b
vier.local: Intel(R) Core(TM) i7-3820 CPU @ 3.60GHz (GenuineIntel 3702MHz) (x86_64/1[8 cores] cpus)
    on        linux 4.19.10-300.fc29.x86_64 [Fedora 29 (Server Edition)]
    using     clang version 4.2.1 Compatible Clang 7.0.1 (Fedora 7.0.1-1.fc29) (*1)
    smoketime 3 hours 1 minute (average 45 minutes 20 seconds)

Summary: FAIL(FM)

O = OK  F = Failure(s), extended report at the bottom
X = Failure(s) under TEST but not under harness
? = still running or test results not (yet) available
Build failures during:       - = unknown or N/A
c = Configure, m = make, M = make (after miniperl), t = make test-prep

v5.29.7-14-ga89df5e81b
---------------------- ----------------------------------------------------
-  F  -  F              -Dcc=clang -Accflags="-Werror=declaration-after-statement -g -fno-omit-frame-pointer -fsanitize=address  -fno-common -fsanitize-blacklist=`pwd`/asan_ignore" -Aldflags="-fsanitize=address" (*1)
M  -  M  -              -Dcc=clang -Accflags="-Werror=declaration-after-statement -g -fno-omit-frame-pointer -fsanitize=address  -fno-common -fsanitize-blacklist=`pwd`/asan_ignore" -Aldflags="-fsanitize=address" -Duseithreads (*1)
|  |  |  |
|  |  |  +------------  stdio DEBUGGING
|  |  +---------------  minitest DEBUGGING
|  +------------------  stdio
+---------------------  minitest

Applied patches:
  SMOKEa89df5e81b3b0903bcde25fad6a193fdf754d726

Skipped tests:
  None

Test failures:
~~ ../t/uni/parser.t ........................................... FAILED Non-zero exit status: 1
  [stdio] -Dcc=clang -Accflags="-Werror=declaration-after-statement -g -fno-omit-frame-pointer -fsanitize=address  -fno-common -fsanitize-blacklist=`pwd`/asan_ignore" -Aldflags="-fsanitize=address"
~~ ../dist/Data-Dumper/t/recurse.t ............................. FAILED Non-zero exit status: 1
  [stdio] -Dcc=clang -Accflags="-Werror=declaration-after-statement -g -fno-omit-frame-pointer -fsanitize=address  -fno-common -fsanitize-blacklist=`pwd`/asan_ignore" -Aldflags="-fsanitize=address" DEBUGGING
  [stdio] -Dcc=clang -Accflags="-Werror=declaration-after-statement -g -fno-omit-frame-pointer -fsanitize=address  -fno-common -fsanitize-blacklist=`pwd`/asan_ignore" -Aldflags="-fsanitize=address"
~~ ../dist/base/t/fields.t ..................................... FAILED Non-zero exit status: 1
  [stdio] -Dcc=clang -Accflags="-Werror=declaration-after-statement -g -fno-omit-frame-pointer -fsanitize=address  -fno-common -fsanitize-blacklist=`pwd`/asan_ignore" -Aldflags="-fsanitize=address" DEBUGGING
  [stdio] -Dcc=clang -Accflags="-Werror=declaration-after-statement -g -fno-omit-frame-pointer -fsanitize=address  -fno-common -fsanitize-blacklist=`pwd`/asan_ignore" -Aldflags="-fsanitize=address"
~~ ../lib/locale.t ............................................. FAILED Non-zero exit status: 1
  [stdio] -Dcc=clang -Accflags="-Werror=declaration-after-statement -g -fno-omit-frame-pointer -fsanitize=address  -fno-common -fsanitize-blacklist=`pwd`/asan_ignore" -Aldflags="-fsanitize=address" DEBUGGING
  [stdio] -Dcc=clang -Accflags="-Werror=declaration-after-statement -g -fno-omit-frame-pointer -fsanitize=address  -fno-common -fsanitize-blacklist=`pwd`/asan_ignore" -Aldflags="-fsanitize=address"
~~ ../lib/strict.t ............................................. FAILED 34
  [stdio] -Dcc=clang -Accflags="-Werror=declaration-after-statement -g -fno-omit-frame-pointer -fsanitize=address  -fno-common -fsanitize-blacklist=`pwd`/asan_ignore" -Aldflags="-fsanitize=address" DEBUGGING
  [stdio] -Dcc=clang -Accflags="-Werror=declaration-after-statement -g -fno-omit-frame-pointer -fsanitize=address  -fno-common -fsanitize-blacklist=`pwd`/asan_ignore" -Aldflags="-fsanitize=address"
~~ ../ext/XS-APItest/t/handy07.t ............................... FAILED Non-zero exit status: 1
  [stdio] -Dcc=clang -Accflags="-Werror=declaration-after-statement -g -fno-omit-frame-pointer -fsanitize=address  -fno-common -fsanitize-blacklist=`pwd`/asan_ignore" -Aldflags="-fsanitize=address" DEBUGGING
  [stdio] -Dcc=clang -Accflags="-Werror=declaration-after-statement -g -fno-omit-frame-pointer -fsanitize=address  -fno-common -fsanitize-blacklist=`pwd`/asan_ignore" -Aldflags="-fsanitize=address"
~~ ../t/re/regexp_trielist.t ................................... FAILED Non-zero exit status: 1
  [stdio] -Dcc=clang -Accflags="-Werror=declaration-after-statement -g -fno-omit-frame-pointer -fsanitize=address  -fno-common -fsanitize-blacklist=`pwd`/asan_ignore" -Aldflags="-fsanitize=address" DEBUGGING
  [stdio] -Dcc=clang -Accflags="-Werror=declaration-after-statement -g -fno-omit-frame-pointer -fsanitize=address  -fno-common -fsanitize-blacklist=`pwd`/asan_ignore" -Aldflags="-fsanitize=address"
~~ ../ext/XS-APItest/t/customop.t .............................. FAILED Non-zero exit status: 1
  [stdio] -Dcc=clang -Accflags="-Werror=declaration-after-statement -g -fno-omit-frame-pointer -fsanitize=address  -fno-common -fsanitize-blacklist=`pwd`/asan_ignore" -Aldflags="-fsanitize=address" DEBUGGING
  [stdio] -Dcc=clang -Accflags="-Werror=declaration-after-statement -g -fno-omit-frame-pointer -fsanitize=address  -fno-common -fsanitize-blacklist=`pwd`/asan_ignore" -Aldflags="-fsanitize=address"
~~ ../dist/Devel-PPPort/t/misc.t ............................... FAILED Non-zero exit status: 1
  [stdio] -Dcc=clang -Accflags="-Werror=declaration-after-statement -g -fno-omit-frame-pointer -fsanitize=address  -fno-common -fsanitize-blacklist=`pwd`/asan_ignore" -Aldflags="-fsanitize=address" DEBUGGING
  [stdio] -Dcc=clang -Accflags="-Werror=declaration-after-statement -g -fno-omit-frame-pointer -fsanitize=address  -fno-common -fsanitize-blacklist=`pwd`/asan_ignore" -Aldflags="-fsanitize=address"
~~ ../t/op/sub.t ............................................... FAILED Non-zero exit status: 1
  [stdio] -Dcc=clang -Accflags="-Werror=declaration-after-statement -g -fno-omit-frame-pointer -fsanitize=address  -fno-common -fsanitize-blacklist=`pwd`/asan_ignore" -Aldflags="-fsanitize=address" DEBUGGING
  [stdio] -Dcc=clang -Accflags="-Werror=declaration-after-statement -g -fno-omit-frame-pointer -fsanitize=address  -fno-common -fsanitize-blacklist=`pwd`/asan_ignore" -Aldflags="-fsanitize=address"
~~ ../dist/base/t/compile-time.t ............................... FAILED Non-zero exit status: 1
  [stdio] -Dcc=clang -Accflags="-Werror=declaration-after-statement -g -fno-omit-frame-pointer -fsanitize=address  -fno-common -fsanitize-blacklist=`pwd`/asan_ignore" -Aldflags="-fsanitize=address" DEBUGGING
  [stdio] -Dcc=clang -Accflags="-Werror=declaration-after-statement -g -fno-omit-frame-pointer -fsanitize=address  -fno-common -fsanitize-blacklist=`pwd`/asan_ignore" -Aldflags="-fsanitize=address"
~~ ../t/uni/parser.t ........................................... FAILED 52 Non-zero exit status: 1
  [stdio] -Dcc=clang -Accflags="-Werror=declaration-after-statement -g -fno-omit-frame-pointer -fsanitize=address  -fno-common -fsanitize-blacklist=`pwd`/asan_ignore" -Aldflags="-fsanitize=address" DEBUGGING
~~ ../ext/XS-APItest/t/handy04.t ............................... FAILED Non-zero exit status: 1
  [stdio] -Dcc=clang -Accflags="-Werror=declaration-after-statement -g -fno-omit-frame-pointer -fsanitize=address  -fno-common -fsanitize-blacklist=`pwd`/asan_ignore" -Aldflags="-fsanitize=address" DEBUGGING
  [stdio] -Dcc=clang -Accflags="-Werror=declaration-after-statement -g -fno-omit-frame-pointer -fsanitize=address  -fno-common -fsanitize-blacklist=`pwd`/asan_ignore" -Aldflags="-fsanitize=address"
~~ ../t/re/reg_eval_scope.t .................................... FAILED 13
  [stdio] -Dcc=clang -Accflags="-Werror=declaration-after-statement -g -fno-omit-frame-pointer -fsanitize=address  -fno-common -fsanitize-blacklist=`pwd`/asan_ignore" -Aldflags="-fsanitize=address" DEBUGGING
  [stdio] -Dcc=clang -Accflags="-Werror=declaration-after-statement -g -fno-omit-frame-pointer -fsanitize=address  -fno-common -fsanitize-blacklist=`pwd`/asan_ignore" -Aldflags="-fsanitize=address"
~~ ../cpan/IO-Socket-IP/t/31nonblocking-connect-internet.t ..... FAILED Non-zero exit status: 115 No plan found in TAP output
  [stdio] -Dcc=clang -Accflags="-Werror=declaration-after-statement -g -fno-omit-frame-pointer -fsanitize=address  -fno-common -fsanitize-blacklist=`pwd`/asan_ignore" -Aldflags="-fsanitize=address"
~~ ../t/op/inc.t ............................................... FAILED Non-zero exit status: 1
  [stdio] -Dcc=clang -Accflags="-Werror=declaration-after-statement -g -fno-omit-frame-pointer -fsanitize=address  -fno-common -fsanitize-blacklist=`pwd`/asan_ignore" -Aldflags="-fsanitize=address" DEBUGGING
  [stdio] -Dcc=clang -Accflags="-Werror=declaration-after-statement -g -fno-omit-frame-pointer -fsanitize=address  -fno-common -fsanitize-blacklist=`pwd`/asan_ignore" -Aldflags="-fsanitize=address"
~~ ../ext/XS-APItest/t/handy03.t ............................... FAILED Non-zero exit status: 1
  [stdio] -Dcc=clang -Accflags="-Werror=declaration-after-statement -g -fno-omit-frame-pointer -fsanitize=address  -fno-common -fsanitize-blacklist=`pwd`/asan_ignore" -Aldflags="-fsanitize=address" DEBUGGING
  [stdio] -Dcc=clang -Accflags="-Werror=declaration-after-statement -g -fno-omit-frame-pointer -fsanitize=address  -fno-common -fsanitize-blacklist=`pwd`/asan_ignore" -Aldflags="-fsanitize=address"
~~ ../t/re/regexp_qr.t ......................................... FAILED Non-zero exit status: 1
  [stdio] -Dcc=clang -Accflags="-Werror=declaration-after-statement -g -fno-omit-frame-pointer -fsanitize=address  -fno-common -fsanitize-blacklist=`pwd`/asan_ignore" -Aldflags="-fsanitize=address" DEBUGGING
  [stdio] -Dcc=clang -Accflags="-Werror=declaration-after-statement -g -fno-omit-frame-pointer -fsanitize=address  -fno-common -fsanitize-blacklist=`pwd`/asan_ignore" -Aldflags="-fsanitize=address"
~~ ../t/re/alpha_assertions.t .................................. FAILED Non-zero exit status: 1
  [stdio] -Dcc=clang -Accflags="-Werror=declaration-after-statement -g -fno-omit-frame-pointer -fsanitize=address  -fno-common -fsanitize-blacklist=`pwd`/asan_ignore" -Aldflags="-fsanitize=address" DEBUGGING
  [stdio] -Dcc=clang -Accflags="-Werror=declaration-after-statement -g -fno-omit-frame-pointer -fsanitize=address  -fno-common -fsanitize-blacklist=`pwd`/asan_ignore" -Aldflags="-fsanitize=address"
~~ ../t/op/heredoc.t ........................................... FAILED 135-136
  [stdio] -Dcc=clang -Accflags="-Werror=declaration-after-statement -g -fno-omit-frame-pointer -fsanitize=address  -fno-common -fsanitize-blacklist=`pwd`/asan_ignore" -Aldflags="-fsanitize=address" DEBUGGING
  [stdio] -Dcc=clang -Accflags="-Werror=declaration-after-statement -g -fno-omit-frame-pointer -fsanitize=address  -fno-common -fsanitize-blacklist=`pwd`/asan_ignore" -Aldflags="-fsanitize=address"
~~ ../t/run/fresh_perl.t ....................................... FAILED 91-92
  [stdio] -Dcc=clang -Accflags="-Werror=declaration-after-statement -g -fno-omit-frame-pointer -fsanitize=address  -fno-common -fsanitize-blacklist=`pwd`/asan_ignore" -Aldflags="-fsanitize=address" DEBUGGING
~~ ../t/op/ref.t ............................................... FAILED Non-zero exit status: 1
  [stdio] -Dcc=clang -Accflags="-Werror=declaration-after-statement -g -fno-omit-frame-pointer -fsanitize=address  -fno-common -fsanitize-blacklist=`pwd`/asan_ignore" -Aldflags="-fsanitize=address" DEBUGGING
  [stdio] -Dcc=clang -Accflags="-Werror=declaration-after-statement -g -fno-omit-frame-pointer -fsanitize=address  -fno-common -fsanitize-blacklist=`pwd`/asan_ignore" -Aldflags="-fsanitize=address"
~~ ../t/op/qr.t ................................................ FAILED Non-zero exit status: 1
  [stdio] -Dcc=clang -Accflags="-Werror=declaration-after-statement -g -fno-omit-frame-pointer -fsanitize=address  -fno-common -fsanitize-blacklist=`pwd`/asan_ignore" -Aldflags="-fsanitize=address" DEBUGGING
  [stdio] -Dcc=clang -Accflags="-Werror=declaration-after-statement -g -fno-omit-frame-pointer -fsanitize=address  -fno-common -fsanitize-blacklist=`pwd`/asan_ignore" -Aldflags="-fsanitize=address"
~~ ../t/re/regexp_qr_embed.t ................................... FAILED Non-zero exit status: 1
  [stdio] -Dcc=clang -Accflags="-Werror=declaration-after-statement -g -fno-omit-frame-pointer -fsanitize=address  -fno-common -fsanitize-blacklist=`pwd`/asan_ignore" -Aldflags="-fsanitize=address" DEBUGGING
  [stdio] -Dcc=clang -Accflags="-Werror=declaration-after-statement -g -fno-omit-frame-pointer -fsanitize=address  -fno-common -fsanitize-blacklist=`pwd`/asan_ignore" -Aldflags="-fsanitize=address"
~~ ../lib/subs.t ............................................... FAILED 1
  [stdio] -Dcc=clang -Accflags="-Werror=declaration-after-statement -g -fno-omit-frame-pointer -fsanitize=address  -fno-common -fsanitize-blacklist=`pwd`/asan_ignore" -Aldflags="-fsanitize=address" DEBUGGING
~~ ../t/re/pat.t ............................................... FAILED 842
  [stdio] -Dcc=clang -Accflags="-Werror=declaration-after-statement -g -fno-omit-frame-pointer -fsanitize=address  -fno-common -fsanitize-blacklist=`pwd`/asan_ignore" -Aldflags="-fsanitize=address" DEBUGGING
~~ ../ext/XS-APItest/t/stmtasexpr.t ............................ FAILED Non-zero exit status: 1
  [stdio] -Dcc=clang -Accflags="-Werror=declaration-after-statement -g -fno-omit-frame-pointer -fsanitize=address  -fno-common -fsanitize-blacklist=`pwd`/asan_ignore" -Aldflags="-fsanitize=address" DEBUGGING
  [stdio] -Dcc=clang -Accflags="-Werror=declaration-after-statement -g -fno-omit-frame-pointer -fsanitize=address  -fno-common -fsanitize-blacklist=`pwd`/asan_ignore" -Aldflags="-fsanitize=address"
~~ ../t/re/pat_advanced.t ...................................... FAILED Non-zero exit status: 1
  [stdio] -Dcc=clang -Accflags="-Werror=declaration-after-statement -g -fno-omit-frame-pointer -fsanitize=address  -fno-common -fsanitize-blacklist=`pwd`/asan_ignore" -Aldflags="-fsanitize=address" DEBUGGING
  [stdio] -Dcc=clang -Accflags="-Werror=declaration-after-statement -g -fno-omit-frame-pointer -fsanitize=address  -fno-common -fsanitize-blacklist=`pwd`/asan_ignore" -Aldflags="-fsanitize=address"
~~ ../t/op/stash_parse_gv.t .................................... FAILED 3
  [stdio] -Dcc=clang -Accflags="-Werror=declaration-after-statement -g -fno-omit-frame-pointer -fsanitize=address  -fno-common -fsanitize-blacklist=`pwd`/asan_ignore" -Aldflags="-fsanitize=address" DEBUGGING
  [stdio] -Dcc=clang -Accflags="-Werror=declaration-after-statement -g -fno-omit-frame-pointer -fsanitize=address  -fno-common -fsanitize-blacklist=`pwd`/asan_ignore" -Aldflags="-fsanitize=address"
~~ ../t/op/leaky-magic.t ....................................... FAILED Non-zero exit status: 1
  [stdio] -Dcc=clang -Accflags="-Werror=declaration-after-statement -g -fno-omit-frame-pointer -fsanitize=address  -fno-common -fsanitize-blacklist=`pwd`/asan_ignore" -Aldflags="-fsanitize=address" DEBUGGING
  [stdio] -Dcc=clang -Accflags="-Werror=declaration-after-statement -g -fno-omit-frame-pointer -fsanitize=address  -fno-common -fsanitize-blacklist=`pwd`/asan_ignore" -Aldflags="-fsanitize=address"
~~ ../t/re/regexp_noamp.t ...................................... FAILED Non-zero exit status: 1
  [stdio] -Dcc=clang -Accflags="-Werror=declaration-after-statement -g -fno-omit-frame-pointer -fsanitize=address  -fno-common -fsanitize-blacklist=`pwd`/asan_ignore" -Aldflags="-fsanitize=address" DEBUGGING
  [stdio] -Dcc=clang -Accflags="-Werror=declaration-after-statement -g -fno-omit-frame-pointer -fsanitize=address  -fno-common -fsanitize-blacklist=`pwd`/asan_ignore" -Aldflags="-fsanitize=address"
~~ ../t/op/svleak.t ............................................ FAILED Non-zero exit status: 1
  [stdio] -Dcc=clang -Accflags="-Werror=declaration-after-statement -g -fno-omit-frame-pointer -fsanitize=address  -fno-common -fsanitize-blacklist=`pwd`/asan_ignore" -Aldflags="-fsanitize=address" DEBUGGING
  [stdio] -Dcc=clang -Accflags="-Werror=declaration-after-statement -g -fno-omit-frame-pointer -fsanitize=address  -fno-common -fsanitize-blacklist=`pwd`/asan_ignore" -Aldflags="-fsanitize=address"
~~ ../t/re/regex_sets_compat.t ................................. FAILED Non-zero exit status: 1
  [stdio] -Dcc=clang -Accflags="-Werror=declaration-after-statement -g -fno-omit-frame-pointer -fsanitize=address  -fno-common -fsanitize-blacklist=`pwd`/asan_ignore" -Aldflags="-fsanitize=address" DEBUGGING
  [stdio] -Dcc=clang -Accflags="-Werror=declaration-after-statement -g -fno-omit-frame-pointer -fsanitize=address  -fno-common -fsanitize-blacklist=`pwd`/asan_ignore" -Aldflags="-fsanitize=address"
~~ ../t/op/coresubs.t .......................................... FAILED Non-zero exit status: 1
  [stdio] -Dcc=clang -Accflags="-Werror=declaration-after-statement -g -fno-omit-frame-pointer -fsanitize=address  -fno-common -fsanitize-blacklist=`pwd`/asan_ignore" -Aldflags="-fsanitize=address" DEBUGGING
~~ ../t/re/regexp_notrie.t ..................................... FAILED Non-zero exit status: 1
  [stdio] -Dcc=clang -Accflags="-Werror=declaration-after-statement -g -fno-omit-frame-pointer -fsanitize=address  -fno-common -fsanitize-blacklist=`pwd`/asan_ignore" -Aldflags="-fsanitize=address" DEBUGGING
  [stdio] -Dcc=clang -Accflags="-Werror=declaration-after-statement -g -fno-omit-frame-pointer -fsanitize=address  -fno-common -fsanitize-blacklist=`pwd`/asan_ignore" -Aldflags="-fsanitize=address"
~~ ../ext/XS-APItest/t/handy02.t ............................... FAILED Non-zero exit status: 1
  [stdio] -Dcc=clang -Accflags="-Werror=declaration-after-statement -g -fno-omit-frame-pointer -fsanitize=address  -fno-common -fsanitize-blacklist=`pwd`/asan_ignore" -Aldflags="-fsanitize=address" DEBUGGING
  [stdio] -Dcc=clang -Accflags="-Werror=declaration-after-statement -g -fno-omit-frame-pointer -fsanitize=address  -fno-common -fsanitize-blacklist=`pwd`/asan_ignore" -Aldflags="-fsanitize=address"
~~ ../ext/XS-APItest/t/swaplabel.t ............................. FAILED Non-zero exit status: 1
  [stdio] -Dcc=clang -Accflags="-Werror=declaration-after-statement -g -fno-omit-frame-pointer -fsanitize=address  -fno-common -fsanitize-blacklist=`pwd`/asan_ignore" -Aldflags="-fsanitize=address" DEBUGGING
  [stdio] -Dcc=clang -Accflags="-Werror=declaration-after-statement -g -fno-omit-frame-pointer -fsanitize=address  -fno-common -fsanitize-blacklist=`pwd`/asan_ignore" -Aldflags="-fsanitize=address"
~~ ../t/uni/opcroak.t .......................................... FAILED Non-zero exit status: 1
  [stdio] -Dcc=clang -Accflags="-Werror=declaration-after-statement -g -fno-omit-frame-pointer -fsanitize=address  -fno-common -fsanitize-blacklist=`pwd`/asan_ignore" -Aldflags="-fsanitize=address" DEBUGGING
  [stdio] -Dcc=clang -Accflags="-Werror=declaration-after-statement -g -fno-omit-frame-pointer -fsanitize=address  -fno-common -fsanitize-blacklist=`pwd`/asan_ignore" -Aldflags="-fsanitize=address"
~~ ../t/re/regexp.t ............................................ FAILED Non-zero exit status: 1
  [stdio] -Dcc=clang -Accflags="-Werror=declaration-after-statement -g -fno-omit-frame-pointer -fsanitize=address  -fno-common -fsanitize-blacklist=`pwd`/asan_ignore" -Aldflags="-fsanitize=address" DEBUGGING
  [stdio] -Dcc=clang -Accflags="-Werror=declaration-after-statement -g -fno-omit-frame-pointer -fsanitize=address  -fno-common -fsanitize-blacklist=`pwd`/asan_ignore" -Aldflags="-fsanitize=address"
~~ ../lib/croak.t .............................................. FAILED 20-21 151-152
  [stdio] -Dcc=clang -Accflags="-Werror=declaration-after-statement -g -fno-omit-frame-pointer -fsanitize=address  -fno-common -fsanitize-blacklist=`pwd`/asan_ignore" -Aldflags="-fsanitize=address" DEBUGGING
~~ ../lib/warnings.t ........................................... FAILED 149-150
  [stdio] -Dcc=clang -Accflags="-Werror=declaration-after-statement -g -fno-omit-frame-pointer -fsanitize=address  -fno-common -fsanitize-blacklist=`pwd`/asan_ignore" -Aldflags="-fsanitize=address" DEBUGGING
  [stdio] -Dcc=clang -Accflags="-Werror=declaration-after-statement -g -fno-omit-frame-pointer -fsanitize=address  -fno-common -fsanitize-blacklist=`pwd`/asan_ignore" -Aldflags="-fsanitize=address"
~~ ../ext/XS-APItest/t/load-module.t ........................... FAILED Non-zero exit status: 1
  [stdio] -Dcc=clang -Accflags="-Werror=declaration-after-statement -g -fno-omit-frame-pointer -fsanitize=address  -fno-common -fsanitize-blacklist=`pwd`/asan_ignore" -Aldflags="-fsanitize=address" DEBUGGING
  [stdio] -Dcc=clang -Accflags="-Werror=declaration-after-statement -g -fno-omit-frame-pointer -fsanitize=address  -fno-common -fsanitize-blacklist=`pwd`/asan_ignore" -Aldflags="-fsanitize=address"
~~ ../t/re/regexp_nonull.t ..................................... FAILED Non-zero exit status: 1
  [stdio] -Dcc=clang -Accflags="-Werror=declaration-after-statement -g -fno-omit-frame-pointer -fsanitize=address  -fno-common -fsanitize-blacklist=`pwd`/asan_ignore" -Aldflags="-fsanitize=address" DEBUGGING
  [stdio] -Dcc=clang -Accflags="-Werror=declaration-after-statement -g -fno-omit-frame-pointer -fsanitize=address  -fno-common -fsanitize-blacklist=`pwd`/asan_ignore" -Aldflags="-fsanitize=address"
~~ ../dist/Storable/t/blessed.t ................................ FAILED Non-zero exit status: 1
  [stdio] -Dcc=clang -Accflags="-Werror=declaration-after-statement -g -fno-omit-frame-pointer -fsanitize=address  -fno-common -fsanitize-blacklist=`pwd`/asan_ignore" -Aldflags="-fsanitize=address" DEBUGGING
~~ ../ext/re/t/re_funcs_u.t .................................... FAILED Non-zero exit status: 1
  [stdio] -Dcc=clang -Accflags="-Werror=declaration-after-statement -g -fno-omit-frame-pointer -fsanitize=address  -fno-common -fsanitize-blacklist=`pwd`/asan_ignore" -Aldflags="-fsanitize=address" DEBUGGING
  [stdio] -Dcc=clang -Accflags="-Werror=declaration-after-statement -g -fno-omit-frame-pointer -fsanitize=address  -fno-common -fsanitize-blacklist=`pwd`/asan_ignore" -Aldflags="-fsanitize=address"
~~ ../ext/XS-APItest/t/handy06.t ............................... FAILED Non-zero exit status: 1
  [stdio] -Dcc=clang -Accflags="-Werror=declaration-after-statement -g -fno-omit-frame-pointer -fsanitize=address  -fno-common -fsanitize-blacklist=`pwd`/asan_ignore" -Aldflags="-fsanitize=address" DEBUGGING
  [stdio] -Dcc=clang -Accflags="-Werror=declaration-after-statement -g -fno-omit-frame-pointer -fsanitize=address  -fno-common -fsanitize-blacklist=`pwd`/asan_ignore" -Aldflags="-fsanitize=address"
~~ ../ext/XS-APItest/t/handy01.t ............................... FAILED Non-zero exit status: 1
  [stdio] -Dcc=clang -Accflags="-Werror=declaration-after-statement -g -fno-omit-frame-pointer -fsanitize=address  -fno-common -fsanitize-blacklist=`pwd`/asan_ignore" -Aldflags="-fsanitize=address" DEBUGGING
  [stdio] -Dcc=clang -Accflags="-Werror=declaration-after-statement -g -fno-omit-frame-pointer -fsanitize=address  -fno-common -fsanitize-blacklist=`pwd`/asan_ignore" -Aldflags="-fsanitize=address"
~~ ../lib/croak.t .............................................. FAILED 20-21
  [stdio] -Dcc=clang -Accflags="-Werror=declaration-after-statement -g -fno-omit-frame-pointer -fsanitize=address  -fno-common -fsanitize-blacklist=`pwd`/asan_ignore" -Aldflags="-fsanitize=address"
~~ ../t/op/coreamp.t ........................................... FAILED Non-zero exit status: 1
  [stdio] -Dcc=clang -Accflags="-Werror=declaration-after-statement -g -fno-omit-frame-pointer -fsanitize=address  -fno-common -fsanitize-blacklist=`pwd`/asan_ignore" -Aldflags="-fsanitize=address" DEBUGGING
~~ ../ext/XS-APItest/t/handy05.t ............................... FAILED Non-zero exit status: 1
  [stdio] -Dcc=clang -Accflags="-Werror=declaration-after-statement -g -fno-omit-frame-pointer -fsanitize=address  -fno-common -fsanitize-blacklist=`pwd`/asan_ignore" -Aldflags="-fsanitize=address" DEBUGGING
  [stdio] -Dcc=clang -Accflags="-Werror=declaration-after-statement -g -fno-omit-frame-pointer -fsanitize=address  -fno-common -fsanitize-blacklist=`pwd`/asan_ignore" -Aldflags="-fsanitize=address"
~~ ../t/op/while.t ............................................. FAILED 26
  [stdio] -Dcc=clang -Accflags="-Werror=declaration-after-statement -g -fno-omit-frame-pointer -fsanitize=address  -fno-common -fsanitize-blacklist=`pwd`/asan_ignore" -Aldflags="-fsanitize=address" DEBUGGING
~~ ../lib/feature.t ............................................ FAILED 35
  [stdio] -Dcc=clang -Accflags="-Werror=declaration-after-statement -g -fno-omit-frame-pointer -fsanitize=address  -fno-common -fsanitize-blacklist=`pwd`/asan_ignore" -Aldflags="-fsanitize=address" DEBUGGING
~~ ../dist/base/t/fields-base.t ................................ FAILED Non-zero exit status: 1
  [stdio] -Dcc=clang -Accflags="-Werror=declaration-after-statement -g -fno-omit-frame-pointer -fsanitize=address  -fno-common -fsanitize-blacklist=`pwd`/asan_ignore" -Aldflags="-fsanitize=address" DEBUGGING
  [stdio] -Dcc=clang -Accflags="-Werror=declaration-after-statement -g -fno-omit-frame-pointer -fsanitize=address  -fno-common -fsanitize-blacklist=`pwd`/asan_ignore" -Aldflags="-fsanitize=address"
~~ ../ext/XS-APItest/t/handy00.t ............................... FAILED Non-zero exit status: 1
  [stdio] -Dcc=clang -Accflags="-Werror=declaration-after-statement -g -fno-omit-frame-pointer -fsanitize=address  -fno-common -fsanitize-blacklist=`pwd`/asan_ignore" -Aldflags="-fsanitize=address" DEBUGGING
  [stdio] -Dcc=clang -Accflags="-Werror=declaration-after-statement -g -fno-omit-frame-pointer -fsanitize=address  -fno-common -fsanitize-blacklist=`pwd`/asan_ignore" -Aldflags="-fsanitize=address"

Test todo-passed:
~~ ../cpan/Module-Metadata/t/extract-version.t ................. PASSED 7 51 91 130 165 203
  [stdio] -Dcc=clang -Accflags="-Werror=declaration-after-statement -g -fno-omit-frame-pointer -fsanitize=address  -fno-common -fsanitize-blacklist=`pwd`/asan_ignore" -Aldflags="-fsanitize=address" DEBUGGING
  [stdio] -Dcc=clang -Accflags="-Werror=declaration-after-statement -g -fno-omit-frame-pointer -fsanitize=address  -fno-common -fsanitize-blacklist=`pwd`/asan_ignore" -Aldflags="-fsanitize=address"

MANIFEST messages:

Compiler messages:
  Encode.c:1364:5: warning: unused variable 'ix' [-Wunused-variable]
  ../../XSUB.h:185:20: note: expanded from macro 'dXSI32'
  Encode.c:1406:5: warning: unused variable 'ix' [-Wunused-variable]
  ./const-xs.inc:128:42: warning: AI_IDN_ALLOW_UNASSIGNED is deprecated [-W#pragma-messages]
  /usr/include/netdb.h:609:3: note: expanded from macro 'AI_IDN_ALLOW_UNASSIGNED'
  /usr/include/sys/cdefs.h:485:3: note: expanded from macro '__glibc_macro_warning'
  /usr/include/sys/cdefs.h:483:42: note: expanded from macro '__glibc_macro_warning1'
  :94:6: note: expanded from here
  ./const-xs.inc:131:46: warning: AI_IDN_USE_STD3_ASCII_RULES is deprecated [-W#pragma-messages]
  /usr/include/netdb.h:611:3: note: expanded from macro 'AI_IDN_USE_STD3_ASCII_RULES'
  :97:6: note: expanded from here
  ./const-xs.inc:383:42: warning: NI_IDN_ALLOW_UNASSIGNED is deprecated [-W#pragma-messages]
  /usr/include/netdb.h:650:3: note: expanded from macro 'NI_IDN_ALLOW_UNASSIGNED'
  :100:6: note: expanded from here
  ./const-xs.inc:386:46: warning: NI_IDN_USE_STD3_ASCII_RULES is deprecated [-W#pragma-messages]
  /usr/include/netdb.h:652:3: note: expanded from macro 'NI_IDN_USE_STD3_ASCII_RULES'
  :103:6: note: expanded from here

About this smoke:
    smoking-perl: 5.28.1
  smoker-version: 1.72/0.046
       timestamp: 2019-01-21 23:54:49+00
          tester: perl

Enabled stack-use-after-return (Linux/Darwin) and leak-detection (Linux).  Smoke logs available at http://m-l.org/~perl/smoke/perl/linux/smoke-me_clang_quick_sanitize=address/James%20E%20Keenan/loga89df5e81b3b0903bcde25fad6a193fdf754d726.log.gz
-- 
Report generated by Test::Smoke::Gateway v0.09_01