Show logfile
Automated smoke report for branch smoke-me/khw-onepass 5.29.5 patch c6f84a7a043cdb6ebff5c2974da6d02d84e6213f v5.29.4-76-gc6f84a7a04
cjg-openbsd6: Intel(R) Xeon(R) CPU L5640 @ 2.27GHz (2253 MHz) (amd64/1 cpus)
    on        openbsd 6.4
    using     clang version 4.2.1 Compatible OpenBSD Clang 6.0.0 (tags/RELEASE_600/final) (*1)
    smoketime 5 hours 57 minutes (average 44 minutes 40 seconds)

Summary: FAIL(F)

O = OK  F = Failure(s), extended report at the bottom
X = Failure(s) under TEST but not under harness
? = still running or test results not (yet) available
Build failures during:       - = unknown or N/A
c = Configure, m = make, M = make (after miniperl), t = make test-prep

v5.29.4-76-gc6f84a7a04
---------------------- ----------------------------------------------------
F  F                    -Dcc=clang (*1)
F  F                    -Dcc=clang -Duse64bitall (*1)
O  F                    -Dcc=clang -Duseithreads (*1)
O  F                    -Dcc=clang -Duseithreads -Duse64bitall (*1)
|  |
|  +------------------  stdio DEBUGGING
+---------------------  stdio

Applied patches:
  SMOKEc6f84a7a043cdb6ebff5c2974da6d02d84e6213f

Skipped tests:
      # One test name on a line

Test failures:
~~ ../dist/threads/t/exit.t .................................... FAILED Bad plan.  You planned 18 tests but ran 1.
  [stdio] -Dcc=clang -Duseithreads -Duse64bitall DEBUGGING
  [stdio] -Dcc=clang -Duseithreads DEBUGGING
~~ ../cpan/Digest-MD5/t/threads.t .............................. FAILED Bad plan.  You planned 2 tests but ran 0.
  [stdio] -Dcc=clang -Duseithreads -Duse64bitall DEBUGGING
~~ ../dist/Thread-Semaphore/t/05_force.t ....................... FAILED Bad plan.  You planned 8 tests but ran 2.
  [stdio] -Dcc=clang -Duseithreads -Duse64bitall DEBUGGING
  [stdio] -Dcc=clang -Duseithreads DEBUGGING
~~ ../dist/threads-shared/t/waithires.t ........................ FAILED Bad plan.  You planned 63 tests but ran 0.
  [stdio] -Dcc=clang -Duseithreads -Duse64bitall DEBUGGING
  [stdio] -Dcc=clang -Duseithreads DEBUGGING
~~ ../t/re/pat_rt_report_thr.t ................................. FAILED Bad plan.  You planned 2504 tests but ran 0.
  [stdio] -Dcc=clang -Duseithreads -Duse64bitall DEBUGGING
  [stdio] -Dcc=clang -Duseithreads DEBUGGING
~~ ../dist/Thread-Queue/t/10_timed.t ........................... FAILED Bad plan.  You planned 19 tests but ran 2.
  [stdio] -Dcc=clang -Duseithreads -Duse64bitall DEBUGGING
  [stdio] -Dcc=clang -Duseithreads DEBUGGING
~~ ../dist/threads/t/kill3.t ................................... FAILED No plan found in TAP output
  [stdio] -Dcc=clang -Duseithreads -Duse64bitall DEBUGGING
  [stdio] -Dcc=clang -Duseithreads DEBUGGING
~~ ../dist/threads/t/kill2.t ................................... FAILED No plan found in TAP output
  [stdio] -Dcc=clang -Duseithreads DEBUGGING
~~ ../dist/Thread-Queue/t/03_peek.t ............................ FAILED Bad plan.  You planned 19 tests but ran 1.
  [stdio] -Dcc=clang -Duseithreads -Duse64bitall DEBUGGING
  [stdio] -Dcc=clang -Duseithreads DEBUGGING
~~ ../dist/threads/t/libc.t .................................... FAILED Bad plan.  You planned 11 tests but ran 1.
  [stdio] -Dcc=clang -Duseithreads -Duse64bitall DEBUGGING
~~ ../dist/threads/t/stress_re.t ............................... FAILED Bad plan.  You planned 61 tests but ran 1.
  [stdio] -Dcc=clang -Duseithreads DEBUGGING
~~ ../dist/threads-shared/t/shared_attr.t ...................... FAILED Bad plan.  You planned 101 tests but ran 2.
  [stdio] -Dcc=clang -Duseithreads DEBUGGING
~~ ../dist/threads/t/thread.t .................................. FAILED 28
  [stdio] -Dcc=clang -Duseithreads -Duse64bitall DEBUGGING
~~ ../cpan/Test-Simple/t/Test2/regression/693_ipc_ordering.t ... FAILED No plan found in TAP output
  [stdio] -Dcc=clang -Duseithreads -Duse64bitall DEBUGGING
  [stdio] -Dcc=clang -Duseithreads DEBUGGING
~~ ../dist/threads-shared/t/av_refs.t .......................... FAILED Bad plan.  You planned 14 tests but ran 3.
  [stdio] -Dcc=clang -Duseithreads DEBUGGING
~~ ../ext/XS-APItest/t/my_cxt.t ................................ FAILED Bad plan.  You planned 16 tests but ran 7.
  [stdio] -Dcc=clang -Duseithreads -Duse64bitall DEBUGGING
  [stdio] -Dcc=clang -Duseithreads DEBUGGING
~~ ../dist/threads-shared/t/object2.t .......................... FAILED Bad plan.  You planned 133 tests but ran 121.
  [stdio] -Dcc=clang -Duseithreads -Duse64bitall DEBUGGING
~~ ../ext/Hash-Util-FieldHash/t/03_class.t ..................... FAILED Bad plan.  You planned 7 tests but ran 2.
  [stdio] -Dcc=clang -Duseithreads -Duse64bitall DEBUGGING
~~ ../dist/threads-shared/t/wait.t ............................. FAILED Bad plan.  You planned 91 tests but ran 0.
  [stdio] -Dcc=clang -Duseithreads DEBUGGING
~~ ../t/op/reset.t ............................................. FAILED 38
  [stdio] -Dcc=clang -Duseithreads -Duse64bitall DEBUGGING
~~ ../dist/threads/t/kill.t .................................... FAILED No plan found in TAP output
  [stdio] -Dcc=clang -Duseithreads -Duse64bitall DEBUGGING
~~ ../cpan/Test-Simple/t/Test2/modules/API/Instance.t .......... FAILED No plan found in TAP output
  [stdio] -Dcc=clang -Duseithreads -Duse64bitall DEBUGGING
  [stdio] -Dcc=clang -Duseithreads DEBUGGING
~~ ../t/re/pat_special_cc_thr.t ................................ FAILED Bad plan.  You planned 9 tests but ran 0.
  [stdio] -Dcc=clang -Duseithreads -Duse64bitall DEBUGGING
  [stdio] -Dcc=clang -Duseithreads DEBUGGING
~~ ../dist/threads-shared/t/stress.t ........................... FAILED Bad plan.  You planned 1 tests but ran 0.
  [stdio] -Dcc=clang -Duseithreads DEBUGGING
~~ ../dist/threads/t/stack.t ................................... FAILED Bad plan.  You planned 18 tests but ran 4.
  [stdio] -Dcc=clang -Duseithreads -Duse64bitall DEBUGGING
  [stdio] -Dcc=clang -Duseithreads DEBUGGING
~~ ../ext/PerlIO-scalar/t/scalar.t ............................. FAILED Bad plan.  You planned 123 tests but ran 82.
  [stdio] -Dcc=clang -Duseithreads -Duse64bitall DEBUGGING
~~ ../dist/threads/t/state.t ................................... FAILED Bad plan.  You planned 59 tests but ran 1.
  [stdio] -Dcc=clang -Duseithreads -Duse64bitall DEBUGGING
  [stdio] -Dcc=clang -Duseithreads DEBUGGING
~~ ../cpan/Tie-RefHash/t/threaded.t ............................ FAILED Bad plan.  You planned 14 tests but ran 3.
  [stdio] -Dcc=clang -Duseithreads DEBUGGING
~~ ../dist/threads/t/join.t .................................... FAILED Bad plan.  You planned 20 tests but ran 1.
  [stdio] -Dcc=clang -Duseithreads -Duse64bitall DEBUGGING
~~ ../t/re/regexp_qr_embed_thr.t ............................... FAILED No plan found in TAP output
  [stdio] -Dcc=clang -Duseithreads -Duse64bitall DEBUGGING
  [stdio] -Dcc=clang -Duseithreads DEBUGGING
~~ ../dist/Thread-Queue/t/06_insert.t .......................... FAILED Bad plan.  You planned 16 tests but ran 1.
  [stdio] -Dcc=clang -Duseithreads -Duse64bitall DEBUGGING
  [stdio] -Dcc=clang -Duseithreads DEBUGGING
~~ ../dist/Thread-Semaphore/t/06_timed.t ....................... FAILED Bad plan.  You planned 10 tests but ran 2.
  [stdio] -Dcc=clang -Duseithreads -Duse64bitall DEBUGGING
~~ ../dist/threads-shared/t/av_simple.t ........................ FAILED Bad plan.  You planned 47 tests but ran 9.
  [stdio] -Dcc=clang -Duseithreads -Duse64bitall DEBUGGING
~~ ../dist/threads-shared/t/hv_simple.t ........................ FAILED Bad plan.  You planned 16 tests but ran 2.
  [stdio] -Dcc=clang -Duseithreads DEBUGGING
~~ ../t/op/substr_thr.t ........................................ FAILED Bad plan.  You planned 400 tests but ran 13.
  [stdio] -Dcc=clang -Duseithreads DEBUGGING
~~ ../dist/Thread-Queue/t/01_basic.t ........................... FAILED Bad plan.  You planned 81 tests but ran 2.
  [stdio] -Dcc=clang -Duseithreads -Duse64bitall DEBUGGING
  [stdio] -Dcc=clang -Duseithreads DEBUGGING
~~ ../cpan/DB_File/t/db-threads.t .............................. FAILED Bad plan.  You planned 7 tests but ran 2.
  [stdio] -Dcc=clang -Duseithreads -Duse64bitall DEBUGGING
  [stdio] -Dcc=clang -Duseithreads DEBUGGING
~~ ../t/re/pat_psycho_thr.t .................................... FAILED No plan found in TAP output
  [stdio] -Dcc=clang -Duseithreads -Duse64bitall DEBUGGING
  [stdio] -Dcc=clang -Duseithreads DEBUGGING
~~ ../cpan/Test-Simple/t/Legacy/Regression/683_thread_todo.t ... FAILED No plan found in TAP output
  [stdio] -Dcc=clang -Duseithreads -Duse64bitall DEBUGGING
  [stdio] -Dcc=clang -Duseithreads DEBUGGING
~~ ../ext/PerlIO-via/t/thread.t ................................ FAILED Bad plan.  You planned 2 tests but ran 0.
  [stdio] -Dcc=clang -Duseithreads -Duse64bitall DEBUGGING
  [stdio] -Dcc=clang -Duseithreads DEBUGGING
~~ ../t/re/pat_re_eval_thr.t ................................... FAILED Bad plan.  You planned 502 tests but ran 0.
  [stdio] -Dcc=clang -Duseithreads -Duse64bitall DEBUGGING
  [stdio] -Dcc=clang -Duseithreads DEBUGGING
~~ ../t/re/pat_advanced_thr.t .................................. FAILED No plan found in TAP output
  [stdio] -Dcc=clang -Duseithreads -Duse64bitall DEBUGGING
  [stdio] -Dcc=clang -Duseithreads DEBUGGING
~~ ../ext/Hash-Util-FieldHash/t/04_thread.t .................... FAILED Bad plan.  You planned 30 tests but ran 6.
  [stdio] -Dcc=clang -Duseithreads -Duse64bitall DEBUGGING
~~ ../t/re/reg_email_thr.t ..................................... FAILED No plan found in TAP output
  [stdio] -Dcc=clang -Duseithreads -Duse64bitall DEBUGGING
~~ ../dist/Thread-Semaphore/t/01_basic.t ....................... FAILED Bad plan.  You planned 10 tests but ran 2.
  [stdio] -Dcc=clang -Duseithreads -Duse64bitall DEBUGGING
  [stdio] -Dcc=clang -Duseithreads DEBUGGING
~~ ../dist/threads-shared/t/hv_refs.t .......................... FAILED Bad plan.  You planned 20 tests but ran 3.
  [stdio] -Dcc=clang -Duseithreads -Duse64bitall DEBUGGING
~~ ../ext/PerlIO-encoding/t/threads.t .......................... FAILED Bad plan.  You planned 4 tests but ran 0.
  [stdio] -Dcc=clang -Duseithreads -Duse64bitall DEBUGGING
  [stdio] -Dcc=clang -Duseithreads DEBUGGING
~~ ../cpan/Test-Simple/t/Test2/acceptance/try_it_threads.t ..... FAILED Bad plan.  You planned 6 tests but ran 0.
  [stdio] -Dcc=clang -Duseithreads -Duse64bitall DEBUGGING
  [stdio] -Dcc=clang -Duseithreads DEBUGGING
~~ ../dist/threads/t/blocks.t .................................. FAILED Bad plan.  You planned 5 tests but ran 0.
  [stdio] -Dcc=clang -Duseithreads -Duse64bitall DEBUGGING
~~ ../dist/Thread-Queue/t/05_extract.t ......................... FAILED Bad plan.  You planned 20 tests but ran 1.
  [stdio] -Dcc=clang -Duseithreads DEBUGGING
~~ ../t/re/pat_thr.t ........................................... FAILED Bad plan.  You planned 849 tests but ran 0.
  [stdio] -Dcc=clang -Duseithreads -Duse64bitall DEBUGGING
  [stdio] -Dcc=clang -Duseithreads DEBUGGING
~~ ../dist/Thread-Queue/t/09_ended.t ........................... FAILED Bad plan.  You planned 60 tests but ran 0.
  [stdio] -Dcc=clang -Duseithreads -Duse64bitall DEBUGGING
  [stdio] -Dcc=clang -Duseithreads DEBUGGING
~~ ../dist/Thread-Queue/t/07_lock.t ............................ FAILED Bad plan.  You planned 3 tests but ran 1.
  [stdio] -Dcc=clang -Duseithreads -Duse64bitall DEBUGGING
  [stdio] -Dcc=clang -Duseithreads DEBUGGING
~~ ../cpan/Test-Simple/t/regression/fork_first.t ............... FAILED No plan found in TAP output
  [stdio] -Dcc=clang -Duseithreads -Duse64bitall DEBUGGING
  [stdio] -Dcc=clang -Duseithreads DEBUGGING
~~ ../t/op/getpid.t ............................................ FAILED Bad plan.  You planned 3 tests but ran 1.
  [stdio] -Dcc=clang -Duseithreads -Duse64bitall DEBUGGING
~~ ../t/run/locale.t ........................................... FAILED 38-39
  [stdio] -Dcc=clang -Duse64bitall DEBUGGING
  [stdio] -Dcc=clang DEBUGGING
  [stdio] -Dcc=clang -Duse64bitall
  [stdio] -Dcc=clang
~~ ../dist/threads-shared/t/blessed.t .......................... FAILED Bad plan.  You planned 37 tests but ran 1.
  [stdio] -Dcc=clang -Duseithreads -Duse64bitall DEBUGGING
  [stdio] -Dcc=clang -Duseithreads DEBUGGING
~~ ../t/re/regexp_unicode_prop_thr.t ........................... FAILED Bad plan.  You planned 1098 tests but ran 1.
  [stdio] -Dcc=clang -Duseithreads -Duse64bitall DEBUGGING
  [stdio] -Dcc=clang -Duseithreads DEBUGGING
~~ ../lib/Thread.t ............................................. FAILED Bad plan.  You planned 13 tests but ran 0.
  [stdio] -Dcc=clang -Duseithreads -Duse64bitall DEBUGGING
  [stdio] -Dcc=clang -Duseithreads DEBUGGING
~~ ../t/op/threads.t ........................................... FAILED 3 Bad plan.  You planned 30 tests but ran 3.
  [stdio] -Dcc=clang -Duseithreads -Duse64bitall DEBUGGING
  [stdio] -Dcc=clang -Duseithreads DEBUGGING
~~ ../dist/threads/t/err.t ..................................... FAILED Bad plan.  You planned 10 tests but ran 1.
  [stdio] -Dcc=clang -Duseithreads DEBUGGING
~~ ../dist/threads-shared/t/no_share.t ......................... FAILED Bad plan.  You planned 6 tests but ran 3.
  [stdio] -Dcc=clang -Duseithreads -Duse64bitall DEBUGGING
  [stdio] -Dcc=clang -Duseithreads DEBUGGING
~~ ../dist/threads/t/end.t ..................................... FAILED Bad plan.  You planned 6 tests but ran 1.
  [stdio] -Dcc=clang -Duseithreads DEBUGGING
~~ ../dist/threads/t/free.t .................................... FAILED Bad plan.  You planned 29 tests but ran 0.
  [stdio] -Dcc=clang -Duseithreads -Duse64bitall DEBUGGING
~~ ../ext/File-Glob/t/threads.t ................................ FAILED No plan found in TAP output
  [stdio] -Dcc=clang -Duseithreads DEBUGGING
~~ ../cpan/Test-Simple/t/Test2/modules/Hub.t ................... FAILED No plan found in TAP output
  [stdio] -Dcc=clang -Duseithreads -Duse64bitall DEBUGGING
  [stdio] -Dcc=clang -Duseithreads DEBUGGING
~~ ../dist/threads-shared/t/dualvar.t .......................... FAILED Bad plan.  You planned 226 tests but ran 217.
  [stdio] -Dcc=clang -Duseithreads -Duse64bitall DEBUGGING
  [stdio] -Dcc=clang -Duseithreads DEBUGGING
~~ ../dist/Thread-Semaphore/t/04_nonblocking.t ................. FAILED Bad plan.  You planned 12 tests but ran 2.
  [stdio] -Dcc=clang -Duseithreads -Duse64bitall DEBUGGING
  [stdio] -Dcc=clang -Duseithreads DEBUGGING
~~ ../dist/threads-shared/t/sv_simple.t ........................ FAILED Bad plan.  You planned 11 tests but ran 3.
  [stdio] -Dcc=clang -Duseithreads -Duse64bitall DEBUGGING
~~ ../cpan/Test-Simple/t/Legacy/threads.t ...................... FAILED Bad plan.  You planned 6 tests but ran 0.
  [stdio] -Dcc=clang -Duseithreads -Duse64bitall DEBUGGING
  [stdio] -Dcc=clang -Duseithreads DEBUGGING
~~ ../dist/threads-shared/t/cond.t ............................. FAILED Bad plan.  You planned 32 tests but ran 2.
  [stdio] -Dcc=clang -Duseithreads -Duse64bitall DEBUGGING
~~ ../dist/Storable/t/threads.t ................................ FAILED Bad plan.  You planned 2 tests but ran 0.
  [stdio] -Dcc=clang -Duseithreads -Duse64bitall DEBUGGING
  [stdio] -Dcc=clang -Duseithreads DEBUGGING
~~ ../dist/threads/t/problems.t ................................ FAILED Bad plan.  You planned 10 tests but ran 1.
  [stdio] -Dcc=clang -Duseithreads -Duse64bitall DEBUGGING
  [stdio] -Dcc=clang -Duseithreads DEBUGGING
~~ ../dist/threads-shared/t/sv_refs.t .......................... FAILED Bad plan.  You planned 21 tests but ran 6.
  [stdio] -Dcc=clang -Duseithreads DEBUGGING
~~ ../cpan/Test-Simple/t/Test2/behavior/ipc_wait_timeout.t ..... FAILED Bad plan.  You planned 6 tests but ran 4.
  [stdio] -Dcc=clang -Duseithreads -Duse64bitall DEBUGGING
  [stdio] -Dcc=clang -Duseithreads DEBUGGING
~~ ../t/op/index_thr.t ......................................... FAILED Bad plan.  You planned 412 tests but ran 0.
  [stdio] -Dcc=clang -Duseithreads -Duse64bitall DEBUGGING
~~ ../ext/XS-APItest/t/keyword_plugin_threads.t ................ FAILED 1
  [stdio] -Dcc=clang -Duseithreads -Duse64bitall DEBUGGING
~~ ../dist/Thread-Queue/t/11_limit.t ........................... FAILED Bad plan.  You planned 13 tests but ran 0.
  [stdio] -Dcc=clang -Duseithreads -Duse64bitall DEBUGGING

Test todo-passed:

MANIFEST messages:

Compiler messages:
  ./const-c.inc:351:42: warning: unused parameter 'iv_return' [-Wunused-parameter]

About this smoke:
    smoking-perl: 5.26.1
  smoker-version: 1.71/0.046
       timestamp: 2018-11-14 06:42:59+00
          tester: core

-- 
Report generated by Test::Smoke::Gateway v0.09_01