Show logfile
Automated smoke report for branch blead 5.29.4 patch 8fc05532aec097a3733b92fbb2cabb1528daa5c4 v5.29.3-58-g8fc05532ae
r9: PA8900 (PA-RISC2.0/64/1 cpus)
    on        HP-UX B.11.11/64
    using     cc version B.11.11.18 (*1)
    smoketime 1 day 14 hours 11 minutes (average 4 hours 46 minutes)

Summary: FAIL(F)

O = OK  F = Failure(s), extended report at the bottom
X = Failure(s) under TEST but not under harness
? = still running or test results not (yet) available
Build failures during:       - = unknown or N/A
c = Configure, m = make, M = make (after miniperl), t = make test-prep

v5.29.3-58-g8fc05532ae
---------------------- ----------------------------------------------------
F  F  F  F  F  F         (*1)
F  F  F  F  F  F        -Duse64bitall (*1)
F  F  F  F  F  F        -Duseithreads (*1)
F  F  F  F  F  F        -Duseithreads -Duse64bitall (*1)
|  |  |  |  |  |
|  |  |  |  |  +------  locale:univ.utf8 DEBUGGING
|  |  |  |  +---------  perlio DEBUGGING
|  |  |  +------------  stdio DEBUGGING
|  |  +---------------  locale:univ.utf8
|  +------------------  perlio
+---------------------  stdio

Applied patches:
  SMOKE8fc05532aec097a3733b92fbb2cabb1528daa5c4

Skipped tests:
  None

Test failures:
~~ ../t/run/switches.t ......................................... FAILED 110-111
  [locale:univ.utf8] -Duseithreads -Duse64bitall DEBUGGING
~~ ../t/run/switches.t ......................................... FAILED Non-zero exit status: 2 Bad plan.  You planned 137 tests but ran 105.
  [perlio] -Duseithreads -Duse64bitall DEBUGGING
~~ ../t/re/fold_grind.t ........................................ FAILED No plan found in TAP output
  [stdio/perlio/locale:univ.utf8] 
  [stdio/perlio/locale:univ.utf8] -Duseithreads DEBUGGING
  [stdio/perlio/locale:univ.utf8] -Duseithreads -Duse64bitall DEBUGGING
  [stdio/perlio/locale:univ.utf8] -Duse64bitall DEBUGGING
  [stdio/perlio/locale:univ.utf8]  DEBUGGING
  [stdio] -Duseithreads
  [stdio/perlio/locale:univ.utf8] -Duse64bitall
  [stdio] -Duseithreads -Duse64bitall
~~ ../cpan/Socket/t/Socket.t ................................... FAILED Non-zero exit status: 255 Bad plan.  You planned 6 tests but ran 2.
  [locale:univ.utf8] 
  [locale:univ.utf8] -Duseithreads DEBUGGING
  [locale:univ.utf8] -Duseithreads -Duse64bitall DEBUGGING
  [locale:univ.utf8] -Duse64bitall DEBUGGING
  [locale:univ.utf8]  DEBUGGING
  [locale:univ.utf8] -Duseithreads
  [locale:univ.utf8] -Duse64bitall
  [locale:univ.utf8] -Duseithreads -Duse64bitall
~~ ../lib/warnings.t ........................................... FAILED 778-779
  [stdio/perlio/locale:univ.utf8] 
  [stdio/perlio/locale:univ.utf8] -Duseithreads DEBUGGING
  [stdio/perlio/locale:univ.utf8]  DEBUGGING
  [stdio/perlio/locale:univ.utf8] -Duseithreads
~~ ../t/io/nargv.t ............................................. FAILED Bad plan.  You planned 7 tests but ran 0.
  [locale:univ.utf8] -Duseithreads -Duse64bitall DEBUGGING
~~ ../t/op/alarm.t ............................................. FAILED 2
  [locale:univ.utf8] 
~~ ../lib/warnings.t ........................................... FAILED 368
  [stdio/perlio/locale:univ.utf8] -Duseithreads -Duse64bitall DEBUGGING
  [stdio/perlio/locale:univ.utf8] -Duseithreads -Duse64bitall
  [stdio/perlio/locale:univ.utf8] -Duse64bitall DEBUGGING
  [stdio/perlio/locale:univ.utf8] -Duse64bitall
~~ ../t/io/argv.t .............................................. FAILED Bad plan.  You planned 37 tests but ran 10.
  [perlio] -Duseithreads -Duse64bitall DEBUGGING
~~ ../dist/Thread-Queue/t/03_peek.t ............................ FAILED Bad plan.  You planned 19 tests but ran 1.
  [perlio] -Duseithreads -Duse64bitall
~~ ../lib/locale.t ............................................. FAILED 431-432
  [stdio/perlio/locale:univ.utf8] 
  [stdio/perlio/locale:univ.utf8] -Duseithreads DEBUGGING
  [stdio/perlio/locale:univ.utf8] -Duseithreads -Duse64bitall DEBUGGING
  [stdio/perlio/locale:univ.utf8] -Duse64bitall DEBUGGING
  [stdio/perlio/locale:univ.utf8]  DEBUGGING
  [stdio/perlio/locale:univ.utf8] -Duseithreads
  [stdio/perlio/locale:univ.utf8] -Duse64bitall
  [stdio/perlio/locale:univ.utf8] -Duseithreads -Duse64bitall
~~ ../ext/Hash-Util-FieldHash/t/03_class.t ..................... FAILED Bad plan.  You planned 7 tests but ran 6.
  [perlio] -Duseithreads -Duse64bitall DEBUGGING

Test todo-passed:
~~ ../dist/Net-Ping/t/450_service.t ............................ PASSED 9
  [stdio/perlio/locale:univ.utf8] 
  [stdio/perlio/locale:univ.utf8] -Duseithreads DEBUGGING
  [stdio/perlio/locale:univ.utf8] -Duseithreads -Duse64bitall DEBUGGING
  [stdio/perlio/locale:univ.utf8] -Duse64bitall DEBUGGING
  [stdio/perlio/locale:univ.utf8]  DEBUGGING
  [stdio/perlio/locale:univ.utf8] -Duseithreads
  [stdio/perlio/locale:univ.utf8] -Duse64bitall
  [stdio/perlio/locale:univ.utf8] -Duseithreads -Duse64bitall
~~ ../lib/B/Deparse.t .......................................... PASSED 2
  [locale:univ.utf8] 
  [locale:univ.utf8] -Duseithreads DEBUGGING
  [locale:univ.utf8] -Duseithreads -Duse64bitall DEBUGGING
  [locale:univ.utf8] -Duse64bitall DEBUGGING
  [locale:univ.utf8]  DEBUGGING
  [locale:univ.utf8] -Duseithreads
  [locale:univ.utf8] -Duse64bitall
  [locale:univ.utf8] -Duseithreads -Duse64bitall

MANIFEST messages:

Compiler messages:

About this smoke:
    smoking-perl: 5.14.2
  smoker-version: 1.72_05/0.046
       timestamp: 2018-10-13 20:00:08+00
          tester: merijn

Status overview available here: https://tux.nl/perl5/smoke/
-- 
Report generated by Test::Smoke::Gateway v0.09_01