Show logfile
Automated smoke report for branch blead 5.29.3 patch 524a2f33c8dc2fae028dee5691dc076b8c47238b v5.29.2-59-g524a2f33c8
cjg-netbsd7: Intel 686-class (amd64/1 cpus)
    on        netbsd 7.1.2
    using     gcc version 4.8.5 (*1)
    smoketime 4 hours 7 minutes (average 30 minutes 55 seconds)

Summary: PASS

O = OK  F = Failure(s), extended report at the bottom
X = Failure(s) under TEST but not under harness
? = still running or test results not (yet) available
Build failures during:       - = unknown or N/A
c = Configure, m = make, M = make (after miniperl), t = make test-prep

---------------------- ----------------------------------------------------
O  O                    -Dcc=gcc (*1)
O  O                    -Dcc=gcc -Duse64bitall (*1)
O  O                    -Dcc=gcc -Duseithreads (*1)
O  O                    -Dcc=gcc -Duseithreads -Duse64bitall (*1)
|  |
|  +------------------  stdio DEBUGGING
+---------------------  stdio

Applied patches:

Skipped tests:
      # One test name on a line

Test failures:

Test todo-passed:

MANIFEST messages:

Compiler messages:
  utf8.c: In function 'Perl__to_utf8_fold_flags':
  handy.h:516:21: warning: comparison between signed and unsigned integer expressions [-Wsign-compare]
  utf8.c:3953:17: note: in expansion of macro 'memBEGINs'
  utf8.c:3963:22: note: in expansion of macro 'memBEGINs'
  /usr/include/sys/cdefs_elf.h:67:20: error: missing binary operator before token "("
  /usr/include/sys/cdefs_elf.h:73:20: error: missing binary operator before token "("
  /usr/include/sys/cdefs_elf.h:79:20: error: missing binary operator before token "("
  Socket.c: In function 'XS_Socket_pack_ip_mreq_source':
  Socket.c:1654:7: warning: variable 'interface' set but not used [-Wunused-but-set-variable] In function 'constant_19': warning: unused parameter 'iv_return' [-Wunused-parameter]
  Piece.xs: In function '_strptime':
  Piece.xs:719:8: warning: 'len' may be used uninitialized in this function [-Wmaybe-uninitialized]

About this smoke:
    smoking-perl: 5.26.1
  smoker-version: 1.71/0.046
       timestamp: 2018-09-14 04:08:22+00
          tester: core

Report generated by Test::Smoke::Gateway v0.09_01