Show logfile
Automated smoke report for branch smoke-me/khw-core 5.29.2 patch bcfde63d51e6c688b13db915a93881f31408ba93 v5.29.1-126-gbcfde63d51
cjg-windows2016: Virtual CPU a7769a6388d5(~2394 MHz) (Intel64/2 cpus)
    on        MSWin32 Win10 Standard (64-bit)
    using     gcc version 7.1.0 (*1)
    smoketime 5 hours 33 minutes (average 41 minutes 44 seconds)

Summary: FAIL(F)

O = OK  F = Failure(s), extended report at the bottom
X = Failure(s) under TEST but not under harness
? = still running or test results not (yet) available
Build failures during:       - = unknown or N/A
c = Configure, m = make, M = make (after miniperl), t = make test-prep

v5.29.1-126-gbcfde63d51
---------------------- ----------------------------------------------------
F  F                     (*1)
F  F                    -Duselargefiles (*1)
F  F                    -Duseithreads (*1)
F  F                    -Duseithreads -Duselargefiles (*1)
|  |
|  +------------------  stdio DEBUGGING
+---------------------  stdio

Applied patches:
  SMOKEbcfde63d51e6c688b13db915a93881f31408ba93

Skipped tests:
      # One test name on a line

Test failures:
~~ ../cpan/CPAN-Meta-YAML/t/31_local_tml.t ..................... FAILED Non-zero exit status: 2 No plan found in TAP output
  [stdio] 
  [stdio] -Duseithreads -Duselargefiles
  [stdio] -Duseithreads DEBUGGING
  [stdio] -Duselargefiles
  [stdio] -Duseithreads -Duselargefiles DEBUGGING
  [stdio]  DEBUGGING
  [stdio] -Duseithreads
  [stdio] -Duselargefiles DEBUGGING
~~ ../cpan/CPAN-Meta-YAML/t/30_yaml_spec_tml.t ................. FAILED Non-zero exit status: 2 No plan found in TAP output
  [stdio] 
  [stdio] -Duseithreads -Duselargefiles
  [stdio] -Duseithreads DEBUGGING
  [stdio] -Duselargefiles
  [stdio] -Duseithreads -Duselargefiles DEBUGGING
  [stdio]  DEBUGGING
  [stdio] -Duseithreads
  [stdio] -Duselargefiles DEBUGGING
~~ ../t/op/taint.t ............................................. FAILED 1
  [stdio] -Duseithreads -Duselargefiles
  [stdio] -Duseithreads DEBUGGING
  [stdio] -Duseithreads -Duselargefiles DEBUGGING
  [stdio] -Duseithreads
~~ ../t/re/uniprops03.t ........................................ FAILED 273-280 407-438 619-650 793-824 969-976 1093-1100 2081-2088 2205-2212 2327-2358 2531-2538 2659-2666 3647-3678 Non-zero exit status: 255
  [stdio] 
  [stdio] -Duseithreads -Duselargefiles
  [stdio] -Duseithreads DEBUGGING
  [stdio] -Duselargefiles
  [stdio] -Duseithreads -Duselargefiles DEBUGGING
  [stdio]  DEBUGGING
  [stdio] -Duseithreads
  [stdio] -Duselargefiles DEBUGGING
~~ ../t/re/uniprops02.t ........................................ FAILED 22419-22450 22763-22794 22965-22972 23047-23054 23129-23160 23253-23260 23335-23342 23417-23448 23541-23548 23623-23630 23705-23712 23787-23794 23867-23898 24067-24106 24303-24310 24431-24438 24555-24562 24675-24682 24795-24810 24931-24946 25067-25098 25269-25276 25393-25400 25517-25524 25641-25648 25765-25772 25889-25896 26013-26020 26137-26144 27055-27062 27183-27190 27307-27338 27651-27682 27995-28026 28339-28370 28759-28766 28887-28894 29011-29042 30437-30444 30561-30568 30683-30714 30883-30922 31115-31154 31347-31378 31549-31556 31673-31680 31797-31804 31879-31886 31961-31992 33163-33194 Non-zero exit status: 255
  [stdio] 
  [stdio] -Duseithreads -Duselargefiles
  [stdio] -Duseithreads DEBUGGING
  [stdio] -Duselargefiles
  [stdio] -Duseithreads -Duselargefiles DEBUGGING
  [stdio]  DEBUGGING
  [stdio] -Duseithreads
  [stdio] -Duselargefiles DEBUGGING
~~ ../cpan/CPAN-Meta-YAML/t/32_world_tml.t ..................... FAILED Non-zero exit status: 2 No plan found in TAP output
  [stdio] 
  [stdio] -Duseithreads -Duselargefiles
  [stdio] -Duseithreads DEBUGGING
  [stdio] -Duselargefiles
  [stdio] -Duseithreads -Duselargefiles DEBUGGING
  [stdio]  DEBUGGING
  [stdio] -Duseithreads
  [stdio] -Duselargefiles DEBUGGING
~~ ../t/porting/customized.t ................................... FAILED 1-26
  [stdio] 
  [stdio] -Duseithreads -Duselargefiles
  [stdio] -Duseithreads DEBUGGING
  [stdio] -Duselargefiles
  [stdio] -Duseithreads -Duselargefiles DEBUGGING
  [stdio]  DEBUGGING
  [stdio] -Duseithreads
  [stdio] -Duselargefiles DEBUGGING
~~ ../t/porting/regen.t ........................................ FAILED 12 Non-zero exit status: 255 Bad plan.  You planned 45 tests but ran 12.
  [stdio] 
  [stdio] -Duseithreads -Duselargefiles
  [stdio] -Duseithreads DEBUGGING
  [stdio] -Duselargefiles
  [stdio] -Duseithreads -Duselargefiles DEBUGGING
  [stdio]  DEBUGGING
  [stdio] -Duseithreads
  [stdio] -Duselargefiles DEBUGGING
~~ ../t/porting/pod_rules.t .................................... FAILED 2-6 Bad plan.  You planned 8 tests but ran 6.
  [stdio] 
  [stdio] -Duseithreads -Duselargefiles
  [stdio] -Duseithreads DEBUGGING
  [stdio] -Duselargefiles
  [stdio] -Duseithreads -Duselargefiles DEBUGGING
  [stdio]  DEBUGGING
  [stdio] -Duseithreads
  [stdio] -Duselargefiles DEBUGGING
~~ ../cpan/podlators/t/text/encoding.t ......................... FAILED Non-zero exit status: 255 Bad plan.  You planned 7 tests but ran 1.
  [stdio] 
  [stdio] -Duseithreads -Duselargefiles
  [stdio] -Duseithreads DEBUGGING
  [stdio] -Duselargefiles
  [stdio] -Duseithreads -Duselargefiles DEBUGGING
  [stdio]  DEBUGGING
  [stdio] -Duseithreads
  [stdio] -Duselargefiles DEBUGGING

Test todo-passed:
~~ ../ext/IPC-Open3/t/IPC-Open3.t .............................. PASSED 25
  [stdio] 
  [stdio] -Duseithreads -Duselargefiles
  [stdio] -Duseithreads DEBUGGING
  [stdio] -Duselargefiles
  [stdio] -Duseithreads -Duselargefiles DEBUGGING
  [stdio]  DEBUGGING
  [stdio] -Duseithreads
  [stdio] -Duselargefiles DEBUGGING

MANIFEST messages:

Compiler messages:
  win32.c: In function 'win32_fseek':
  win32.c:2881:24: warning: passing argument 2 of 'fsetpos' from incompatible pointer type [-Wincompatible-pointer-types]
  C:/home/core/bin/strawberry-perl-5.28.0.1-64bit-portable/c/x86_64-w64-mingw32/include/stdio.h:468:15: note: expected 'const fpos_t * {aka const long long int *}' but argument is of type 'long int *'
  RealPPPort.xs: In function 'XS_Devel__PPPort_ptrtests':
  ..\..\lib\CORE/perl.h:1739:26: warning: cast from pointer to integer of different size [-Wpointer-to-int-cast]
  ..\..\lib\CORE/perl.h:1752:21: note: in expansion of macro 'INT2PTR'
  RealPPPort.xs:1650:27: note: in expansion of macro 'PTR2ul'
  POSIX.c: In function 'XS_POSIX__Termios_getattr':
  POSIX.c:2189:17: warning: cast from pointer to integer of different size [-Wpointer-to-int-cast]
  POSIX.c: In function 'XS_POSIX__Termios_setattr':
  POSIX.c:2245:17: warning: cast from pointer to integer of different size [-Wpointer-to-int-cast]
  POSIX.c: In function 'XS_POSIX__Termios_getispeed':
  POSIX.c:2312:17: warning: cast from pointer to integer of different size [-Wpointer-to-int-cast]
  POSIX.c: In function 'XS_POSIX__Termios_getiflag':
  POSIX.c:2343:17: warning: cast from pointer to integer of different size [-Wpointer-to-int-cast]
  POSIX.c: In function 'XS_POSIX__Termios_getcc':
  POSIX.c:2395:17: warning: cast from pointer to integer of different size [-Wpointer-to-int-cast]
  POSIX.c: In function 'XS_POSIX__Termios_setispeed':
  POSIX.c:2434:17: warning: cast from pointer to integer of different size [-Wpointer-to-int-cast]
  POSIX.c: In function 'XS_POSIX__Termios_setiflag':
  POSIX.c:2476:17: warning: cast from pointer to integer of different size [-Wpointer-to-int-cast]
  POSIX.c: In function 'XS_POSIX__Termios_setcc':
  POSIX.c:2524:17: warning: cast from pointer to integer of different size [-Wpointer-to-int-cast]
  POSIX.xs: In function 'XS_POSIX_ctermid':
  POSIX.xs:1454:20: warning: cast to pointer from integer of different size [-Wint-to-pointer-cast]
  POSIX.xs:3699:11: note: in expansion of macro 'ctermid'
  POSIX.c: In function 'XS_POSIX_ttyname':
  POSIX.xs:1373:22: warning: cast to pointer from integer of different size [-Wint-to-pointer-cast]
  POSIX.c:5515:11: note: in expansion of macro 'ttyname'
  Socket.xs: In function 'XS_Socket_pack_sockaddr_un':
  Socket.xs:876:10: warning: cast to pointer from integer of different size [-Wint-to-pointer-cast]
  Socket.xs: In function 'XS_Socket_unpack_sockaddr_un':
  Socket.xs:943:10: warning: cast to pointer from integer of different size [-Wint-to-pointer-cast]
  Socket.xs: In function 'XS_Socket_pack_sockaddr_in6':
  Socket.xs:1063:10: warning: cast to pointer from integer of different size [-Wint-to-pointer-cast]
  Socket.xs: In function 'XS_Socket_unpack_sockaddr_in6':
  Socket.xs:1106:10: warning: cast to pointer from integer of different size [-Wint-to-pointer-cast]
  APItest.c: In function 'XS_XS__APItest__PtrTable_clear':
  APItest.c:3209:2: warning: 'Perl_ptr_table_clear' is deprecated [-Wdeprecated-declarations]
  ..\..\lib\CORE/proto.h:2744:20: note: declared here
  APItest.xs: In function 'XS_XS__APItest__Magic_test_toLOWER_utf8':
  APItest.xs:6439:13: warning: 'Perl_to_utf8_lower' is deprecated [-Wdeprecated-declarations]
  ..\..\lib\CORE/proto.h:3760:18: note: declared here
  APItest.xs: In function 'XS_XS__APItest__Magic_test_toFOLD_utf8':
  APItest.xs:6529:13: warning: 'Perl_to_utf8_fold' is deprecated [-Wdeprecated-declarations]
  ..\..\lib\CORE/proto.h:3753:18: note: declared here
  APItest.xs: In function 'XS_XS__APItest__Magic_test_toUPPER_utf8':
  APItest.xs:6619:13: warning: 'Perl_to_utf8_upper' is deprecated [-Wdeprecated-declarations]
  ..\..\lib\CORE/proto.h:3774:18: note: declared here
  APItest.xs: In function 'XS_XS__APItest__Magic_test_toTITLE_utf8':
  APItest.xs:6702:13: warning: 'Perl_to_utf8_title' is deprecated [-Wdeprecated-declarations]
  ..\..\lib\CORE/proto.h:3767:18: note: declared here
  compilet.exp:fake:(.edata+0x3c): undefined reference to `boot_compilet'
  t\cplust.exp:fake:(.edata+0x38): undefined reference to `boot_cplust'
  DynaLoader.xs: In function 'XS_DynaLoader_dl_unload_file':
  dlutils.c:66:25: note: in definition of macro 'DLDEBUG'
  DynaLoader.xs:152:71: note: in expansion of macro 'PTR2ul'
  C:/home/core/bin/strawberry-perl-5.28.0.1-64bit-portable/c/lib/gcc/x86_64-w64-mingw32/7.1.0/include/avx512bwintrin.h:25:2: error: #error "Never use  directly; include  instead."
  C:/home/core/bin/strawberry-perl-5.28.0.1-64bit-portable/c/lib/gcc/x86_64-w64-mingw32/7.1.0/include/avx512pfintrin.h:25:2: error: #error "Never use  directly; include  instead."
  C:/home/core/bin/strawberry-perl-5.28.0.1-64bit-portable/c/lib/gcc/x86_64-w64-mingw32/7.1.0/include/clflushoptintrin.h:25:3: error: #error "Never use  directly; include  instead."
  C:/home/core/bin/strawberry-perl-5.28.0.1-64bit-portable/c/lib/gcc/x86_64-w64-mingw32/7.1.0/include/ia32intrin.h:25:3: error: #error "Never use  directly; include  instead."
  threads.xs: In function 'S_jmpenv_run':
  threads.xs:18:23: warning: implicit declaration of function '_setjmpex'; did you mean '_setjmp3'? [-Wimplicit-function-declaration]
  threads.xs:18:23: note: in definition of macro 'setjmp'
  ..\..\lib\CORE/iperlsys.h:1074:31: note: in expansion of macro 'Sigsetjmp'
  ..\..\lib\CORE/cop.h:121:19: note: in expansion of macro 'PerlProc_setjmp'
  threads.xs:504:5: note: in expansion of macro 'JMPENV_PUSH'
  perllib.c: In function 'void xs_init(PerlInterpreter*)':
  perllib.c:37:18: warning: ISO C++ forbids converting a string constant to 'char*' [-Wwrite-strings]
  perlhost.h: In function 'CPerlHost* IPerlMem2Host(IPerlMem*)':
  perlhost.h:230:63: warning: offsetof within non-standard-layout type 'CPerlHost' is undefined [-Winvalid-offsetof]
  perlhost.h:244:12: note: in expansion of macro 'STRUCT2RAWPTR'
  perlhost.h: In function 'CPerlHost* IPerlMemShared2Host(IPerlMem*)':
  perlhost.h:249:12: note: in expansion of macro 'STRUCT2RAWPTR'
  perlhost.h: In function 'CPerlHost* IPerlMemParse2Host(IPerlMem*)':
  perlhost.h:254:12: note: in expansion of macro 'STRUCT2RAWPTR'
  perlhost.h: In function 'CPerlHost* IPerlEnv2Host(IPerlEnv*)':
  perlhost.h:237:38: note: in expansion of macro 'STRUCT2RAWPTR'
  perlhost.h:259:12: note: in expansion of macro 'STRUCT2PTR'
  perlhost.h: In function 'CPerlHost* IPerlStdIO2Host(IPerlStdIO*)':
  perlhost.h:264:12: note: in expansion of macro 'STRUCT2PTR'
  perlhost.h: In function 'CPerlHost* IPerlLIO2Host(IPerlLIO*)':
  perlhost.h:269:12: note: in expansion of macro 'STRUCT2PTR'
  perlhost.h: In function 'CPerlHost* IPerlDir2Host(IPerlDir*)':
  perlhost.h:274:12: note: in expansion of macro 'STRUCT2PTR'
  perlhost.h: In function 'CPerlHost* IPerlSock2Host(IPerlSock*)':
  perlhost.h:279:12: note: in expansion of macro 'STRUCT2PTR'
  perlhost.h: In function 'CPerlHost* IPerlProc2Host(IPerlProc*)':
  perlhost.h:284:12: note: in expansion of macro 'STRUCT2PTR'

About this smoke:
    smoking-perl: 5.28.0
  smoker-version: 1.72/0.046
       timestamp: 2018-08-16 22:50:36+00
          tester: core

-- 
Report generated by Test::Smoke::Gateway v0.09_01