Show logfile
Automated smoke report for branch blead 5.29.2 patch 66f85150154f441b79024356cbc59fbafcff7c2a v5.29.1-78-g66f8515015
r3: PA8800 (PA-RISC2.0/64/2 cpus)
    on        HP-UX B.11.11/64
    using     cc version B.11.11.18 (*1)
    smoketime 21 hours 6 minutes (average 2 hours 38 minutes)

Summary: FAIL(F)

O = OK  F = Failure(s), extended report at the bottom
X = Failure(s) under TEST but not under harness
? = still running or test results not (yet) available
Build failures during:       - = unknown or N/A
c = Configure, m = make, M = make (after miniperl), t = make test-prep

v5.29.1-78-g66f8515015
---------------------- ----------------------------------------------------
F  F  F  F  F  F         (*1)
F  F  F  F  F  F        -Duse64bitall (*1)
F  F  F  F  F  F        -Duseithreads (*1)
F  F  F  F  F  F        -Duseithreads -Duse64bitall (*1)
|  |  |  |  |  |
|  |  |  |  |  +------  locale:univ.utf8 DEBUGGING
|  |  |  |  +---------  perlio DEBUGGING
|  |  |  +------------  stdio DEBUGGING
|  |  +---------------  locale:univ.utf8
|  +------------------  perlio
+---------------------  stdio

Applied patches:
  SMOKE66f85150154f441b79024356cbc59fbafcff7c2a

Skipped tests:
  None

Test failures:
~~ ../t/io/inplace.t ........................................... FAILED Bad plan.  You planned 6 tests but ran 4.
  [perlio] -Duseithreads -Duse64bitall DEBUGGING
~~ ../t/run/switches.t ......................................... FAILED Non-zero exit status: 2 Bad plan.  You planned 137 tests but ran 105.
  [locale:univ.utf8] -Duseithreads -Duse64bitall DEBUGGING
~~ ../t/io/iprefix.t ........................................... FAILED Bad plan.  You planned 2 tests but ran 0.
  [perlio] -Duseithreads -Duse64bitall DEBUGGING
~~ ../t/io/nargv.t ............................................. FAILED Bad plan.  You planned 7 tests but ran 0.
  [stdio] -Duseithreads -Duse64bitall DEBUGGING
~~ ../lib/warnings.t ........................................... FAILED 368
  [stdio/perlio/locale:univ.utf8] -Duseithreads -Duse64bitall DEBUGGING
  [stdio/perlio/locale:univ.utf8] -Duseithreads -Duse64bitall
  [stdio/perlio/locale:univ.utf8] -Duse64bitall DEBUGGING
  [stdio/perlio/locale:univ.utf8] -Duse64bitall
~~ ../lib/warnings.t ........................................... FAILED 781-782
  [stdio/perlio/locale:univ.utf8] 
  [stdio/perlio/locale:univ.utf8] -Duseithreads DEBUGGING
  [stdio/perlio/locale:univ.utf8]  DEBUGGING
  [stdio/perlio/locale:univ.utf8] -Duseithreads
~~ ../t/io/nargv.t ............................................. FAILED Bad plan.  You planned 7 tests but ran 6.
  [locale:univ.utf8] -Duseithreads -Duse64bitall DEBUGGING

Test todo-passed:
~~ ../lib/B/Deparse.t .......................................... PASSED 2
  [locale:univ.utf8] 
  [locale:univ.utf8] -Duseithreads DEBUGGING
  [locale:univ.utf8] -Duseithreads -Duse64bitall DEBUGGING
  [locale:univ.utf8] -Duse64bitall DEBUGGING
  [locale:univ.utf8]  DEBUGGING
  [locale:univ.utf8] -Duseithreads
  [locale:univ.utf8] -Duse64bitall
  [locale:univ.utf8] -Duseithreads -Duse64bitall
~~ ../dist/Net-Ping/t/450_service.t ............................ PASSED 9
  [stdio/perlio/locale:univ.utf8] 
  [stdio/perlio/locale:univ.utf8] -Duseithreads DEBUGGING
  [stdio/perlio/locale:univ.utf8] -Duseithreads -Duse64bitall DEBUGGING
  [stdio/perlio/locale:univ.utf8] -Duse64bitall DEBUGGING
  [stdio/perlio/locale:univ.utf8]  DEBUGGING
  [stdio/perlio/locale:univ.utf8] -Duseithreads
  [stdio/perlio/locale:univ.utf8] -Duse64bitall
  [stdio/perlio/locale:univ.utf8] -Duseithreads -Duse64bitall

MANIFEST messages:

Compiler messages:

About this smoke:
    smoking-perl: 5.14.2
  smoker-version: 1.72_05/0.046
       timestamp: 2018-08-08 20:45:06+00
          tester: merijn

Status overview available here: https://tux.nl/perl5/smoke/
-- 
Report generated by Test::Smoke::Gateway v0.09_01