Show logfile
Automated smoke report for branch smoke-me/khw-mvit 5.29.2 patch 707b495d4b05298f5ca5846893893ec9fede3e5f v5.29.1-36-g707b495d4b
cjg-slackware14: Intel(R) Xeon(R) CPU L5640 @ 2.27GHz (GenuineIntel 2267MHz) (x86_64/1 cpus)
    on        linux 4.4.132 [Slackware 14.2]
    using     cc version 5.5.0 (*1)
    smoketime 6 hours 9 minutes (average 30 minutes 50 seconds)

Summary: FAIL(F)

O = OK  F = Failure(s), extended report at the bottom
X = Failure(s) under TEST but not under harness
? = still running or test results not (yet) available
Build failures during:       - = unknown or N/A
c = Configure, m = make, M = make (after miniperl), t = make test-prep

v5.29.1-36-g707b495d4b
---------------------- ----------------------------------------------------
F  F                     (*1)
F  F                    -Dusequadmath (*1)
F  F                    -Duse64bitall (*1)
F  F                    -Duseithreads (*1)
F  F                    -Duseithreads -Dusequadmath (*1)
F  F                    -Duseithreads -Duse64bitall (*1)
|  |
|  +------------------  stdio DEBUGGING
+---------------------  stdio

Applied patches:
  SMOKE707b495d4b05298f5ca5846893893ec9fede3e5f

Skipped tests:
      # One test name on a line

Test failures:
~~ ../t/porting/globvar.t ...................................... FAILED 1-193
  [stdio] 
  [stdio] -Duse64bitall DEBUGGING
  [stdio] -Duse64bitall
  [stdio] -Dusequadmath
  [stdio]  DEBUGGING
  [stdio] -Dusequadmath DEBUGGING
~~ ../t/porting/globvar.t ...................................... FAILED 1-1140
  [stdio] -Duseithreads DEBUGGING
  [stdio] -Duseithreads -Duse64bitall DEBUGGING
  [stdio] -Duseithreads -Duse64bitall
  [stdio] -Duseithreads -Dusequadmath DEBUGGING
  [stdio] -Duseithreads
  [stdio] -Duseithreads -Dusequadmath
~~ ../lib/File/Copy.t .......................................... FAILED 53 Non-zero exit status: 1
  [stdio] -Dusequadmath
  [stdio] -Duseithreads -Dusequadmath DEBUGGING
  [stdio] -Dusequadmath DEBUGGING
  [stdio] -Duseithreads -Dusequadmath

Test todo-passed:

MANIFEST messages:

Compiler messages:

About this smoke:
    smoking-perl: 5.26.1
  smoker-version: 1.71/0.046
       timestamp: 2018-07-29 01:33:49+00
          tester: core

-- 
Report generated by Test::Smoke::Gateway v0.09_01