Show logfile
Automated smoke report for branch blead 5.29.2 patch eedb5413d38c92327bdf70ff2594f164f2610d0c v5.29.1-35-geedb5413d3
x2: ia64 (ia64/4 cpus)
    on        HP-UX B.11.31/64
    using     ccache cc version B3910B A.06.28.02 (*1)
    smoketime 3 hours 29 minutes (average 26 minutes 15 seconds)

Summary: FAIL(Fm)

O = OK  F = Failure(s), extended report at the bottom
X = Failure(s) under TEST but not under harness
? = still running or test results not (yet) available
Build failures during:       - = unknown or N/A
c = Configure, m = make, M = make (after miniperl), t = make test-prep

v5.29.1-35-geedb5413d3
---------------------- ----------------------------------------------------
F  F  F  F  F  F         (*1)
F  F  F  F  F  F        -Duse64bitall (*1)
m  -  -  m  -  -        -Duseithreads (*1)
m  -  -  m  -  -        -Duseithreads -Duse64bitall (*1)
|  |  |  |  |  |
|  |  |  |  |  +------  locale:en_US.utf8 DEBUGGING
|  |  |  |  +---------  perlio DEBUGGING
|  |  |  +------------  stdio DEBUGGING
|  |  +---------------  locale:en_US.utf8
|  +------------------  perlio
+---------------------  stdio

Applied patches:
  SMOKEeedb5413d38c92327bdf70ff2594f164f2610d0c

Skipped tests:
  None

Test failures:
~~ ../lib/locale.t ............................................. FAILED 448
  [stdio] -Duse64bitall DEBUGGING
  [locale:en_US.utf8]  DEBUGGING
~~ ../t/re/uniprops01.t ........................................ FAILED 21-34 1979-1982 2015-2018 27483-27486 Non-zero exit status: 255
  [stdio/perlio/locale:en_US.utf8] 
  [stdio/perlio/locale:en_US.utf8] -Duse64bitall DEBUGGING
  [stdio/perlio/locale:en_US.utf8] -Duse64bitall
  [stdio/perlio/locale:en_US.utf8]  DEBUGGING
~~ ../t/uni/fold.t ............................................. FAILED 6019-6022 6041-6044 6063-6066 6085-6088 6107-6110 6129-6132 6151-6154 6173-6176 6195-6198 6217-6220 6239-6242 6261-6264 6283-6286 6305-6308 6327-6330 6349-6352 6371-6374 6393-6396 6415-6418 6437-6440 6459-6462 6481-6484 6503-6506 12649-12652 15730-15733 15752-15755 15774-15777 15796-15799 15818-15821 15840-15843 15862-15865 15884-15887 15906-15909 15928-15931 15950-15953 15972-15975 15994-15997 16016-16019 16038-16041 16060-16063
  [stdio/perlio/locale:en_US.utf8] 
  [stdio/perlio/locale:en_US.utf8] -Duse64bitall DEBUGGING
  [stdio/perlio/locale:en_US.utf8] -Duse64bitall
  [stdio/perlio/locale:en_US.utf8]  DEBUGGING
~~ ../cpan/Text-Tabs/t/Tabs-ElCid.t ............................ FAILED Non-zero exit status: 255 Bad plan.  You planned 10 tests but ran 1.
  [stdio/perlio] 
  [stdio/perlio] -Duse64bitall DEBUGGING
  [stdio/perlio] -Duse64bitall
  [stdio/perlio]  DEBUGGING
~~ ../t/re/uniprops07.t ........................................ FAILED 295-308 603-616 1023-1036 1303-1316 1695-1708 2045-2058 2171-2184 2283-2296 2563-2576 3235-3248 3347-3360 4131-4144 4943-4956 5279-5292 5671-5684 6007-6020 6119-6132 6805-6818 6931-6944 7211-7224 8247-8260 8555-8568 8751-8764 10263-10276 10375-10388 10935-10948 11047-11060 11327-11340 11439-11452 11719-11732 12069-12082 12195-12208 12307-12320 12587-12600 12755-12768 12979-12992 13371-13384 13539-13552 13763-13776 14043-14056 14211-14224 14505-14532 14631-14644 14855-14868 14981-14994 15415-15428 15947-15960 16199-16212 16395-16408 17333-17346 17459-17472 17571-17584 17963-17976 18075-18088 18747-18760 19083-19096 19419-19432 19769-19782 19895-19908 20119-20132 20343-20356 20623-20636 21015-21028 21183-21196 21463-21476 21743-21756 22093-22106 22219-22232 22331-22344 22611-22624 22779-22792 23339-23352 23451-23464 23731-23744 24123-24136 24473-24486 24599-24612 24823-24836 25159-25172 26195-26208 27357-27370
  [stdio/perlio/locale:en_US.utf8] 
  [stdio/perlio/locale:en_US.utf8] -Duse64bitall DEBUGGING
  [stdio/perlio/locale:en_US.utf8] -Duse64bitall
  [stdio/perlio/locale:en_US.utf8]  DEBUGGING
~~ ../t/re/uniprops02.t ........................................ FAILED 418-421 462-465 508-511 552-555 598-601 858-861 904-907 948-951 5638-5641 5674-5677 5854-5857 5890-5893 6002-6005 6038-6041 6142-6145 6178-6181 6214-6217 6250-6253 6794-6797 6830-6833 7010-7013 7046-7049 7514-7517 7550-7553 8018-8021 8054-8057 8378-8381 8414-8417 8526-8529 8562-8565 9026-9029 9062-9065 9170-9173 9206-9209 9242-9245 9278-9281 14428-14431 14464-14467 17368-17371 17404-17407 17440-17443 17476-17479 19876-19879 19912-19915 23862-23865 23896-23899 23928-23931 23962-23965 23996-23999 24028-24031 24550-24553 24584-24587 24616-24619 24650-24653 24682-24685 24716-24719 24748-24751 26248-26251 26284-26287 26320-26323 26356-26359 26392-26395 26428-26431 26464-26467 26500-26503 26536-26539 26572-26575 26716-26723 26968-26971 27004-27007 27496-27499 27532-27535 27568-27571 27604-27607 27840-27843 27876-27879 27912-27915 27948-27951 28184-28187 28220-28223 28256-28259 28292-28295 28528-28531 28564-28567 28600-28603 28636-28639 29200-29203 29236-29239 29272-29275 29308-29311 29344-29347 29380-29383 29416-29419 29452-29455 29488-29491 29524-29527 29596-29603 31102-31105 31136-31139 31168-31171 31202-31205 31234-31237 31268-31271 31300-31303 32144-32147 32180-32183 32216-32219 32252-32255 32288-32291 32324-32327 33424-33427 33460-33463 33496-33499 33532-33535 33568-33571 33604-33607 Non-zero exit status: 255
  [stdio/perlio/locale:en_US.utf8] 
  [stdio/perlio/locale:en_US.utf8] -Duse64bitall DEBUGGING
  [stdio/perlio/locale:en_US.utf8] -Duse64bitall
  [stdio/perlio/locale:en_US.utf8]  DEBUGGING
~~ ../t/re/script_run.t ........................................ FAILED 4 76 133
  [stdio/perlio/locale:en_US.utf8] 
  [stdio/perlio/locale:en_US.utf8] -Duse64bitall DEBUGGING
  [stdio/perlio/locale:en_US.utf8] -Duse64bitall
  [stdio/perlio/locale:en_US.utf8]  DEBUGGING
~~ ../t/re/uniprops06.t ........................................ FAILED 85-98 897-910 1317-1330 1429-1442 2367-2380 2493-2506 2829-2842 3067-3080 3613-3626 3725-3738 3893-3906 4061-4074 4341-4354 4453-4466 4747-4760 4873-4886 5097-5110 5405-5418 6245-6258 6637-6650 7617-7728 8261-8274 10627-10640 11677-11690 12601-12614 13595-13608 13749-13762 14253-14266 14365-14378 14869-14882 14981-14994 15093-15106 15261-15274 15373-15386 15597-15610 15709-15722 16003-16016 16129-16142 16353-16366 16521-16534 17445-17458 17753-17766 17949-17962 18873-18984 19629-19642 20413-20426 20665-20678 20861-20874 20973-20986 21855-21868 21981-21994 22093-22106 22625-22638 23661-23674 24823-24836 24949-24962 25565-25578 26405-26418 26853-26866 28169-28182 30787-30800
  [stdio/perlio/locale:en_US.utf8] 
  [stdio/perlio/locale:en_US.utf8] -Duse64bitall DEBUGGING
  [stdio/perlio/locale:en_US.utf8] -Duse64bitall
  [stdio/perlio/locale:en_US.utf8]  DEBUGGING
~~ ../t/re/uniprops03.t ........................................ FAILED 1165-1168 1201-1204 1237-1240 1273-1276 1309-1312 1345-1348 1381-1384 1417-1420 1597-1600 1633-1636 1669-1672 1705-1708 1741-1744 1777-1780 1813-1816 1849-1852 2733-2736 2769-2772 2805-2808 2841-2844 2877-2880 2913-2916 2949-2952 2985-2988 3165-3168 3201-3204 3237-3240 3273-3276 3309-3312 3345-3348 3381-3384 3417-3420 3797-3800 3833-3836 3869-3872 3905-3908 3941-3944 3977-3980 4013-4016 4049-4052 4681-4684 4717-4720 4749-4752 4785-4788 8607-8610 8643-8646 12477-12480 12513-12516 13611-13614 13647-13650 23703-23706 23739-23742 27077-27080 27113-27116 30209-30212 30245-30248 30281-30284 31667-31670 31703-31706 32281-32284 32317-32320 33919-33922 33955-33958 Non-zero exit status: 255
  [stdio/perlio/locale:en_US.utf8] 
  [stdio/perlio/locale:en_US.utf8] -Duse64bitall DEBUGGING
  [stdio/perlio/locale:en_US.utf8] -Duse64bitall
  [stdio/perlio/locale:en_US.utf8]  DEBUGGING
~~ ../t/re/reg_fold.t .......................................... FAILED 2399-2582
  [stdio/perlio/locale:en_US.utf8] 
  [stdio/perlio/locale:en_US.utf8] -Duse64bitall DEBUGGING
  [stdio/perlio/locale:en_US.utf8] -Duse64bitall
  [stdio/perlio/locale:en_US.utf8]  DEBUGGING
~~ ../t/uni/upper.t ............................................ FAILED 1978-2161
  [stdio/perlio/locale:en_US.utf8] 
  [stdio/perlio/locale:en_US.utf8] -Duse64bitall DEBUGGING
  [stdio/perlio/locale:en_US.utf8] -Duse64bitall
  [stdio/perlio/locale:en_US.utf8]  DEBUGGING
~~ ../t/re/uniprops09.t ........................................ FAILED 1 49 69 115 159 175 217 271 339 395 451 493 509 551 567 609 625 683 725 741 783 799-812 1107-1120 1499-1512 1667-1680 1835-1848 1947-1960 2227-2240 2339-2352 2633-2646 2787-2800 3067-3080 3235-3248 3795-3808 3907-3920 4187-4200 4299-4312 4579-4592 4929-4942 5055-5068 5391-5404 5559-5572 6119-6132 6231-6244 6511-6524 6623-6636 6903-6916 7253-7266 7379-7392 7491-7504 7771-7784 8275-8288 8807-8820 9199-9212 9311-9324 10249-10276 10375-10388 10907-10920 11523-11536 11971-11984 12657-12670 13007-13020 13567-13580 14099-14112 14491-14504 14603-14616 15541-15554 15667-15680 16003-16016 16227-16240 16843-16856 17179-17192 17515-17528 17683-17696 18271-18284 18331 18383-18396 18551-18564 19111-19124 19335-19348 19559-19572 20245-20258 20371-20384 20483-20496 20973-20986 21449-21630 22149-22162 22695-22862 22961-23142 23843 23855 23951 24519 24531 24543 24555 24567 24705 24843 25037 25049 25061 25073 25085 25097 25109 25203 25215 25227 25239 25317 25329 25341 25353 25365 25663-25690 25769 26083-26111 26121 26133 26145 26157 26225 26237-26264 26315 26327 26353 26393 26405 26417 26443 26629-26684 26791 26953 26965-26979 26989 27001 27013 27025 27037 27063 27075 27113 27125 27137 27163 27175-27202 27291 27303 27315-27328 27363 27375
  [stdio/perlio/locale:en_US.utf8] 
  [stdio/perlio/locale:en_US.utf8] -Duse64bitall DEBUGGING
  [stdio/perlio/locale:en_US.utf8] -Duse64bitall
  [stdio/perlio/locale:en_US.utf8]  DEBUGGING
~~ ../t/re/uniprops05.t ........................................ FAILED 21-35 235-249 465-479 734 1104 1335-1348 1610 1841-1855 1971-1985 2101-2115 2261-2275 2361-2375 2503-2517 2708-2722 2838-2852 3046-3060 3284-3298 3384-3451 3589-3603 3748-3762 3848-3915 4185-4199 4285-4299 4444-4458 4556-4570 4715-4729 4815-4882 5003-5017 5162-5176 5262-5276 5421-5435 5533-5600 5692-5706 5845-5859 5980-5994 6139-6153 6239-6306 6444-6458 6603-6617 6703-6747 6863-6877 6963-7037 7123-7137 7282-7296 7487-7501 7587-7601 7746-7760 7951-7965 8125-8133 8291-8298 8468-8482 8570 8583 8640-8653 8709 16858 16870 17064 17076 17088 17100 17112 17124 17136 17148 17282 17294 17306 17318 17330 17342 17382 17394 17406 17418 17430 17442 17454 17466 17478 17490 17502 17514 17526 17552 17578 17590
  [stdio/perlio/locale:en_US.utf8] 
  [stdio/perlio/locale:en_US.utf8] -Duse64bitall DEBUGGING
  [stdio/perlio/locale:en_US.utf8] -Duse64bitall
  [stdio/perlio/locale:en_US.utf8]  DEBUGGING
~~ ../t/uni/lower.t ............................................ FAILED 4753-5120
  [stdio/perlio/locale:en_US.utf8] 
  [stdio/perlio/locale:en_US.utf8] -Duse64bitall DEBUGGING
  [stdio/perlio/locale:en_US.utf8] -Duse64bitall
  [stdio/perlio/locale:en_US.utf8]  DEBUGGING
~~ ../t/re/uniprops04.t ........................................ FAILED 3568-3571 3604-3607 10162-10165 10198-10201 10666-10669 10702-10705 11242-11245 11278-11281 12314-12317 12350-12353 13610-13613 13646-13649 15690-15693 15726-15729 15762-15765 15798-15801 21364-21367 21400-21403 21940-21943 21976-21979 24324-24327 24360-24363 25756-25759 25792-25795 26404-26407 26440-26443 26476-26479 26512-26515 26836-26839 26872-26875 Non-zero exit status: 255
  [stdio/perlio/locale:en_US.utf8] 
  [stdio/perlio/locale:en_US.utf8] -Duse64bitall DEBUGGING
  [stdio/perlio/locale:en_US.utf8] -Duse64bitall
  [stdio/perlio/locale:en_US.utf8]  DEBUGGING
~~ ../t/re/fold_grind.t ........................................ FAILED 393-4472
  [stdio/perlio/locale:en_US.utf8] 
  [stdio/perlio/locale:en_US.utf8] -Duse64bitall DEBUGGING
  [stdio/perlio/locale:en_US.utf8] -Duse64bitall
  [stdio/perlio/locale:en_US.utf8]  DEBUGGING
~~ ../cpan/Text-Tabs/t/Wrap-JLB.t .............................. FAILED 3-5 Non-zero exit status: 255
  [stdio/perlio/locale:en_US.utf8] 
  [stdio/perlio/locale:en_US.utf8] -Duse64bitall DEBUGGING
  [stdio/perlio/locale:en_US.utf8] -Duse64bitall
  [stdio/perlio/locale:en_US.utf8]  DEBUGGING
~~ ../t/re/uniprops08.t ........................................ FAILED 15-28 701-714 1737-1750 2899-2912 3025-3038 3557-3570 3837-3850 4229-4242 4397-4410 4565-4578 4677-4690 4957-4970 5069-5082 5363-5376 5489-5502 5713-5726 6021-6034 6805-6818 7057-7070 7309-7322 8247-8260 8373-8386 8709-8722 12237-12250 12769-12782 13021-13034 13217-13230 14155-14168 14281-14294 14393-14406 14785-14798 15233-15246 17151-17164 17725-17738 20147-20160 20861-20874 21897-21910 23045-23072 23241-23254 23829-23842 24669-24682 25061-25074 26377-26390 26853-26866 28491-28504 29037-29050 29073 29085 29121-29135 29145 29181 29193 29233-29247 29257 29297 29309 29345-29359 29369 29407 29419 29459 29471 29483 29523 29535 29573 29585 29597-29610 29633 29645 29681-29695 29705 29753 29765-29778 29801 29813 29849 29861 29873 29921 29933-29946 29969 29981 30019 30031 30043 30091 30129-30143 30153 30201 30241 30253 30265 30305 30317 30353 30365 30377 30413 30425 30437-30450 30473 30485 30521 30533 30545 30581
  [stdio/perlio/locale:en_US.utf8] 
  [stdio/perlio/locale:en_US.utf8] -Duse64bitall DEBUGGING
  [stdio/perlio/locale:en_US.utf8] -Duse64bitall
  [stdio/perlio/locale:en_US.utf8]  DEBUGGING
~~ ../cpan/Text-Tabs/t/Tabs-ElCid.t ............................ FAILED 2-10 Non-zero exit status: 255
  [locale:en_US.utf8] 
  [locale:en_US.utf8] -Duse64bitall DEBUGGING
  [locale:en_US.utf8] -Duse64bitall
  [locale:en_US.utf8]  DEBUGGING
~~ ../t/re/uniprops10.t ........................................ FAILED 15-28 176-189 309-322 435-574 729-742 1387-1428 2213-2226 3039-3052 3333-3360 3431-3472 3543-3556 3655-3668 3851-3864 3963-3976 4096-4109 4215-4228 4355-4417 4509-4648 4831-4844 4999-5012 5104-5117 5216-5229 5314-5327 5545-5558 5685-5698 5825-5838 5930-5943 6042-6055 6140-6153 6371-6412 6511-6552 6651-6664 6756-6769 6861-6874 6959-6972 7225-7238 7365-7378 7470-7483 7596-7609 7785-7798 8044-8085 8240-8281 8380-8421 8534-8547 8723-8736 8982-9023 9178-9219 9290-9303 9395-9450 9528-9541 9906-9919 10018-10031 10186-10227 10648-10661 10753-10766 10865-10878 10963-10976 11194-11207 11334-11347 11474-11487 11579-11592 11691-11704 11789-11802 12020-12061 12160-12201 12272-12285 12356-12369 12440-12453 12524-12537 12748-12761 12867-12880 13014-13027 13126-13139 13224-13237 13343-13482 13609-13622 13749-13762 13854-13867 13966-13979 14064-14077 14295-14308 14435-14448 14554-14567 14638-14651 14722-14735 14806-14819 15002-15043 15114-15155 15226-15239 15310-15323 15394-15407 15506-15631 15730-15743 16416-16429 16668-16681 16787-16800 16899-16912 17053-17066 17361-17374 17501-17514 17606-17619 17732-17745 17893-17906 18152-18193 18306-19159 19258-19271 19363-19376 19468-19481 19566-19579 19832-19845 19972-19985 20077-20090 20189-20202 20287-20300 20392-20531 20658-20671 20798-20811 20903-20916 21029-21042 21127-21140 21358-21371 21526-21539 21680-21693 21785-21798 21911-21924 22009-22022 22240-22281 22422-23275 23516 23556-23696 23706 23732
  [stdio/perlio/locale:en_US.utf8] 
  [stdio/perlio/locale:en_US.utf8] -Duse64bitall DEBUGGING
  [stdio/perlio/locale:en_US.utf8] -Duse64bitall
  [stdio/perlio/locale:en_US.utf8]  DEBUGGING
~~ ../t/uni/title.t ............................................ FAILED 4085-4088
  [stdio/perlio/locale:en_US.utf8] 
  [stdio/perlio/locale:en_US.utf8] -Duse64bitall DEBUGGING
  [stdio/perlio/locale:en_US.utf8] -Duse64bitall
  [stdio/perlio/locale:en_US.utf8]  DEBUGGING
~~ ../lib/warnings.t ........................................... FAILED 868
  [stdio/perlio/locale:en_US.utf8] 
  [stdio/perlio/locale:en_US.utf8] -Duse64bitall DEBUGGING
  [stdio/perlio/locale:en_US.utf8] -Duse64bitall
  [stdio/perlio/locale:en_US.utf8]  DEBUGGING
~~ ../t/re/pat_advanced.t ...................................... FAILED 161
  [stdio/perlio/locale:en_US.utf8] 
  [stdio/perlio/locale:en_US.utf8] -Duse64bitall DEBUGGING
  [stdio/perlio/locale:en_US.utf8] -Duse64bitall
  [stdio/perlio/locale:en_US.utf8]  DEBUGGING

Test todo-passed:
~~ ../dist/Net-Ping/t/450_service.t ............................ PASSED 9
  [stdio/perlio/locale:en_US.utf8] 
  [stdio/perlio/locale:en_US.utf8] -Duse64bitall DEBUGGING
  [stdio/perlio/locale:en_US.utf8] -Duse64bitall
  [stdio/perlio/locale:en_US.utf8]  DEBUGGING
~~ ../lib/B/Deparse.t .......................................... PASSED 2
  [locale:en_US.utf8] 
  [locale:en_US.utf8] -Duse64bitall DEBUGGING
  [locale:en_US.utf8] -Duse64bitall
  [locale:en_US.utf8]  DEBUGGING

MANIFEST messages:

Compiler messages:

About this smoke:
    smoking-perl: 5.26.2
  smoker-version: 1.72_05/0.046
       timestamp: 2018-07-27 20:45:08+00
          tester: merijn

Status overview available here: https://tux.nl/perl5/smoke/
-- 
Report generated by Test::Smoke::Gateway v0.09_01