Show logfile
Automated smoke report for branch blead 5.29.1 patch 9950bd1f76eeb551c01da6d09002a67f99c5e6cd v5.29.0-82-g9950bd1f76
r3: PA8800 (PA-RISC2.0/64/2 cpus)
    on        HP-UX B.11.11/64
    using     gcc version 4.6.1 (*1)
    smoketime 18 hours 34 minutes (average 2 hours 19 minutes)

Summary: FAIL(F)

O = OK  F = Failure(s), extended report at the bottom
X = Failure(s) under TEST but not under harness
? = still running or test results not (yet) available
Build failures during:       - = unknown or N/A
c = Configure, m = make, M = make (after miniperl), t = make test-prep

v5.29.0-82-g9950bd1f76
---------------------- ----------------------------------------------------
F  F  F  F  F  F        -Dcc=gcc (*1)
F  F  F  F  F  F        -Dcc=gcc -Duse64bitall (*1)
F  F  F  F  F  F        -Dcc=gcc -Duseithreads (*1)
F  F  F  F  F  F        -Dcc=gcc -Duseithreads -Duse64bitall (*1)
|  |  |  |  |  |
|  |  |  |  |  +------  locale:univ.utf8 DEBUGGING
|  |  |  |  +---------  perlio DEBUGGING
|  |  |  +------------  stdio DEBUGGING
|  |  +---------------  locale:univ.utf8
|  +------------------  perlio
+---------------------  stdio

Applied patches:
  SMOKE9950bd1f76eeb551c01da6d09002a67f99c5e6cd

Skipped tests:
  None

Test failures:
~~ ../t/run/switches.t ......................................... FAILED 109
  [stdio] -Dcc=gcc -Duseithreads -Duse64bitall DEBUGGING
~~ ../t/io/inplace.t ........................................... FAILED Bad plan.  You planned 6 tests but ran 0.
  [stdio] -Dcc=gcc -Duseithreads -Duse64bitall DEBUGGING
~~ ../t/io/inplace.t ........................................... FAILED Bad plan.  You planned 6 tests but ran 4.
  [locale:univ.utf8] -Dcc=gcc -Duseithreads DEBUGGING
~~ ../t/run/switches.t ......................................... FAILED Non-zero exit status: 2 Bad plan.  You planned 137 tests but ran 105.
  [locale:univ.utf8] -Dcc=gcc -Duseithreads DEBUGGING
~~ ../t/io/nargv.t ............................................. FAILED Bad plan.  You planned 6 tests but ran 0.
  [locale:univ.utf8] -Dcc=gcc -Duseithreads -Duse64bitall DEBUGGING
~~ ../lib/warnings.t ........................................... FAILED 368
  [stdio/perlio/locale:univ.utf8] -Dcc=gcc
  [stdio/perlio/locale:univ.utf8] -Dcc=gcc -Duse64bitall
  [stdio/perlio/locale:univ.utf8] -Dcc=gcc -Duseithreads -Duse64bitall DEBUGGING
  [stdio/perlio/locale:univ.utf8] -Dcc=gcc -Duseithreads DEBUGGING
  [stdio/perlio/locale:univ.utf8] -Dcc=gcc -Duseithreads
  [stdio/perlio/locale:univ.utf8] -Dcc=gcc DEBUGGING
  [stdio/perlio/locale:univ.utf8] -Dcc=gcc -Duse64bitall DEBUGGING
  [stdio/perlio/locale:univ.utf8] -Dcc=gcc -Duseithreads -Duse64bitall

Test todo-passed:
~~ ../lib/B/Deparse.t .......................................... PASSED 2
  [locale:univ.utf8] -Dcc=gcc
  [locale:univ.utf8] -Dcc=gcc -Duse64bitall
  [locale:univ.utf8] -Dcc=gcc -Duseithreads -Duse64bitall DEBUGGING
  [locale:univ.utf8] -Dcc=gcc -Duseithreads DEBUGGING
  [locale:univ.utf8] -Dcc=gcc -Duseithreads
  [locale:univ.utf8] -Dcc=gcc DEBUGGING
  [locale:univ.utf8] -Dcc=gcc -Duse64bitall DEBUGGING
  [locale:univ.utf8] -Dcc=gcc -Duseithreads -Duse64bitall
~~ ../dist/Net-Ping/t/450_service.t ............................ PASSED 9
  [stdio/perlio/locale:univ.utf8] -Dcc=gcc
  [stdio/perlio/locale:univ.utf8] -Dcc=gcc -Duse64bitall
  [stdio/perlio/locale:univ.utf8] -Dcc=gcc -Duseithreads -Duse64bitall DEBUGGING
  [stdio/perlio/locale:univ.utf8] -Dcc=gcc -Duseithreads DEBUGGING
  [stdio/perlio/locale:univ.utf8] -Dcc=gcc -Duseithreads
  [stdio/perlio/locale:univ.utf8] -Dcc=gcc DEBUGGING
  [stdio/perlio/locale:univ.utf8] -Dcc=gcc -Duse64bitall DEBUGGING
  [stdio/perlio/locale:univ.utf8] -Dcc=gcc -Duseithreads -Duse64bitall

MANIFEST messages:

Compiler messages:
  op.c: In function 'S_gen_constant_list':
  op.c:5658:31: warning: argument 'o' might be clobbered by 'longjmp' or 'vfork' [-Wclobbered]
  toke.c: In function 'Perl_scan_num':
  toke.c:11125:54: warning: 'b' may be used uninitialized in this function [-Wuninitialized]
  toke.c: In function 'Perl_yylex':
  inline.h:1820:16: warning: 'uv' may be used uninitialized in this function [-Wuninitialized]
  inline.h:1805:8: note: 'uv' was declared here
  pp.c: In function 'Perl_pp_argelem':
  pp.c:6780:13: warning: value computed is not used [-Wunused-value]
  /usr/include/rpc/rpcb_prot.h:163:25: note: originally defined here
  RealPPPort.xs: In function 'XS_Devel__PPPort_check_HeUTF8':
  RealPPPort.xs:1817:17: warning: value computed is not used [-Wunused-value]
  Socket.c: In function 'XS_Socket_pack_ip_mreq_source':
  Socket.c:1654:7: warning: variable 'interface' set but not used [-Wunused-but-set-variable]
  ./const-xs.inc: In function 'boot_Socket':
  ./const-xs.inc:980:20: warning: missing braces around initializer [-Wmissing-braces]
  ./const-xs.inc:980:20: warning: (near initialization for 'ip6_address._s6_un') [-Wmissing-braces]
  ./const-xs.inc:989:20: warning: missing braces around initializer [-Wmissing-braces]
  ./const-xs.inc:989:20: warning: (near initialization for 'ip6_address._s6_un') [-Wmissing-braces]
  const-c.inc: In function 'constant_19':
  const-c.inc:351:42: warning: unused parameter 'iv_return' [-Wunused-parameter]
  pp_sys.c: In function 'Perl_pp_gpwent':
  pp_sys.c:5568:19: warning: implicit declaration of function 'getspnam_r' [-Wimplicit-function-declaration]

About this smoke:
    smoking-perl: 5.14.2
  smoker-version: 1.72_05/0.046
       timestamp: 2018-07-10 17:34:37+00
          tester: merijn

Status overview available here: https://tux.nl/perl5/smoke/
-- 
Report generated by Test::Smoke::Gateway v0.09_01