Show logfile
Automated smoke report for branch blead 5.29.1 patch d82c4df61fbe367cde173c882a13f7dd774a9fe3 v5.29.0-42-gd82c4df61f
r3: PA8800 (PA-RISC2.0/64/2 cpus)
    on        HP-UX B.11.11/64
    using     cc version B.11.11.18 (*1)
    smoketime 20 hours 55 minutes (average 2 hours 36 minutes)

Summary: FAIL(F)

O = OK  F = Failure(s), extended report at the bottom
X = Failure(s) under TEST but not under harness
? = still running or test results not (yet) available
Build failures during:       - = unknown or N/A
c = Configure, m = make, M = make (after miniperl), t = make test-prep

v5.29.0-42-gd82c4df61f
---------------------- ----------------------------------------------------
F  F  F  F  F  F         (*1)
F  F  F  F  F  F        -Duse64bitall (*1)
F  F  F  F  F  F        -Duseithreads (*1)
F  F  F  F  F  F        -Duseithreads -Duse64bitall (*1)
|  |  |  |  |  |
|  |  |  |  |  +------  locale:univ.utf8 DEBUGGING
|  |  |  |  +---------  perlio DEBUGGING
|  |  |  +------------  stdio DEBUGGING
|  |  +---------------  locale:univ.utf8
|  +------------------  perlio
+---------------------  stdio

Applied patches:
  SMOKEd82c4df61fbe367cde173c882a13f7dd774a9fe3

Skipped tests:
  None

Test failures:
~~ ../lib/warnings.t ........................................... FAILED 368
  [stdio/perlio/locale:univ.utf8] -Duseithreads -Duse64bitall DEBUGGING
  [stdio/perlio/locale:univ.utf8] -Duseithreads -Duse64bitall
  [stdio/perlio/locale:univ.utf8] -Duse64bitall DEBUGGING
  [stdio/perlio/locale:univ.utf8] -Duse64bitall
~~ ../dist/Thread-Queue/t/03_peek.t ............................ FAILED Bad plan.  You planned 19 tests but ran 1.
  [perlio] -Duseithreads -Duse64bitall DEBUGGING
  [locale:univ.utf8] -Duseithreads -Duse64bitall
~~ ../lib/warnings.t ........................................... FAILED 781-782
  [stdio/perlio/locale:univ.utf8] 
  [stdio/perlio/locale:univ.utf8] -Duseithreads DEBUGGING
  [stdio/perlio/locale:univ.utf8]  DEBUGGING
  [stdio/perlio/locale:univ.utf8] -Duseithreads

Test todo-passed:
~~ ../lib/B/Deparse.t .......................................... PASSED 2
  [locale:univ.utf8] 
  [locale:univ.utf8] -Duseithreads DEBUGGING
  [locale:univ.utf8] -Duseithreads -Duse64bitall DEBUGGING
  [locale:univ.utf8] -Duse64bitall DEBUGGING
  [locale:univ.utf8]  DEBUGGING
  [locale:univ.utf8] -Duseithreads
  [locale:univ.utf8] -Duse64bitall
  [locale:univ.utf8] -Duseithreads -Duse64bitall
~~ ../dist/Net-Ping/t/450_service.t ............................ PASSED 9
  [stdio/perlio/locale:univ.utf8] 
  [stdio/perlio/locale:univ.utf8] -Duseithreads DEBUGGING
  [stdio/perlio/locale:univ.utf8] -Duseithreads -Duse64bitall DEBUGGING
  [stdio/perlio/locale:univ.utf8] -Duse64bitall DEBUGGING
  [stdio/perlio/locale:univ.utf8]  DEBUGGING
  [stdio/perlio/locale:univ.utf8] -Duseithreads
  [stdio/perlio/locale:univ.utf8] -Duse64bitall
  [stdio/perlio/locale:univ.utf8] -Duseithreads -Duse64bitall

MANIFEST messages:

Compiler messages:
  cc: "try.c", line 56: warning 604: Pointers are not assignment-compatible.
  cc: "try.c", line 56: warning 563: Argument #2 is not the correct type.

About this smoke:
    smoking-perl: 5.14.2
  smoker-version: 1.72_05/0.046
       timestamp: 2018-07-03 20:45:09+00
          tester: merijn

Status overview available here: https://tux.nl/perl5/smoke/
-- 
Report generated by Test::Smoke::Gateway v0.09_01