Show logfile
Automated smoke report for branch blead 5.29.1 patch b1d21918e268271d791ff30e83cf9c4f8c351707 v5.29.0-21-gb1d21918e2
r3: PA8800 (PA-RISC2.0/64/2 cpus)
    on        HP-UX B.11.11/64
    using     cc version B.11.11.18 (*1)
    smoketime 20 hours 58 minutes (average 2 hours 37 minutes)

Summary: FAIL(F)

O = OK  F = Failure(s), extended report at the bottom
X = Failure(s) under TEST but not under harness
? = still running or test results not (yet) available
Build failures during:       - = unknown or N/A
c = Configure, m = make, M = make (after miniperl), t = make test-prep

v5.29.0-21-gb1d21918e2
---------------------- ----------------------------------------------------
F  F  F  F  F  F         (*1)
F  F  F  F  F  F        -Duse64bitall (*1)
F  F  F  F  F  F        -Duseithreads (*1)
F  F  F  F  F  F        -Duseithreads -Duse64bitall (*1)
|  |  |  |  |  |
|  |  |  |  |  +------  locale:univ.utf8 DEBUGGING
|  |  |  |  +---------  perlio DEBUGGING
|  |  |  +------------  stdio DEBUGGING
|  |  +---------------  locale:univ.utf8
|  +------------------  perlio
+---------------------  stdio

Applied patches:
  SMOKEb1d21918e268271d791ff30e83cf9c4f8c351707

Skipped tests:
  None

Test failures:
~~ ../cpan/Unicode-Collate/t/loc_cy.t .......................... FAILED 3-4 24-25
  [stdio/perlio/locale:univ.utf8] -Duse64bitall DEBUGGING
~~ ../cpan/Unicode-Collate/t/loc_nso.t ......................... FAILED 3
  [stdio/perlio/locale:univ.utf8] -Duse64bitall DEBUGGING
~~ ../cpan/Unicode-Collate/t/loc_ca.t .......................... FAILED 3-4
  [stdio/perlio/locale:univ.utf8] -Duse64bitall DEBUGGING
~~ ../cpan/IO-Compress/t/108anyunc-zip.t ....................... FAILED 6-8 42-44 Non-zero exit status: 24
  [stdio/perlio/locale:univ.utf8] -Duse64bitall DEBUGGING
~~ ../cpan/IO-Compress/t/001zlib-generic-deflate.t ............. FAILED 10 Non-zero exit status: 6
  [stdio/perlio/locale:univ.utf8] -Duseithreads -Duse64bitall DEBUGGING
  [stdio/perlio/locale:univ.utf8] -Duseithreads -Duse64bitall
  [stdio/perlio/locale:univ.utf8] -Duse64bitall DEBUGGING
  [stdio/perlio/locale:univ.utf8] -Duse64bitall
~~ ../cpan/Unicode-Collate/t/loc_zhb5.t ........................ FAILED 6 47-53 113-150
  [stdio/perlio/locale:univ.utf8] -Duse64bitall DEBUGGING
~~ ../cpan/Unicode-Collate/t/loc_vo.t .......................... FAILED 6
  [stdio/perlio/locale:univ.utf8] -Duseithreads -Duse64bitall DEBUGGING
  [stdio/perlio/locale:univ.utf8] -Duseithreads -Duse64bitall
  [stdio/perlio/locale:univ.utf8] -Duse64bitall
~~ ../dist/Thread-Queue/t/03_peek.t ............................ FAILED Bad plan.  You planned 19 tests but ran 1.
  [perlio] -Duseithreads -Duse64bitall DEBUGGING
~~ ../cpan/Unicode-Collate/t/loc_cjk.t ......................... FAILED 6-901 2730-2797
  [stdio/perlio/locale:univ.utf8] -Duse64bitall DEBUGGING
~~ ../cpan/Unicode-Collate/t/loc_es.t .......................... FAILED 4
  [stdio/perlio/locale:univ.utf8] -Duseithreads -Duse64bitall DEBUGGING
  [stdio/perlio/locale:univ.utf8] -Duseithreads -Duse64bitall
  [stdio/perlio/locale:univ.utf8] -Duse64bitall DEBUGGING
  [stdio/perlio/locale:univ.utf8] -Duse64bitall
~~ ../cpan/Unicode-Collate/t/loc_om.t .......................... FAILED 3-8
  [stdio/perlio/locale:univ.utf8] -Duse64bitall DEBUGGING
~~ ../cpan/Unicode-Collate/t/loc_ca.t .......................... FAILED 39-44
  [stdio/perlio/locale:univ.utf8] -Duseithreads -Duse64bitall DEBUGGING
  [stdio/perlio/locale:univ.utf8] -Duseithreads -Duse64bitall
  [stdio/perlio/locale:univ.utf8] -Duse64bitall
~~ ../cpan/Unicode-Collate/t/loc_da.t .......................... FAILED 3-5 104-117
  [stdio/perlio/locale:univ.utf8] -Duse64bitall DEBUGGING
~~ ../dist/Filter-Simple/t/code_no_comments.t .................. FAILED Non-zero exit status: 255 No plan found in TAP output
  [stdio/perlio/locale:univ.utf8] -Duse64bitall DEBUGGING
~~ ../cpan/Unicode-Collate/t/variable.t ........................ FAILED 2-21
  [stdio/perlio/locale:univ.utf8] -Duse64bitall DEBUGGING
~~ ../cpan/Unicode-Collate/t/loc_estr.t ........................ FAILED 4-5
  [stdio/perlio/locale:univ.utf8] -Duse64bitall DEBUGGING
~~ ../cpan/libnet/t/config.t ................................... FAILED 5-9
  [stdio/perlio/locale:univ.utf8] -Duseithreads -Duse64bitall DEBUGGING
  [stdio/perlio/locale:univ.utf8] -Duseithreads -Duse64bitall
  [stdio/perlio/locale:univ.utf8] -Duse64bitall DEBUGGING
  [stdio/perlio/locale:univ.utf8] -Duse64bitall
~~ ../cpan/Unicode-Collate/t/loc_eo.t .......................... FAILED 3-4
  [stdio/perlio/locale:univ.utf8] -Duse64bitall DEBUGGING
~~ ../cpan/Unicode-Collate/t/cjk_gb.t .......................... FAILED 13
  [stdio/perlio/locale:univ.utf8] -Duseithreads -Duse64bitall DEBUGGING
  [stdio/perlio/locale:univ.utf8] -Duseithreads -Duse64bitall
  [stdio/perlio/locale:univ.utf8] -Duse64bitall
~~ ../cpan/Unicode-Collate/t/loc_si.t .......................... FAILED 3-5
  [stdio/perlio/locale:univ.utf8] -Duse64bitall DEBUGGING
~~ ../cpan/Unicode-Collate/t/loc_lt.t .......................... FAILED 3 54
  [stdio/perlio/locale:univ.utf8] -Duse64bitall DEBUGGING
~~ ../cpan/Unicode-Collate/t/loc_mk.t .......................... FAILED 24
  [stdio/perlio/locale:univ.utf8] -Duseithreads -Duse64bitall DEBUGGING
  [stdio/perlio/locale:univ.utf8] -Duseithreads -Duse64bitall
  [stdio/perlio/locale:univ.utf8] -Duse64bitall
~~ ../cpan/Unicode-Collate/t/loc_cs.t .......................... FAILED 40-42
  [stdio/perlio/locale:univ.utf8] -Duseithreads -Duse64bitall DEBUGGING
  [stdio/perlio/locale:univ.utf8] -Duseithreads -Duse64bitall
  [stdio/perlio/locale:univ.utf8] -Duse64bitall
~~ ../cpan/Unicode-Collate/t/loc_sq.t .......................... FAILED 3-4 24-25
  [stdio/perlio/locale:univ.utf8] -Duse64bitall DEBUGGING
~~ ../cpan/Unicode-Collate/t/altern.t .......................... FAILED 2-21
  [stdio/perlio/locale:univ.utf8] -Duse64bitall DEBUGGING
~~ ../cpan/Unicode-Collate/t/loc_wo.t .......................... FAILED 3-4
  [stdio/perlio/locale:univ.utf8] -Duse64bitall DEBUGGING
~~ ../cpan/IO-Compress/t/100generic-deflate.t .................. FAILED 34 126-127 165-170 198-201 304-307 370-373 424-427 459-460 495-496 561-562 597-599 678-681 703 730 757 779 Non-zero exit status: 245
  [stdio/perlio/locale:univ.utf8] -Duseithreads -Duse64bitall DEBUGGING
  [stdio/perlio/locale:univ.utf8] -Duseithreads -Duse64bitall
  [stdio/perlio/locale:univ.utf8] -Duse64bitall DEBUGGING
  [stdio/perlio/locale:univ.utf8] -Duse64bitall
~~ ../cpan/Unicode-Collate/t/loc_hu.t .......................... FAILED 3-4 26-27
  [stdio/perlio/locale:univ.utf8] -Duse64bitall DEBUGGING
~~ ../cpan/Unicode-Collate/t/loc_bg.t .......................... FAILED 19
  [stdio/perlio/locale:univ.utf8] -Duseithreads -Duse64bitall DEBUGGING
  [stdio/perlio/locale:univ.utf8] -Duseithreads -Duse64bitall
  [stdio/perlio/locale:univ.utf8] -Duse64bitall DEBUGGING
  [stdio/perlio/locale:univ.utf8] -Duse64bitall
~~ ../cpan/Unicode-Collate/t/loc_srla.t ........................ FAILED 93-103
  [stdio/perlio/locale:univ.utf8] -Duseithreads -Duse64bitall DEBUGGING
  [stdio/perlio/locale:univ.utf8] -Duseithreads -Duse64bitall
  [stdio/perlio/locale:univ.utf8] -Duse64bitall
~~ ../cpan/Unicode-Collate/t/loc_ln.t .......................... FAILED 3
  [stdio/perlio/locale:univ.utf8] -Duse64bitall DEBUGGING
~~ ../cpan/Unicode-Collate/t/loc_mncy.t ........................ FAILED 20
  [stdio/perlio/locale:univ.utf8] -Duseithreads -Duse64bitall DEBUGGING
  [stdio/perlio/locale:univ.utf8] -Duseithreads -Duse64bitall
  [stdio/perlio/locale:univ.utf8] -Duse64bitall DEBUGGING
  [stdio/perlio/locale:univ.utf8] -Duse64bitall
~~ ../cpan/Unicode-Collate/t/loc_be.t .......................... FAILED 8
  [stdio/perlio/locale:univ.utf8] -Duse64bitall DEBUGGING
~~ ../cpan/Unicode-Collate/t/loc_ln.t .......................... FAILED 15-17
  [stdio/perlio/locale:univ.utf8] -Duseithreads -Duse64bitall DEBUGGING
  [stdio/perlio/locale:univ.utf8] -Duseithreads -Duse64bitall
  [stdio/perlio/locale:univ.utf8] -Duse64bitall
~~ ../cpan/Unicode-Collate/t/loc_ar.t .......................... FAILED 3-5
  [stdio/perlio/locale:univ.utf8] -Duse64bitall DEBUGGING
~~ ../cpan/Unicode-Collate/t/variable.t ........................ FAILED 2
  [stdio/perlio/locale:univ.utf8] -Duseithreads -Duse64bitall DEBUGGING
  [stdio/perlio/locale:univ.utf8] -Duseithreads -Duse64bitall
  [stdio/perlio/locale:univ.utf8] -Duse64bitall
~~ ../cpan/IO-Compress/t/cz-08encoding.t ....................... FAILED 6-8 Non-zero exit status: 255 Bad plan.  You planned 29 tests but ran 17.
  [stdio/perlio/locale:univ.utf8] -Duseithreads -Duse64bitall DEBUGGING
  [stdio/perlio/locale:univ.utf8] -Duseithreads -Duse64bitall
  [stdio/perlio/locale:univ.utf8] -Duse64bitall DEBUGGING
  [stdio/perlio/locale:univ.utf8] -Duse64bitall
~~ ../cpan/Unicode-Collate/t/loc_ru.t .......................... FAILED 19
  [stdio/perlio/locale:univ.utf8] -Duseithreads -Duse64bitall DEBUGGING
  [stdio/perlio/locale:univ.utf8] -Duseithreads -Duse64bitall
  [stdio/perlio/locale:univ.utf8] -Duse64bitall DEBUGGING
  [stdio/perlio/locale:univ.utf8] -Duse64bitall
~~ ../cpan/Unicode-Collate/t/normal.t .......................... FAILED 1-10 39-41 79-80
  [stdio/perlio/locale:univ.utf8] -Duse64bitall DEBUGGING
~~ ../cpan/Unicode-Collate/t/cjk_st.t .......................... FAILED 2-19
  [stdio/perlio/locale:univ.utf8] -Duse64bitall DEBUGGING
~~ ../cpan/Unicode-Collate/t/loc_ur.t .......................... FAILED 9-26
  [stdio/perlio/locale:univ.utf8] -Duse64bitall DEBUGGING
~~ ../cpan/Unicode-Collate/t/loc_cjkc.t ........................ FAILED 10-1011 1062 1147 1205 1285 1379 1448 1501 1583 1622-1623 1727 1787-1789 2020-2021 2048-2049 2088 2125 2148-2149 2170 2195 2221 2243-2244 2260 2297 2318 2341 2359 2389 2422-2424 2441 2459-2460 2489 2514-2517 2542 2557-2558 2580-2582 2606 2635 2657-2663 2680 2735-2738 2768-2769 2818 3029-3030 3069 3127 3157 3192 3219 3238-3239 3278 3311-3312 3343 3369 3391 3433 3466 3490-3491 3536-3537 3561 3587 3621 3644-3645 3671 3719 3745-3746 3776 3803-3805 3825-3828 4029 4072 4132 4165 4213 4238 4288 4325 4361 4387 4435 4474 4508-4509 4546 4584 4615 4658-4659 4673 4733 4750 4789 4814 5840-6021 6863-6864 6883-6884 6950-6955 7848-7852 7874-7877 7892-7910
  [stdio/perlio/locale:univ.utf8] -Duse64bitall DEBUGGING
~~ ../lib/warnings.t ........................................... FAILED 781-782
  [stdio/perlio/locale:univ.utf8] 
  [stdio/perlio/locale:univ.utf8] -Duseithreads DEBUGGING
  [stdio/perlio/locale:univ.utf8]  DEBUGGING
  [stdio/perlio/locale:univ.utf8] -Duseithreads
~~ ../cpan/Unicode-Collate/t/loc_yo.t .......................... FAILED 3-4
  [stdio/perlio/locale:univ.utf8] -Duse64bitall DEBUGGING
~~ ../cpan/Unicode-Collate/t/loc_hu.t .......................... FAILED 13
  [stdio/perlio/locale:univ.utf8] -Duseithreads -Duse64bitall DEBUGGING
  [stdio/perlio/locale:univ.utf8] -Duseithreads -Duse64bitall
  [stdio/perlio/locale:univ.utf8] -Duse64bitall
~~ ../cpan/IO-Zlib/t/tied.t .................................... FAILED 5-8
  [stdio/perlio/locale:univ.utf8] -Duseithreads -Duse64bitall DEBUGGING
  [stdio/perlio/locale:univ.utf8] -Duseithreads -Duse64bitall
  [stdio/perlio/locale:univ.utf8] -Duse64bitall DEBUGGING
  [stdio/perlio/locale:univ.utf8] -Duse64bitall
~~ ../t/io/nargv.t ............................................. FAILED Bad plan.  You planned 6 tests but ran 0.
  [locale:univ.utf8] -Duseithreads -Duse64bitall DEBUGGING
~~ ../cpan/Unicode-Collate/t/loc_cyrl.t ........................ FAILED 55-106
  [stdio/perlio/locale:univ.utf8] -Duse64bitall DEBUGGING
~~ ../t/porting/readme.t ....................................... FAILED 74
  [stdio/perlio/locale:univ.utf8] -Duseithreads -Duse64bitall DEBUGGING
  [stdio/perlio/locale:univ.utf8] -Duseithreads -Duse64bitall
  [stdio/perlio/locale:univ.utf8] -Duse64bitall DEBUGGING
  [stdio/perlio/locale:univ.utf8] -Duse64bitall
~~ ../cpan/Unicode-Collate/t/loc_pl.t .......................... FAILED 3-4 24-26
  [stdio/perlio/locale:univ.utf8] -Duse64bitall DEBUGGING
~~ ../cpan/Unicode-Collate/t/loc_ee.t .......................... FAILED 4
  [stdio/perlio/locale:univ.utf8] -Duse64bitall DEBUGGING
~~ ../cpan/Unicode-Collate/t/loc_lkt.t ......................... FAILED 3-4
  [stdio/perlio/locale:univ.utf8] -Duse64bitall DEBUGGING
~~ ../cpan/Unicode-Collate/t/loc_hy.t .......................... FAILED 3
  [stdio/perlio/locale:univ.utf8] -Duse64bitall DEBUGGING
~~ ../cpan/Encode/t/mime-header.t .............................. FAILED 6 95-96 155 202-204 Non-zero exit status: 40
  [stdio/perlio/locale:univ.utf8] -Duseithreads -Duse64bitall DEBUGGING
  [stdio/perlio/locale:univ.utf8] -Duseithreads -Duse64bitall
  [stdio/perlio/locale:univ.utf8] -Duse64bitall DEBUGGING
  [stdio/perlio/locale:univ.utf8] -Duse64bitall
~~ ../cpan/Unicode-Collate/t/loc_nb.t .......................... FAILED 3-5 100-101
  [stdio/perlio/locale:univ.utf8] -Duse64bitall DEBUGGING
~~ ../cpan/Unicode-Collate/t/loc_de.t .......................... FAILED 27-50
  [stdio/perlio/locale:univ.utf8] -Duse64bitall DEBUGGING
~~ ../cpan/IO-Compress/t/004gziphdr.t .......................... FAILED 9 Non-zero exit status: 255 Bad plan.  You planned 918 tests but ran 9.
  [stdio/perlio/locale:univ.utf8] -Duseithreads -Duse64bitall DEBUGGING
  [stdio/perlio/locale:univ.utf8] -Duseithreads -Duse64bitall
  [stdio/perlio/locale:univ.utf8] -Duse64bitall DEBUGGING
  [stdio/perlio/locale:univ.utf8] -Duse64bitall
~~ ../cpan/Unicode-Collate/t/loc_sv.t .......................... FAILED 3-5 85-92
  [stdio/perlio/locale:univ.utf8] -Duse64bitall DEBUGGING
~~ ../cpan/Unicode-Collate/t/loc_af.t .......................... FAILED 4
  [stdio/perlio/locale:univ.utf8] -Duse64bitall DEBUGGING
~~ ../cpan/Unicode-Collate/t/notable.t ......................... FAILED 17-18
  [stdio/perlio/locale:univ.utf8] -Duse64bitall DEBUGGING
~~ ../cpan/Unicode-Collate/t/loc_sa.t .......................... FAILED 3-5
  [stdio/perlio/locale:univ.utf8] -Duse64bitall DEBUGGING
~~ ../cpan/Unicode-Collate/t/cjk_ja.t .......................... FAILED 22
  [stdio/perlio/locale:univ.utf8] -Duseithreads -Duse64bitall DEBUGGING
  [stdio/perlio/locale:univ.utf8] -Duseithreads -Duse64bitall
  [stdio/perlio/locale:univ.utf8] -Duse64bitall
~~ ../cpan/Unicode-Collate/t/loc_is.t .......................... FAILED 3 43-57
  [stdio/perlio/locale:univ.utf8] -Duse64bitall DEBUGGING
~~ ../cpan/IO-Compress/t/104destroy-zip.t ...................... FAILED Non-zero exit status: 255 Bad plan.  You planned 15 tests but ran 4.
  [perlio/locale:univ.utf8] -Duse64bitall DEBUGGING
~~ ../cpan/Unicode-Collate/t/hangul.t .......................... FAILED 14
  [stdio/perlio/locale:univ.utf8] -Duseithreads -Duse64bitall DEBUGGING
  [stdio/perlio/locale:univ.utf8] -Duseithreads -Duse64bitall
  [stdio/perlio/locale:univ.utf8] -Duse64bitall
~~ ../cpan/Unicode-Collate/t/ignor.t ........................... FAILED 2-5
  [stdio/perlio/locale:univ.utf8] -Duse64bitall DEBUGGING
~~ ../cpan/IO-Compress/t/104destroy-gzip.t ..................... FAILED Non-zero exit status: 255 Bad plan.  You planned 15 tests but ran 4.
  [perlio/locale:univ.utf8] -Duseithreads -Duse64bitall DEBUGGING
  [perlio/locale:univ.utf8] -Duseithreads -Duse64bitall
  [perlio/locale:univ.utf8] -Duse64bitall DEBUGGING
  [perlio/locale:univ.utf8] -Duse64bitall
~~ ../cpan/IO-Compress/t/109merge-deflate.t .................... FAILED Non-zero exit status: 2 Bad plan.  You planned 165 tests but ran 30.
  [stdio/perlio/locale:univ.utf8] -Duseithreads -Duse64bitall DEBUGGING
  [stdio/perlio/locale:univ.utf8] -Duseithreads -Duse64bitall
  [stdio/perlio/locale:univ.utf8] -Duse64bitall DEBUGGING
  [stdio/perlio/locale:univ.utf8] -Duse64bitall
~~ ../cpan/Unicode-Collate/t/cjk_ko.t .......................... FAILED 2 52
  [stdio/perlio/locale:univ.utf8] -Duse64bitall DEBUGGING
~~ ../cpan/Unicode-Collate/t/loc_se.t .......................... FAILED 3 42-54
  [stdio/perlio/locale:univ.utf8] -Duse64bitall DEBUGGING
~~ ../cpan/Unicode-Collate/t/override.t ........................ FAILED 41
  [stdio/perlio/locale:univ.utf8] -Duse64bitall DEBUGGING
~~ ../cpan/Unicode-Collate/t/view.t ............................ FAILED 5-11 73 93 111 127 143 159
  [stdio/perlio/locale:univ.utf8] -Duseithreads -Duse64bitall DEBUGGING
  [stdio/perlio/locale:univ.utf8] -Duseithreads -Duse64bitall
  [stdio/perlio/locale:univ.utf8] -Duse64bitall DEBUGGING
  [stdio/perlio/locale:univ.utf8] -Duse64bitall
~~ ../cpan/Archive-Tar/t/09_roundtrip.t ........................ FAILED Non-zero exit status: 255 Bad plan.  You planned 7 tests but ran 1.
  [stdio/perlio/locale:univ.utf8] -Duseithreads -Duse64bitall DEBUGGING
  [stdio/perlio/locale:univ.utf8] -Duseithreads -Duse64bitall
  [stdio/perlio/locale:univ.utf8] -Duse64bitall DEBUGGING
  [stdio/perlio/locale:univ.utf8] -Duse64bitall
~~ ../cpan/Unicode-Collate/t/loc_da.t .......................... FAILED 46-47
  [stdio/perlio/locale:univ.utf8] -Duseithreads -Duse64bitall DEBUGGING
  [stdio/perlio/locale:univ.utf8] -Duseithreads -Duse64bitall
  [stdio/perlio/locale:univ.utf8] -Duse64bitall
~~ ../cpan/Unicode-Collate/t/loc_fr.t .......................... FAILED 4-5
  [stdio/perlio/locale:univ.utf8] -Duseithreads -Duse64bitall DEBUGGING
  [stdio/perlio/locale:univ.utf8] -Duseithreads -Duse64bitall
  [stdio/perlio/locale:univ.utf8] -Duse64bitall
~~ ../cpan/IO-Compress/t/050interop-gzip.t ..................... FAILED 6-7 Non-zero exit status: 2
  [stdio/perlio/locale:univ.utf8] -Duseithreads -Duse64bitall DEBUGGING
  [stdio/perlio/locale:univ.utf8] -Duseithreads -Duse64bitall
  [stdio/perlio/locale:univ.utf8] -Duse64bitall DEBUGGING
  [stdio/perlio/locale:univ.utf8] -Duse64bitall
~~ ../cpan/Unicode-Collate/t/notable.t ......................... FAILED 26
  [stdio/perlio/locale:univ.utf8] -Duseithreads -Duse64bitall DEBUGGING
  [stdio/perlio/locale:univ.utf8] -Duseithreads -Duse64bitall
  [stdio/perlio/locale:univ.utf8] -Duse64bitall
~~ ../cpan/IO-Compress/t/107multi-gzip.t ....................... FAILED Non-zero exit status: 2 Bad plan.  You planned 1828 tests but ran 4.
  [stdio] -Duse64bitall DEBUGGING
~~ ../cpan/Digest-SHA/t/state.t ................................ FAILED 1-4
  [stdio/perlio/locale:univ.utf8] -Duse64bitall DEBUGGING
~~ ../cpan/Unicode-Collate/t/loc_nso.t ......................... FAILED 6
  [stdio/perlio/locale:univ.utf8] -Duseithreads -Duse64bitall DEBUGGING
  [stdio/perlio/locale:univ.utf8] -Duseithreads -Duse64bitall
  [stdio/perlio/locale:univ.utf8] -Duse64bitall
~~ ../cpan/Unicode-Collate/t/loc_deat.t ........................ FAILED 3
  [stdio/perlio/locale:univ.utf8] -Duse64bitall DEBUGGING
~~ ../cpan/Unicode-Collate/t/loc_he.t .......................... FAILED 8-12
  [stdio/perlio/locale:univ.utf8] -Duse64bitall DEBUGGING
~~ ../cpan/Unicode-Collate/t/cjk_zy.t .......................... FAILED 2-19
  [stdio/perlio/locale:univ.utf8] -Duse64bitall DEBUGGING
~~ ../cpan/Unicode-Collate/t/loc_uk.t .......................... FAILED 6
  [stdio/perlio/locale:univ.utf8] -Duse64bitall DEBUGGING
~~ ../cpan/Archive-Tar/t/04_resolved_issues.t .................. FAILED 46-47 Non-zero exit status: 255
  [stdio/perlio/locale:univ.utf8] -Duseithreads -Duse64bitall DEBUGGING
  [stdio/perlio/locale:univ.utf8] -Duseithreads -Duse64bitall
  [stdio/perlio/locale:univ.utf8] -Duse64bitall DEBUGGING
  [stdio/perlio/locale:univ.utf8] -Duse64bitall
~~ ../dist/Filter-Simple/t/data.t .............................. FAILED Non-zero exit status: 255 No plan found in TAP output
  [stdio/perlio/locale:univ.utf8] -Duse64bitall DEBUGGING
~~ ../cpan/Unicode-Collate/t/loc_zhgb.t ........................ FAILED 281
  [stdio/perlio/locale:univ.utf8] -Duseithreads -Duse64bitall DEBUGGING
  [stdio/perlio/locale:univ.utf8] -Duseithreads -Duse64bitall
  [stdio/perlio/locale:univ.utf8] -Duse64bitall
~~ ../cpan/Unicode-Collate/t/loc_haw.t ......................... FAILED 7
  [stdio/perlio/locale:univ.utf8] -Duseithreads -Duse64bitall DEBUGGING
  [stdio/perlio/locale:univ.utf8] -Duseithreads -Duse64bitall
  [stdio/perlio/locale:univ.utf8] -Duse64bitall
~~ ../cpan/IO-Compress/t/107multi-zip.t ........................ FAILED 9-10 30-31 51-52 72-73 93-95 117-118 137-138 157-158 183-184 201-202 218-219 236-237 253-254 272-277 296-297 320-322 345 370-371 395-396 413-414 430-431 448-449 465-466 494-496 513-518 541-543 571-572 593-598 621-622 639-640 656-657 674-675 691-692 711-713 731-733 751-753 771-773 796-797 813-814 831-832 848-849 866-867 890-892 909-914 933-934 957-959 982 1008-1009 1022-1023 1036-1037 1050-1051 1064-1065 1078-1080 1103-1105 1122-1127 1147 1175-1177 1194-1199 1219 1241-1242 1255-1256 1269-1270 1283-1284 1297-1298 1311-1313 1328 1348 1368 1388 1412-1413 1426-1427 1440-1441 1454-1455 1468-1469 1482-1484 1504-1505 1527-1529 1546-1551 1570-1571 1591 1617-1618 1631-1632 1645-1646 1659-1660 1673-1674 1687-1689 1712-1714 1731-1736 1756 1784-1786 1803-1808 1828 Non-zero exit status: 254
  [stdio/perlio/locale:univ.utf8] -Duse64bitall DEBUGGING
~~ ../cpan/Unicode-Collate/t/loc_ugcy.t ........................ FAILED 9
  [stdio/perlio/locale:univ.utf8] -Duse64bitall DEBUGGING
~~ ../cpan/IO-Compress/t/cz-06gzsetp.t ......................... FAILED 9 Non-zero exit status: 255 Bad plan.  You planned 51 tests but ran 9.
  [stdio/perlio/locale:univ.utf8] -Duseithreads -Duse64bitall DEBUGGING
  [stdio/perlio/locale:univ.utf8] -Duseithreads -Duse64bitall
  [stdio/perlio/locale:univ.utf8] -Duse64bitall DEBUGGING
  [stdio/perlio/locale:univ.utf8] -Duse64bitall
~~ ../cpan/Unicode-Collate/t/loc_lv.t .......................... FAILED 5
  [stdio/perlio/locale:univ.utf8] -Duseithreads -Duse64bitall DEBUGGING
  [stdio/perlio/locale:univ.utf8] -Duseithreads -Duse64bitall
  [stdio/perlio/locale:univ.utf8] -Duse64bitall
~~ ../cpan/Unicode-Collate/t/loc_uk.t .......................... FAILED 24
  [stdio/perlio/locale:univ.utf8] -Duseithreads -Duse64bitall DEBUGGING
  [stdio/perlio/locale:univ.utf8] -Duseithreads -Duse64bitall
  [stdio/perlio/locale:univ.utf8] -Duse64bitall
~~ ../cpan/IO-Compress/t/cz-03zlib-v1.t ........................ FAILED 86 Non-zero exit status: 255 Bad plan.  You planned 471 tests but ran 86.
  [stdio/perlio/locale:univ.utf8] -Duseithreads -Duse64bitall DEBUGGING
  [stdio/perlio/locale:univ.utf8] -Duseithreads -Duse64bitall
  [stdio/perlio/locale:univ.utf8] -Duse64bitall DEBUGGING
  [stdio/perlio/locale:univ.utf8] -Duse64bitall
~~ ../cpan/Unicode-Collate/t/cjk_ko.t .......................... FAILED 52
  [stdio/perlio/locale:univ.utf8] -Duseithreads -Duse64bitall DEBUGGING
  [stdio/perlio/locale:univ.utf8] -Duseithreads -Duse64bitall
  [stdio/perlio/locale:univ.utf8] -Duse64bitall
~~ ../cpan/Unicode-Collate/t/loc_ko.t .......................... FAILED 3
  [stdio/perlio/locale:univ.utf8] -Duse64bitall DEBUGGING
~~ ../cpan/IO-Compress/t/102tied-gzip.t ........................ FAILED 6-7 Non-zero exit status: 255 Bad plan.  You planned 249 tests but ran 17.
  [stdio/perlio/locale:univ.utf8] -Duseithreads -Duse64bitall DEBUGGING
  [stdio/perlio/locale:univ.utf8] -Duseithreads -Duse64bitall
  [stdio/perlio/locale:univ.utf8] -Duse64bitall DEBUGGING
  [stdio/perlio/locale:univ.utf8] -Duse64bitall
~~ ../cpan/Unicode-Collate/t/loc_et.t .......................... FAILED 3-5
  [stdio/perlio/locale:univ.utf8] -Duse64bitall DEBUGGING
~~ ../cpan/IO-Compress/t/002any-gzip.t ......................... FAILED 5 Non-zero exit status: 2 Bad plan.  You planned 48 tests but ran 5.
  [stdio/perlio/locale:univ.utf8] -Duseithreads -Duse64bitall DEBUGGING
  [stdio/perlio/locale:univ.utf8] -Duseithreads -Duse64bitall
  [stdio/perlio/locale:univ.utf8] -Duse64bitall DEBUGGING
  [stdio/perlio/locale:univ.utf8] -Duse64bitall
~~ ../cpan/Unicode-Collate/t/override.t ........................ FAILED 44
  [stdio/perlio/locale:univ.utf8] -Duseithreads -Duse64bitall DEBUGGING
  [stdio/perlio/locale:univ.utf8] -Duseithreads -Duse64bitall
  [stdio/perlio/locale:univ.utf8] -Duse64bitall
~~ ../t/run/switches.t ......................................... FAILED 110-111
  [stdio/perlio] -Duseithreads -Duse64bitall DEBUGGING
~~ ../t/comp/require.t ......................................... FAILED 
  [stdio/perlio] -Duse64bitall DEBUGGING
~~ ../cpan/IO-Compress/t/104destroy-gzip.t ..................... FAILED Non-zero exit status: 2 Bad plan.  You planned 15 tests but ran 4.
  [stdio] -Duseithreads -Duse64bitall DEBUGGING
  [stdio] -Duseithreads -Duse64bitall
  [stdio] -Duse64bitall DEBUGGING
  [stdio] -Duse64bitall
~~ ../cpan/IO-Compress/t/002any-zip.t .......................... FAILED 6-8 42-44 Non-zero exit status: 24
  [stdio/perlio/locale:univ.utf8] -Duse64bitall DEBUGGING
~~ ../cpan/Unicode-Collate/t/test.t ............................ FAILED 5-7 43-44 79-80
  [stdio/perlio/locale:univ.utf8] -Duse64bitall DEBUGGING
~~ ../cpan/Digest-SHA/t/gglong.t ............................... FAILED Non-zero exit status: 255 Bad plan.  You planned 8 tests but ran 0.
  [stdio/perlio/locale:univ.utf8] -Duse64bitall DEBUGGING
~~ ../cpan/IO-Compress/t/107multi-gzip.t ....................... FAILED Non-zero exit status: 25 Bad plan.  You planned 1828 tests but ran 4.
  [perlio/locale:univ.utf8] -Duse64bitall DEBUGGING
~~ ../cpan/IO-Compress/t/100generic-zip.t ...................... FAILED 34 126-127 165-170 198-201 304-307 370-373 424-427 459-460 495-496 561-562 597-599 678-681 703 730 757 779 Non-zero exit status: 245
  [stdio/perlio/locale:univ.utf8] -Duse64bitall DEBUGGING
~~ ../cpan/Unicode-Collate/t/loc_kn.t .......................... FAILED 3-7
  [stdio/perlio/locale:univ.utf8] -Duse64bitall DEBUGGING
~~ ../cpan/IO-Zlib/t/getc.t .................................... FAILED 4 Non-zero exit status: 255 Bad plan.  You planned 10 tests but ran 4.
  [stdio/perlio/locale:univ.utf8] -Duseithreads -Duse64bitall DEBUGGING
  [stdio/perlio/locale:univ.utf8] -Duseithreads -Duse64bitall
  [stdio/perlio/locale:univ.utf8] -Duse64bitall DEBUGGING
  [stdio/perlio/locale:univ.utf8] -Duse64bitall
~~ ../cpan/Unicode-Collate/t/loc_lt.t .......................... FAILED 54
  [stdio/perlio/locale:univ.utf8] -Duseithreads -Duse64bitall DEBUGGING
  [stdio/perlio/locale:univ.utf8] -Duseithreads -Duse64bitall
  [stdio/perlio/locale:univ.utf8] -Duse64bitall
~~ ../cpan/IO-Compress/t/002any-deflate.t ...................... FAILED 6-8 42-44 Non-zero exit status: 24
  [stdio/perlio/locale:univ.utf8] -Duseithreads -Duse64bitall DEBUGGING
  [stdio/perlio/locale:univ.utf8] -Duseithreads -Duse64bitall
  [stdio/perlio/locale:univ.utf8] -Duse64bitall DEBUGGING
  [stdio/perlio/locale:univ.utf8] -Duse64bitall
~~ ../cpan/Unicode-Collate/t/loc_cy.t .......................... FAILED 14
  [stdio/perlio/locale:univ.utf8] -Duseithreads -Duse64bitall DEBUGGING
  [stdio/perlio/locale:univ.utf8] -Duseithreads -Duse64bitall
  [stdio/perlio/locale:univ.utf8] -Duse64bitall
~~ ../cpan/Unicode-Collate/t/loc_se.t .......................... FAILED 11
  [stdio/perlio/locale:univ.utf8] -Duseithreads -Duse64bitall DEBUGGING
  [stdio/perlio/locale:univ.utf8] -Duseithreads -Duse64bitall
  [stdio/perlio/locale:univ.utf8] -Duse64bitall
~~ ../cpan/IO-Compress/t/102tied-zip.t ......................... FAILED 18 84-87 138-141 204-207 Non-zero exit status: 80
  [stdio/perlio/locale:univ.utf8] -Duse64bitall DEBUGGING
~~ ../cpan/Unicode-Collate/t/loc_deat.t ........................ FAILED 6
  [stdio/perlio/locale:univ.utf8] -Duseithreads -Duse64bitall DEBUGGING
  [stdio/perlio/locale:univ.utf8] -Duseithreads -Duse64bitall
  [stdio/perlio/locale:univ.utf8] -Duse64bitall
~~ ../cpan/Unicode-Collate/t/loc_srla.t ........................ FAILED 3-4 51-76
  [stdio/perlio/locale:univ.utf8] -Duse64bitall DEBUGGING
~~ ../cpan/Unicode-Collate/t/loc_zhgb.t ........................ FAILED 6 47-53 113-150
  [stdio/perlio/locale:univ.utf8] -Duse64bitall DEBUGGING
~~ ../dist/Filter-Simple/t/filter_only.t ....................... FAILED Non-zero exit status: 255 No plan found in TAP output
  [stdio/perlio/locale:univ.utf8] -Duse64bitall DEBUGGING
~~ ../cpan/IO-Compress/t/104destroy-deflate.t .................. FAILED Non-zero exit status: 2 Bad plan.  You planned 15 tests but ran 4.
  [stdio] -Duseithreads -Duse64bitall DEBUGGING
  [stdio] -Duseithreads -Duse64bitall
  [stdio] -Duse64bitall DEBUGGING
  [stdio] -Duse64bitall
~~ ../cpan/Unicode-Collate/t/loc_zhpy.t ........................ FAILED 6 47-53 113-150
  [stdio/perlio/locale:univ.utf8] -Duse64bitall DEBUGGING
~~ ../cpan/IO-Compress/t/110encode-gzip.t ...................... FAILED Non-zero exit status: 255 Bad plan.  You planned 29 tests but ran 1.
  [stdio/perlio/locale:univ.utf8] -Duseithreads -Duse64bitall DEBUGGING
  [stdio/perlio/locale:univ.utf8] -Duseithreads -Duse64bitall
  [stdio/perlio/locale:univ.utf8] -Duse64bitall DEBUGGING
  [stdio/perlio/locale:univ.utf8] -Duse64bitall
~~ ../t/porting/regen.t ........................................ FAILED 33
  [stdio/perlio/locale:univ.utf8] -Duse64bitall DEBUGGING
~~ ../cpan/Unicode-Collate/t/ident.t ........................... FAILED 35-36
  [stdio/perlio/locale:univ.utf8] -Duseithreads -Duse64bitall DEBUGGING
  [stdio/perlio/locale:univ.utf8] -Duseithreads -Duse64bitall
  [stdio/perlio/locale:univ.utf8] -Duse64bitall
~~ ../cpan/IO-Compress/t/108anyunc-gzip.t ...................... FAILED 5 Non-zero exit status: 2 Bad plan.  You planned 48 tests but ran 5.
  [stdio/perlio/locale:univ.utf8] -Duseithreads -Duse64bitall DEBUGGING
  [stdio/perlio/locale:univ.utf8] -Duseithreads -Duse64bitall
  [stdio/perlio/locale:univ.utf8] -Duse64bitall DEBUGGING
  [stdio/perlio/locale:univ.utf8] -Duse64bitall
~~ ../cpan/Encode/t/perlio.t ................................... FAILED 33-35 Non-zero exit status: 5
  [stdio/perlio/locale:univ.utf8] -Duse64bitall DEBUGGING
~~ ../cpan/Unicode-Collate/t/loc_zhst.t ........................ FAILED 281
  [stdio/perlio/locale:univ.utf8] -Duseithreads -Duse64bitall DEBUGGING
  [stdio/perlio/locale:univ.utf8] -Duseithreads -Duse64bitall
  [stdio/perlio/locale:univ.utf8] -Duse64bitall
~~ ../cpan/IO-Compress/t/103newtied-gzip.t ..................... FAILED Non-zero exit status: 255 Bad plan.  You planned 84 tests but ran 14.
  [stdio/perlio/locale:univ.utf8] -Duseithreads -Duse64bitall DEBUGGING
  [stdio/perlio/locale:univ.utf8] -Duseithreads -Duse64bitall
  [stdio/perlio/locale:univ.utf8] -Duse64bitall DEBUGGING
  [stdio/perlio/locale:univ.utf8] -Duse64bitall
~~ ../cpan/Unicode-Collate/t/loc_kok.t ......................... FAILED 3-5
  [stdio/perlio/locale:univ.utf8] -Duse64bitall DEBUGGING
~~ ../cpan/Unicode-Collate/t/loc_ig.t .......................... FAILED 3-4 31
  [stdio/perlio/locale:univ.utf8] -Duse64bitall DEBUGGING
~~ ../cpan/Unicode-Collate/t/loc_bs.t .......................... FAILED 3-4 51-76
  [stdio/perlio/locale:univ.utf8] -Duse64bitall DEBUGGING
~~ ../cpan/IO-Compress/t/105oneshot-gzip-only.t ................ FAILED 5-7 Non-zero exit status: 255 Bad plan.  You planned 70 tests but ran 7.
  [stdio/perlio/locale:univ.utf8] -Duseithreads -Duse64bitall DEBUGGING
  [stdio/perlio/locale:univ.utf8] -Duseithreads -Duse64bitall
  [stdio/perlio/locale:univ.utf8] -Duse64bitall DEBUGGING
  [stdio/perlio/locale:univ.utf8] -Duse64bitall
~~ ../t/comp/utf.t ............................................. FAILED 1-2096
  [stdio/perlio/locale:univ.utf8] -Duse64bitall DEBUGGING
~~ ../cpan/Unicode-Collate/t/iglevel2.t ........................ FAILED 21-24
  [stdio/perlio/locale:univ.utf8] -Duseithreads -Duse64bitall DEBUGGING
  [stdio/perlio/locale:univ.utf8] -Duseithreads -Duse64bitall
  [stdio/perlio/locale:univ.utf8] -Duse64bitall
~~ ../cpan/Unicode-Collate/t/loc_lkt.t ......................... FAILED 8
  [stdio/perlio/locale:univ.utf8] -Duseithreads -Duse64bitall DEBUGGING
  [stdio/perlio/locale:univ.utf8] -Duseithreads -Duse64bitall
  [stdio/perlio/locale:univ.utf8] -Duse64bitall
~~ ../cpan/Unicode-Collate/t/loc_fiph.t ........................ FAILED 3-5
  [stdio/perlio/locale:univ.utf8] -Duse64bitall DEBUGGING
~~ ../cpan/IO-Compress/t/105oneshot-deflate.t .................. FAILED Non-zero exit status: 2 Bad plan.  You planned 1002 tests but ran 117.
  [stdio/perlio/locale:univ.utf8] -Duseithreads -Duse64bitall DEBUGGING
  [stdio/perlio/locale:univ.utf8] -Duseithreads -Duse64bitall
  [stdio/perlio/locale:univ.utf8] -Duse64bitall DEBUGGING
  [stdio/perlio/locale:univ.utf8] -Duse64bitall
~~ ../cpan/Unicode-Collate/t/loc_sidt.t ........................ FAILED 3-5
  [stdio/perlio/locale:univ.utf8] -Duse64bitall DEBUGGING
~~ ../cpan/Unicode-Collate/t/loc_svrf.t ........................ FAILED 3-5 85-92
  [stdio/perlio/locale:univ.utf8] -Duse64bitall DEBUGGING
~~ ../cpan/Unicode-Collate/t/loc_fa.t .......................... FAILED 8 82
  [stdio/perlio/locale:univ.utf8] -Duse64bitall DEBUGGING
~~ ../cpan/Unicode-Collate/t/loc_kk.t .......................... FAILED 25
  [stdio/perlio/locale:univ.utf8] -Duseithreads -Duse64bitall DEBUGGING
  [stdio/perlio/locale:univ.utf8] -Duseithreads -Duse64bitall
  [stdio/perlio/locale:univ.utf8] -Duse64bitall
~~ ../cpan/Unicode-Collate/t/loc_fil.t ......................... FAILED 3-6
  [stdio/perlio/locale:univ.utf8] -Duse64bitall DEBUGGING
~~ ../cpan/Unicode-Collate/t/loc_eo.t .......................... FAILED 8
  [stdio/perlio/locale:univ.utf8] -Duseithreads -Duse64bitall DEBUGGING
  [stdio/perlio/locale:univ.utf8] -Duseithreads -Duse64bitall
  [stdio/perlio/locale:univ.utf8] -Duse64bitall
~~ ../cpan/Unicode-Collate/t/loc_mk.t .......................... FAILED 8 143-144
  [stdio/perlio/locale:univ.utf8] -Duse64bitall DEBUGGING
~~ ../cpan/IO-Compress/t/104destroy-deflate.t .................. FAILED Non-zero exit status: 255 Bad plan.  You planned 15 tests but ran 4.
  [perlio/locale:univ.utf8] -Duseithreads -Duse64bitall DEBUGGING
  [perlio/locale:univ.utf8] -Duseithreads -Duse64bitall
  [perlio/locale:univ.utf8] -Duse64bitall DEBUGGING
  [perlio/locale:univ.utf8] -Duse64bitall
~~ ../cpan/Unicode-Collate/t/trailwt.t ......................... FAILED 3-6
  [stdio/perlio/locale:univ.utf8] -Duse64bitall DEBUGGING
~~ ../cpan/Unicode-Collate/t/index.t ........................... FAILED 10
  [stdio/perlio/locale:univ.utf8] -Duseithreads -Duse64bitall DEBUGGING
  [stdio/perlio/locale:univ.utf8] -Duseithreads -Duse64bitall
  [stdio/perlio/locale:univ.utf8] -Duse64bitall
~~ ../cpan/IO-Compress/t/110encode-deflate.t ................... FAILED 2-3 Non-zero exit status: 13
  [stdio/perlio/locale:univ.utf8] -Duseithreads -Duse64bitall DEBUGGING
  [stdio/perlio/locale:univ.utf8] -Duseithreads -Duse64bitall
  [stdio/perlio/locale:univ.utf8] -Duse64bitall DEBUGGING
  [stdio/perlio/locale:univ.utf8] -Duse64bitall
~~ ../cpan/Unicode-Collate/t/loc_az.t .......................... FAILED 3-4 29-32
  [stdio/perlio/locale:univ.utf8] -Duse64bitall DEBUGGING
~~ ../cpan/Unicode-Collate/t/loc_test.t ........................ FAILED 8 69 102
  [stdio/perlio/locale:univ.utf8] -Duseithreads -Duse64bitall DEBUGGING
  [stdio/perlio/locale:univ.utf8] -Duseithreads -Duse64bitall
  [stdio/perlio/locale:univ.utf8] -Duse64bitall
~~ ../cpan/Unicode-Collate/t/nonchar.t ......................... FAILED 83
  [stdio/perlio/locale:univ.utf8] -Duseithreads -Duse64bitall DEBUGGING
  [stdio/perlio/locale:univ.utf8] -Duseithreads -Duse64bitall
  [stdio/perlio/locale:univ.utf8] -Duse64bitall
~~ ../cpan/Unicode-Collate/t/cjk_gb.t .......................... FAILED 2-18
  [stdio/perlio/locale:univ.utf8] -Duse64bitall DEBUGGING
~~ ../cpan/Unicode-Collate/t/loc_zhzy.t ........................ FAILED 281 307
  [stdio/perlio/locale:univ.utf8] -Duseithreads -Duse64bitall DEBUGGING
  [stdio/perlio/locale:univ.utf8] -Duseithreads -Duse64bitall
  [stdio/perlio/locale:univ.utf8] -Duse64bitall
~~ ../cpan/Unicode-Collate/t/loc_be.t .......................... FAILED 21
  [stdio/perlio/locale:univ.utf8] -Duseithreads -Duse64bitall DEBUGGING
  [stdio/perlio/locale:univ.utf8] -Duseithreads -Duse64bitall
  [stdio/perlio/locale:univ.utf8] -Duse64bitall
~~ ../cpan/Unicode-Collate/t/iglevel2.t ........................ FAILED 4-7
  [stdio/perlio/locale:univ.utf8] -Duse64bitall DEBUGGING
~~ ../cpan/Encode/t/fallback.t ................................. FAILED 47-50 Non-zero exit status: 4
  [stdio/perlio/locale:univ.utf8] -Duseithreads -Duse64bitall DEBUGGING
  [stdio/perlio/locale:univ.utf8] -Duseithreads -Duse64bitall
  [stdio/perlio/locale:univ.utf8] -Duse64bitall DEBUGGING
  [stdio/perlio/locale:univ.utf8] -Duse64bitall
~~ ../cpan/IO-Compress/t/108anyunc-deflate.t ................... FAILED 6-8 42-44 Non-zero exit status: 24
  [stdio/perlio/locale:univ.utf8] -Duseithreads -Duse64bitall DEBUGGING
  [stdio/perlio/locale:univ.utf8] -Duseithreads -Duse64bitall
  [stdio/perlio/locale:univ.utf8] -Duse64bitall DEBUGGING
  [stdio/perlio/locale:univ.utf8] -Duse64bitall
~~ ../cpan/Unicode-Collate/t/default.t ......................... FAILED 10-12
  [stdio/perlio/locale:univ.utf8] -Duseithreads -Duse64bitall DEBUGGING
  [stdio/perlio/locale:univ.utf8] -Duseithreads -Duse64bitall
  [stdio/perlio/locale:univ.utf8] -Duse64bitall
~~ ../cpan/IO-Compress/t/105oneshot-zip.t ...................... FAILED Non-zero exit status: 2 Bad plan.  You planned 1002 tests but ran 117.
  [stdio/perlio/locale:univ.utf8] -Duse64bitall DEBUGGING
~~ ../cpan/Unicode-Collate/t/loc_sr.t .......................... FAILED 22
  [stdio/perlio/locale:univ.utf8] -Duseithreads -Duse64bitall DEBUGGING
  [stdio/perlio/locale:univ.utf8] -Duseithreads -Duse64bitall
  [stdio/perlio/locale:univ.utf8] -Duse64bitall DEBUGGING
  [stdio/perlio/locale:univ.utf8] -Duse64bitall
~~ ../lib/warnings.t ........................................... FAILED 368
  [stdio/perlio/locale:univ.utf8] -Duseithreads -Duse64bitall DEBUGGING
  [stdio/perlio/locale:univ.utf8] -Duseithreads -Duse64bitall
  [stdio/perlio/locale:univ.utf8] -Duse64bitall DEBUGGING
  [stdio/perlio/locale:univ.utf8] -Duse64bitall
~~ ../cpan/IO-Compress/t/105oneshot-zip-only.t ................. FAILED 5-6 32 57 87 109-110 135-136 Non-zero exit status: 255 Bad plan.  You planned 216 tests but ran 136.
  [stdio/perlio/locale:univ.utf8] -Duse64bitall DEBUGGING
~~ ../cpan/Unicode-Collate/t/loc_fo.t .......................... FAILED 3-5 104-105
  [stdio/perlio/locale:univ.utf8] -Duse64bitall DEBUGGING
~~ ../cpan/Unicode-Collate/t/default.t ......................... FAILED 10-14 47-48
  [stdio/perlio/locale:univ.utf8] -Duse64bitall DEBUGGING
~~ ../cpan/IO-Compress/t/103newtied-zip.t ...................... FAILED 15 57-58 Non-zero exit status: 33
  [stdio/perlio/locale:univ.utf8] -Duse64bitall DEBUGGING
~~ ../cpan/Unicode-Collate/t/loc_sk.t .......................... FAILED 3
  [stdio/perlio/locale:univ.utf8] -Duse64bitall DEBUGGING
~~ ../cpan/Unicode-Collate/t/nonchar.t ......................... FAILED 2
  [stdio/perlio/locale:univ.utf8] -Duse64bitall DEBUGGING
~~ ../cpan/IO-Compress/t/005defhdr.t ........................... FAILED 10-13 174-177 324-327 474-477 544-546 577-579 Non-zero exit status: 104
  [stdio/perlio/locale:univ.utf8] -Duseithreads -Duse64bitall DEBUGGING
  [stdio/perlio/locale:univ.utf8] -Duseithreads -Duse64bitall
  [stdio/perlio/locale:univ.utf8] -Duse64bitall DEBUGGING
  [stdio/perlio/locale:univ.utf8] -Duse64bitall
~~ ../cpan/Unicode-Collate/t/overcjk1.t ........................ FAILED 2-14 150-162 265-278
  [stdio/perlio/locale:univ.utf8] -Duse64bitall DEBUGGING
~~ ../cpan/IO-Compress/t/109merge-gzip.t ....................... FAILED Non-zero exit status: 2 Bad plan.  You planned 165 tests but ran 30.
  [stdio/perlio/locale:univ.utf8] -Duseithreads -Duse64bitall DEBUGGING
  [stdio/perlio/locale:univ.utf8] -Duseithreads -Duse64bitall
  [stdio/perlio/locale:univ.utf8] -Duse64bitall DEBUGGING
  [stdio/perlio/locale:univ.utf8] -Duse64bitall
~~ ../cpan/Unicode-Collate/t/loc_sq.t .......................... FAILED 12-13
  [stdio/perlio/locale:univ.utf8] -Duseithreads -Duse64bitall DEBUGGING
  [stdio/perlio/locale:univ.utf8] -Duseithreads -Duse64bitall
  [stdio/perlio/locale:univ.utf8] -Duse64bitall
~~ ../cpan/IO-Zlib/t/basic.t ................................... FAILED 7 Non-zero exit status: 255 Bad plan.  You planned 17 tests but ran 7.
  [stdio/perlio/locale:univ.utf8] -Duseithreads -Duse64bitall DEBUGGING
  [stdio/perlio/locale:univ.utf8] -Duseithreads -Duse64bitall
  [stdio/perlio/locale:univ.utf8] -Duse64bitall DEBUGGING
  [stdio/perlio/locale:univ.utf8] -Duse64bitall
~~ ../cpan/Unicode-Collate/t/loc_tn.t .......................... FAILED 6
  [stdio/perlio/locale:univ.utf8] -Duseithreads -Duse64bitall DEBUGGING
  [stdio/perlio/locale:univ.utf8] -Duseithreads -Duse64bitall
  [stdio/perlio/locale:univ.utf8] -Duse64bitall
~~ ../cpan/Encode/t/Unicode.t .................................. FAILED 1-20 Non-zero exit status: 20
  [stdio/perlio/locale:univ.utf8] -Duseithreads -Duse64bitall DEBUGGING
  [stdio/perlio/locale:univ.utf8] -Duseithreads -Duse64bitall
  [stdio/perlio/locale:univ.utf8] -Duse64bitall
~~ ../cpan/Unicode-Collate/t/loc_cyrl.t ........................ FAILED 109-208
  [stdio/perlio/locale:univ.utf8] -Duseithreads -Duse64bitall DEBUGGING
  [stdio/perlio/locale:univ.utf8] -Duseithreads -Duse64bitall
  [stdio/perlio/locale:univ.utf8] -Duse64bitall
~~ ../cpan/Unicode-Collate/t/loc_wae.t ......................... FAILED 12-14
  [stdio/perlio/locale:univ.utf8] -Duseithreads -Duse64bitall DEBUGGING
  [stdio/perlio/locale:univ.utf8] -Duseithreads -Duse64bitall
  [stdio/perlio/locale:univ.utf8] -Duse64bitall DEBUGGING
  [stdio/perlio/locale:univ.utf8] -Duse64bitall
~~ ../cpan/Unicode-Collate/t/loc_jait.t ........................ FAILED 93-198 410-414 440-442 470-474 500-502 530-534 558-562 593-595 627-631 659-663 708-709 741-742
  [stdio/perlio/locale:univ.utf8] -Duse64bitall DEBUGGING
~~ ../cpan/Unicode-Collate/t/illegal.t ......................... FAILED 24-26
  [stdio/perlio/locale:univ.utf8] -Duseithreads -Duse64bitall DEBUGGING
  [stdio/perlio/locale:univ.utf8] -Duseithreads -Duse64bitall
  [stdio/perlio/locale:univ.utf8] -Duse64bitall
~~ ../cpan/Unicode-Collate/t/loc_to.t .......................... FAILED 108-109
  [stdio/perlio/locale:univ.utf8] -Duseithreads -Duse64bitall DEBUGGING
  [stdio/perlio/locale:univ.utf8] -Duseithreads -Duse64bitall
  [stdio/perlio/locale:univ.utf8] -Duse64bitall
~~ ../cpan/Unicode-Collate/t/loc_hi.t .......................... FAILED 3
  [stdio/perlio/locale:univ.utf8] -Duse64bitall DEBUGGING
~~ ../cpan/Unicode-Collate/t/loc_zh.t .......................... FAILED 6 47-53 113-150
  [stdio/perlio/locale:univ.utf8] -Duse64bitall DEBUGGING
~~ ../cpan/Unicode-Collate/t/loc_tr.t .......................... FAILED 3 50-57
  [stdio/perlio/locale:univ.utf8] -Duse64bitall DEBUGGING
~~ ../cpan/Unicode-Collate/t/loc_ha.t .......................... FAILED 9-10
  [stdio/perlio/locale:univ.utf8] -Duse64bitall DEBUGGING
~~ ../cpan/Unicode-Collate/t/hangul.t .......................... FAILED 3 65
  [stdio/perlio/locale:univ.utf8] -Duse64bitall DEBUGGING
~~ ../cpan/IO-Compress/t/105oneshot-zip-bzip2-only.t ........... FAILED 5-6 Non-zero exit status: 255 Bad plan.  You planned 248 tests but ran 30.
  [stdio/perlio/locale:univ.utf8] -Duse64bitall DEBUGGING
~~ ../cpan/Unicode-Collate/t/loc_kk.t .......................... FAILED 10 171-172
  [stdio/perlio/locale:univ.utf8] -Duse64bitall DEBUGGING
~~ ../cpan/IO-Compress/t/001zlib-generic-zip.t ................. FAILED 10 Non-zero exit status: 8
  [stdio/perlio/locale:univ.utf8] -Duse64bitall DEBUGGING
~~ ../cpan/Unicode-Collate/t/loc_deph.t ........................ FAILED 3-14
  [stdio/perlio/locale:univ.utf8] -Duse64bitall DEBUGGING
~~ ../cpan/Unicode-Collate/t/loc_hy.t .......................... FAILED 10
  [stdio/perlio/locale:univ.utf8] -Duseithreads -Duse64bitall DEBUGGING
  [stdio/perlio/locale:univ.utf8] -Duseithreads -Duse64bitall
  [stdio/perlio/locale:univ.utf8] -Duse64bitall
~~ ../cpan/Unicode-Collate/t/normal.t .......................... FAILED 11
  [stdio/perlio/locale:univ.utf8] -Duseithreads -Duse64bitall DEBUGGING
  [stdio/perlio/locale:univ.utf8] -Duseithreads -Duse64bitall
  [stdio/perlio/locale:univ.utf8] -Duse64bitall
~~ ../cpan/Unicode-Collate/t/backwds.t ......................... FAILED 2-36
  [stdio/perlio/locale:univ.utf8] -Duse64bitall DEBUGGING
~~ ../cpan/Unicode-Collate/t/loc_ha.t .......................... FAILED 47
  [stdio/perlio/locale:univ.utf8] -Duseithreads -Duse64bitall DEBUGGING
  [stdio/perlio/locale:univ.utf8] -Duseithreads -Duse64bitall
  [stdio/perlio/locale:univ.utf8] -Duse64bitall
~~ ../cpan/IO-Compress/t/001zlib-generic-gzip.t ................ FAILED 9 Non-zero exit status: 2 Bad plan.  You planned 49 tests but ran 9.
  [stdio/perlio/locale:univ.utf8] -Duseithreads -Duse64bitall DEBUGGING
  [stdio/perlio/locale:univ.utf8] -Duseithreads -Duse64bitall
  [stdio/perlio/locale:univ.utf8] -Duse64bitall DEBUGGING
  [stdio/perlio/locale:univ.utf8] -Duse64bitall
~~ ../cpan/Unicode-Collate/t/rewrite.t ......................... FAILED 4-5
  [stdio/perlio/locale:univ.utf8] -Duse64bitall DEBUGGING
~~ ../cpan/Unicode-Collate/t/loc_wo.t .......................... FAILED 16
  [stdio/perlio/locale:univ.utf8] -Duseithreads -Duse64bitall DEBUGGING
  [stdio/perlio/locale:univ.utf8] -Duseithreads -Duse64bitall
  [stdio/perlio/locale:univ.utf8] -Duse64bitall
~~ ../cpan/Unicode-Collate/t/cjk_b5.t .......................... FAILED 2-21
  [stdio/perlio/locale:univ.utf8] -Duse64bitall DEBUGGING
~~ ../cpan/Digest-SHA/t/ireland.t .............................. FAILED 1
  [stdio/perlio/locale:univ.utf8] -Duse64bitall DEBUGGING
~~ ../cpan/Unicode-Collate/t/loc_sk.t .......................... FAILED 10
  [stdio/perlio/locale:univ.utf8] -Duseithreads -Duse64bitall DEBUGGING
  [stdio/perlio/locale:univ.utf8] -Duseithreads -Duse64bitall
  [stdio/perlio/locale:univ.utf8] -Duse64bitall
~~ ../cpan/Unicode-Collate/t/loc_gu.t .......................... FAILED 3
  [stdio/perlio/locale:univ.utf8] -Duse64bitall DEBUGGING
~~ ../cpan/Unicode-Collate/t/loc_ro.t .......................... FAILED 3-4
  [stdio/perlio/locale:univ.utf8] -Duse64bitall DEBUGGING
~~ ../cpan/Unicode-Collate/t/illegal.t ......................... FAILED 2-3 107-109 132-134
  [stdio/perlio/locale:univ.utf8] -Duse64bitall DEBUGGING
~~ ../cpan/Unicode-Collate/t/loc_haw.t ......................... FAILED 3-6
  [stdio/perlio/locale:univ.utf8] -Duse64bitall DEBUGGING
~~ ../cpan/Unicode-Collate/t/loc_hr.t .......................... FAILED 3-4 51-76
  [stdio/perlio/locale:univ.utf8] -Duse64bitall DEBUGGING
~~ ../cpan/Unicode-Collate/t/test.t ............................ FAILED 31
  [stdio/perlio/locale:univ.utf8] -Duseithreads -Duse64bitall DEBUGGING
  [stdio/perlio/locale:univ.utf8] -Duseithreads -Duse64bitall
  [stdio/perlio/locale:univ.utf8] -Duse64bitall
~~ ../cpan/Unicode-Collate/t/loc_zhst.t ........................ FAILED 6 47-53 113-150
  [stdio/perlio/locale:univ.utf8] -Duse64bitall DEBUGGING
~~ ../cpan/Unicode-Collate/t/loc_is.t .......................... FAILED 11
  [stdio/perlio/locale:univ.utf8] -Duseithreads -Duse64bitall DEBUGGING
  [stdio/perlio/locale:univ.utf8] -Duseithreads -Duse64bitall
  [stdio/perlio/locale:univ.utf8] -Duse64bitall
~~ ../t/io/iprefix.t ........................................... FAILED Bad plan.  You planned 2 tests but ran 0.
  [stdio] -Duseithreads -Duse64bitall DEBUGGING
~~ ../cpan/Unicode-Collate/t/loc_bscy.t ........................ FAILED 22
  [stdio/perlio/locale:univ.utf8] -Duseithreads -Duse64bitall DEBUGGING
  [stdio/perlio/locale:univ.utf8] -Duseithreads -Duse64bitall
  [stdio/perlio/locale:univ.utf8] -Duse64bitall DEBUGGING
  [stdio/perlio/locale:univ.utf8] -Duse64bitall
~~ ../cpan/IO-Compress/t/107multi-gzip.t ....................... FAILED 8 Non-zero exit status: 255 Bad plan.  You planned 1828 tests but ran 8.
  [stdio/perlio/locale:univ.utf8] -Duseithreads -Duse64bitall DEBUGGING
  [stdio/perlio/locale:univ.utf8] -Duseithreads -Duse64bitall
  [stdio/perlio/locale:univ.utf8] -Duse64bitall
~~ ../cpan/Unicode-Collate/t/loc_pl.t .......................... FAILED 20
  [stdio/perlio/locale:univ.utf8] -Duseithreads -Duse64bitall DEBUGGING
  [stdio/perlio/locale:univ.utf8] -Duseithreads -Duse64bitall
  [stdio/perlio/locale:univ.utf8] -Duse64bitall
~~ ../cpan/Unicode-Collate/t/index.t ........................... FAILED 3
  [stdio/perlio/locale:univ.utf8] -Duse64bitall DEBUGGING
~~ ../cpan/Unicode-Collate/t/loc_zhpy.t ........................ FAILED 281
  [stdio/perlio/locale:univ.utf8] -Duseithreads -Duse64bitall DEBUGGING
  [stdio/perlio/locale:univ.utf8] -Duseithreads -Duse64bitall
  [stdio/perlio/locale:univ.utf8] -Duse64bitall
~~ ../cpan/Unicode-Collate/t/loc_fi.t .......................... FAILED 3-5
  [stdio/perlio/locale:univ.utf8] -Duse64bitall DEBUGGING
~~ ../cpan/IO-Compress/t/110encode-zip.t ....................... FAILED 2-3 Non-zero exit status: 13
  [stdio/perlio/locale:univ.utf8] -Duse64bitall DEBUGGING
~~ ../cpan/Unicode-Collate/t/contract.t ........................ FAILED 2-3 43 93 117-118
  [stdio/perlio/locale:univ.utf8] -Duse64bitall DEBUGGING
~~ ../cpan/Unicode-Collate/t/loc_ig.t .......................... FAILED 12
  [stdio/perlio/locale:univ.utf8] -Duseithreads -Duse64bitall DEBUGGING
  [stdio/perlio/locale:univ.utf8] -Duseithreads -Duse64bitall
  [stdio/perlio/locale:univ.utf8] -Duse64bitall
~~ ../cpan/IO-Compress/t/102tied-deflate.t ..................... FAILED 18 84-87 138-141 204-207 Non-zero exit status: 80
  [stdio/perlio/locale:univ.utf8] -Duseithreads -Duse64bitall DEBUGGING
  [stdio/perlio/locale:univ.utf8] -Duseithreads -Duse64bitall
  [stdio/perlio/locale:univ.utf8] -Duse64bitall DEBUGGING
  [stdio/perlio/locale:univ.utf8] -Duse64bitall
~~ ../cpan/Unicode-Collate/t/loc_ro.t .......................... FAILED 38-39
  [stdio/perlio/locale:univ.utf8] -Duseithreads -Duse64bitall DEBUGGING
  [stdio/perlio/locale:univ.utf8] -Duseithreads -Duse64bitall
  [stdio/perlio/locale:univ.utf8] -Duse64bitall
~~ ../cpan/Unicode-Collate/t/loc_yo.t .......................... FAILED 8
  [stdio/perlio/locale:univ.utf8] -Duseithreads -Duse64bitall DEBUGGING
  [stdio/perlio/locale:univ.utf8] -Duseithreads -Duse64bitall
  [stdio/perlio/locale:univ.utf8] -Duse64bitall
~~ ../cpan/Unicode-Collate/t/cjk_zy.t .......................... FAILED 7-8
  [stdio/perlio/locale:univ.utf8] -Duseithreads -Duse64bitall DEBUGGING
  [stdio/perlio/locale:univ.utf8] -Duseithreads -Duse64bitall
  [stdio/perlio/locale:univ.utf8] -Duse64bitall
~~ ../cpan/Unicode-Collate/t/loc_ta.t .......................... FAILED 3-52
  [stdio/perlio/locale:univ.utf8] -Duse64bitall DEBUGGING
~~ ../cpan/Unicode-Collate/t/loc_bn.t .......................... FAILED 3-6
  [stdio/perlio/locale:univ.utf8] -Duse64bitall DEBUGGING
~~ ../cpan/Unicode-Collate/t/loc_tn.t .......................... FAILED 3
  [stdio/perlio/locale:univ.utf8] -Duse64bitall DEBUGGING
~~ ../cpan/Unicode-Collate/t/loc_tr.t .......................... FAILED 6
  [stdio/perlio/locale:univ.utf8] -Duseithreads -Duse64bitall DEBUGGING
  [stdio/perlio/locale:univ.utf8] -Duseithreads -Duse64bitall
  [stdio/perlio/locale:univ.utf8] -Duse64bitall
~~ ../cpan/Unicode-Collate/t/loc_cjkc.t ........................ FAILED 10-8025
  [stdio/perlio/locale:univ.utf8] -Duseithreads -Duse64bitall DEBUGGING
  [stdio/perlio/locale:univ.utf8] -Duseithreads -Duse64bitall
  [stdio/perlio/locale:univ.utf8] -Duse64bitall
~~ ../cpan/Unicode-Collate/t/cjk_py.t .......................... FAILED 2-12
  [stdio/perlio/locale:univ.utf8] -Duse64bitall DEBUGGING
~~ ../cpan/Unicode-Collate/t/loc_sw.t .......................... FAILED 12
  [stdio/perlio/locale:univ.utf8] -Duseithreads -Duse64bitall DEBUGGING
  [stdio/perlio/locale:univ.utf8] -Duseithreads -Duse64bitall
  [stdio/perlio/locale:univ.utf8] -Duse64bitall DEBUGGING
  [stdio/perlio/locale:univ.utf8] -Duse64bitall
~~ ../cpan/Unicode-Collate/t/loc_ee.t .......................... FAILED 13
  [stdio/perlio/locale:univ.utf8] -Duseithreads -Duse64bitall DEBUGGING
  [stdio/perlio/locale:univ.utf8] -Duseithreads -Duse64bitall
  [stdio/perlio/locale:univ.utf8] -Duse64bitall
~~ ../cpan/Memoize/t/expmod_n.t ................................ FAILED 12
  [stdio/perlio/locale:univ.utf8] -Duse64bitall DEBUGGING
~~ ../cpan/Unicode-Collate/t/overcjk0.t ........................ FAILED 6
  [stdio/perlio/locale:univ.utf8] -Duse64bitall DEBUGGING
~~ ../cpan/Unicode-Collate/t/ignor.t ........................... FAILED 28-31
  [stdio/perlio/locale:univ.utf8] -Duseithreads -Duse64bitall DEBUGGING
  [stdio/perlio/locale:univ.utf8] -Duseithreads -Duse64bitall
  [stdio/perlio/locale:univ.utf8] -Duse64bitall
~~ ../cpan/Unicode-Collate/t/cjk_st.t .......................... FAILED 25-26
  [stdio/perlio/locale:univ.utf8] -Duseithreads -Duse64bitall DEBUGGING
  [stdio/perlio/locale:univ.utf8] -Duseithreads -Duse64bitall
  [stdio/perlio/locale:univ.utf8] -Duse64bitall
~~ ../cpan/Unicode-Collate/t/loc_de.t .......................... FAILED 33-50
  [stdio/perlio/locale:univ.utf8] -Duseithreads -Duse64bitall DEBUGGING
  [stdio/perlio/locale:univ.utf8] -Duseithreads -Duse64bitall
  [stdio/perlio/locale:univ.utf8] -Duse64bitall
~~ ../t/op/pack.t .............................................. FAILED Non-zero exit status: 255 Bad plan.  You planned 14717 tests but ran 0.
  [stdio/perlio/locale:univ.utf8] -Duseithreads -Duse64bitall DEBUGGING
  [stdio/perlio/locale:univ.utf8] -Duseithreads -Duse64bitall
  [stdio/perlio/locale:univ.utf8] -Duse64bitall DEBUGGING
  [stdio/perlio/locale:univ.utf8] -Duse64bitall
~~ ../cpan/Unicode-Collate/t/loc_ml.t .......................... FAILED 3
  [stdio/perlio/locale:univ.utf8] -Duse64bitall DEBUGGING
~~ ../cpan/Unicode-Collate/t/loc_vi.t .......................... FAILED 3-4 67-90 138-139 201-216 265-266 308-309 416-420
  [stdio/perlio/locale:univ.utf8] -Duse64bitall DEBUGGING
~~ ../cpan/Unicode-Collate/t/loc_mt.t .......................... FAILED 3
  [stdio/perlio/locale:univ.utf8] -Duse64bitall DEBUGGING
~~ ../cpan/Unicode-Collate/t/trailwt.t ......................... FAILED 5
  [stdio/perlio/locale:univ.utf8] -Duseithreads -Duse64bitall DEBUGGING
  [stdio/perlio/locale:univ.utf8] -Duseithreads -Duse64bitall
  [stdio/perlio/locale:univ.utf8] -Duse64bitall
~~ ../cpan/Unicode-Collate/t/loc_vi.t .......................... FAILED 12 152-153 229-230
  [stdio/perlio/locale:univ.utf8] -Duseithreads -Duse64bitall DEBUGGING
  [stdio/perlio/locale:univ.utf8] -Duseithreads -Duse64bitall
  [stdio/perlio/locale:univ.utf8] -Duse64bitall
~~ ../cpan/Unicode-Collate/t/loc_nn.t .......................... FAILED 3-5 100-101
  [stdio/perlio/locale:univ.utf8] -Duse64bitall DEBUGGING
~~ ../cpan/Unicode-Collate/t/cjk_ja.t .......................... FAILED 2-14
  [stdio/perlio/locale:univ.utf8] -Duse64bitall DEBUGGING
~~ ../cpan/Encode/t/utf8strict.t ............................... FAILED 40-41 Non-zero exit status: 3
  [stdio/perlio/locale:univ.utf8] -Duseithreads -Duse64bitall DEBUGGING
  [stdio/perlio/locale:univ.utf8] -Duseithreads -Duse64bitall
  [stdio/perlio/locale:univ.utf8] -Duse64bitall DEBUGGING
  [stdio/perlio/locale:univ.utf8] -Duse64bitall
~~ ../cpan/Unicode-Collate/t/loc_to.t .......................... FAILED 3-4
  [stdio/perlio/locale:univ.utf8] -Duse64bitall DEBUGGING
~~ ../cpan/IO-Compress/t/006zip.t .............................. FAILED 10-12 69-70 Non-zero exit status: 25
  [stdio/perlio/locale:univ.utf8] -Duse64bitall DEBUGGING
~~ ../cpan/Unicode-Collate/t/loc_as.t .......................... FAILED 3-6
  [stdio/perlio/locale:univ.utf8] -Duse64bitall DEBUGGING
~~ ../cpan/Unicode-Collate/t/loc_lv.t .......................... FAILED 3
  [stdio/perlio/locale:univ.utf8] -Duse64bitall DEBUGGING
~~ ../cpan/Unicode-Collate/t/loc_mr.t .......................... FAILED 3-5
  [stdio/perlio/locale:univ.utf8] -Duse64bitall DEBUGGING
~~ ../cpan/Unicode-Collate/t/loc_pa.t .......................... FAILED 4-14
  [stdio/perlio/locale:univ.utf8] -Duse64bitall DEBUGGING
~~ ../cpan/Unicode-Collate/t/loc_te.t .......................... FAILED 3-12
  [stdio/perlio/locale:univ.utf8] -Duse64bitall DEBUGGING
~~ ../cpan/Unicode-Collate/t/loc_vo.t .......................... FAILED 3
  [stdio/perlio/locale:univ.utf8] -Duse64bitall DEBUGGING
~~ ../cpan/Unicode-Collate/t/loc_om.t .......................... FAILED 31-41
  [stdio/perlio/locale:univ.utf8] -Duseithreads -Duse64bitall DEBUGGING
  [stdio/perlio/locale:univ.utf8] -Duseithreads -Duse64bitall
  [stdio/perlio/locale:univ.utf8] -Duse64bitall
~~ ../cpan/IO-Zlib/t/large.t ................................... FAILED 4 Non-zero exit status: 255 Bad plan.  You planned 7 tests but ran 4.
  [stdio/perlio/locale:univ.utf8] -Duseithreads -Duse64bitall DEBUGGING
  [stdio/perlio/locale:univ.utf8] -Duseithreads -Duse64bitall
  [stdio/perlio/locale:univ.utf8] -Duse64bitall DEBUGGING
  [stdio/perlio/locale:univ.utf8] -Duse64bitall
~~ ../cpan/Unicode-Collate/t/loc_dsb.t ......................... FAILED 3-4 42-54
  [stdio/perlio/locale:univ.utf8] -Duse64bitall DEBUGGING
~~ ../cpan/Unicode-Collate/t/loc_zhzy.t ........................ FAILED 6 47-53 113-150
  [stdio/perlio/locale:univ.utf8] -Duse64bitall DEBUGGING
~~ ../cpan/Unicode-Collate/t/loc_or.t .......................... FAILED 3-8
  [stdio/perlio/locale:univ.utf8] -Duse64bitall DEBUGGING
~~ ../cpan/IO-Compress/t/107multi-deflate.t .................... FAILED 9-10 30-31 51-52 72-73 93-95 117-118 137-138 157-158 183-184 201-202 218-219 236-237 253-254 272-277 296-297 320-322 345 370-371 395-396 413-414 430-431 448-449 465-466 494-496 513-518 541-543 571-572 593-598 621-622 639-640 656-657 674-675 691-692 711-713 731-733 751-753 771-773 796-797 813-814 831-832 848-849 866-867 890-892 909-914 933-934 957-959 982 1008-1009 1022-1023 1036-1037 1050-1051 1064-1065 1078-1080 1103-1105 1122-1127 1147 1175-1177 1194-1199 1219 1241-1242 1255-1256 1269-1270 1283-1284 1297-1298 1311-1313 1328 1348 1368 1388 1412-1413 1426-1427 1440-1441 1454-1455 1468-1469 1482-1484 1504-1505 1527-1529 1546-1551 1570-1571 1591 1617-1618 1631-1632 1645-1646 1659-1660 1673-1674 1687-1689 1712-1714 1731-1736 1756 1784-1786 1803-1808 1828 Non-zero exit status: 254
  [stdio/perlio/locale:univ.utf8] -Duseithreads -Duse64bitall DEBUGGING
  [stdio/perlio/locale:univ.utf8] -Duseithreads -Duse64bitall
  [stdio/perlio/locale:univ.utf8] -Duse64bitall DEBUGGING
  [stdio/perlio/locale:univ.utf8] -Duse64bitall
~~ ../cpan/Unicode-Collate/t/rearrang.t ........................ FAILED 4-5
  [stdio/perlio/locale:univ.utf8] -Duse64bitall DEBUGGING
~~ ../cpan/Unicode-Collate/t/loc_bs.t .......................... FAILED 93-103
  [stdio/perlio/locale:univ.utf8] -Duseithreads -Duse64bitall DEBUGGING
  [stdio/perlio/locale:univ.utf8] -Duseithreads -Duse64bitall
  [stdio/perlio/locale:univ.utf8] -Duse64bitall
~~ ../cpan/Unicode-Collate/t/loc_fil.t ......................... FAILED 17-19
  [stdio/perlio/locale:univ.utf8] -Duseithreads -Duse64bitall DEBUGGING
  [stdio/perlio/locale:univ.utf8] -Duseithreads -Duse64bitall
  [stdio/perlio/locale:univ.utf8] -Duse64bitall
~~ ../cpan/Memoize/t/expmod_t.t ................................ FAILED 7-9
  [stdio/perlio/locale:univ.utf8] -Duse64bitall DEBUGGING
~~ ../cpan/Unicode-Collate/t/loc_ja.t .......................... FAILED 3-15
  [stdio/perlio/locale:univ.utf8] -Duse64bitall DEBUGGING
~~ ../cpan/Unicode-Collate/t/overcjk1.t ........................ FAILED 13 220
  [stdio/perlio/locale:univ.utf8] -Duseithreads -Duse64bitall DEBUGGING
  [stdio/perlio/locale:univ.utf8] -Duseithreads -Duse64bitall
  [stdio/perlio/locale:univ.utf8] -Duse64bitall
~~ ../cpan/Unicode-Collate/t/loc_hr.t .......................... FAILED 93-103
  [stdio/perlio/locale:univ.utf8] -Duseithreads -Duse64bitall DEBUGGING
  [stdio/perlio/locale:univ.utf8] -Duseithreads -Duse64bitall
  [stdio/perlio/locale:univ.utf8] -Duse64bitall
~~ ../cpan/Unicode-Collate/t/loc_kl.t .......................... FAILED 3-5 81-98
  [stdio/perlio/locale:univ.utf8] -Duse64bitall DEBUGGING
~~ ../cpan/Unicode-Collate/t/ident.t ........................... FAILED 33-48
  [stdio/perlio/locale:univ.utf8] -Duse64bitall DEBUGGING
~~ ../cpan/IO-Compress/t/100generic-gzip.t ..................... FAILED 12-14 Non-zero exit status: 255 Bad plan.  You planned 794 tests but ran 32.
  [stdio/perlio/locale:univ.utf8] -Duseithreads -Duse64bitall DEBUGGING
  [stdio/perlio/locale:univ.utf8] -Duseithreads -Duse64bitall
  [stdio/perlio/locale:univ.utf8] -Duse64bitall DEBUGGING
  [stdio/perlio/locale:univ.utf8] -Duse64bitall
~~ ../cpan/Unicode-Collate/t/loc_sl.t .......................... FAILED 3
  [stdio/perlio/locale:univ.utf8] -Duse64bitall DEBUGGING
~~ ../cpan/IO-Compress/t/104destroy-zip.t ...................... FAILED Non-zero exit status: 2 Bad plan.  You planned 15 tests but ran 4.
  [stdio] -Duse64bitall DEBUGGING
~~ ../cpan/Unicode-Collate/t/loc_zhb5.t ........................ FAILED 281
  [stdio/perlio/locale:univ.utf8] -Duseithreads -Duse64bitall DEBUGGING
  [stdio/perlio/locale:univ.utf8] -Duseithreads -Duse64bitall
  [stdio/perlio/locale:univ.utf8] -Duse64bitall
~~ ../cpan/IO-Compress/t/105oneshot-gzip.t ..................... FAILED Non-zero exit status: 2 Bad plan.  You planned 1002 tests but ran 117.
  [stdio/perlio/locale:univ.utf8] -Duseithreads -Duse64bitall DEBUGGING
  [stdio/perlio/locale:univ.utf8] -Duseithreads -Duse64bitall
  [stdio/perlio/locale:univ.utf8] -Duse64bitall DEBUGGING
  [stdio/perlio/locale:univ.utf8] -Duse64bitall
~~ ../cpan/Unicode-Collate/t/altern.t .......................... FAILED 2
  [stdio/perlio/locale:univ.utf8] -Duseithreads -Duse64bitall DEBUGGING
  [stdio/perlio/locale:univ.utf8] -Duseithreads -Duse64bitall
  [stdio/perlio/locale:univ.utf8] -Duse64bitall
~~ ../cpan/Unicode-Collate/t/loc_cjk.t ......................... FAILED 6-901
  [stdio/perlio/locale:univ.utf8] -Duseithreads -Duse64bitall DEBUGGING
  [stdio/perlio/locale:univ.utf8] -Duseithreads -Duse64bitall
  [stdio/perlio/locale:univ.utf8] -Duse64bitall
~~ ../cpan/Unicode-Collate/t/cjk_b5.t .......................... FAILED 18
  [stdio/perlio/locale:univ.utf8] -Duseithreads -Duse64bitall DEBUGGING
  [stdio/perlio/locale:univ.utf8] -Duseithreads -Duse64bitall
  [stdio/perlio/locale:univ.utf8] -Duse64bitall
~~ ../cpan/Unicode-Collate/t/loc_dsb.t ......................... FAILED 9
  [stdio/perlio/locale:univ.utf8] -Duseithreads -Duse64bitall DEBUGGING
  [stdio/perlio/locale:univ.utf8] -Duseithreads -Duse64bitall
  [stdio/perlio/locale:univ.utf8] -Duse64bitall
~~ ../cpan/Unicode-Collate/t/loc_az.t .......................... FAILED 8
  [stdio/perlio/locale:univ.utf8] -Duseithreads -Duse64bitall DEBUGGING
  [stdio/perlio/locale:univ.utf8] -Duseithreads -Duse64bitall
  [stdio/perlio/locale:univ.utf8] -Duse64bitall
~~ ../cpan/Unicode-Collate/t/cjk_py.t .......................... FAILED 3-4
  [stdio/perlio/locale:univ.utf8] -Duseithreads -Duse64bitall DEBUGGING
  [stdio/perlio/locale:univ.utf8] -Duseithreads -Duse64bitall
  [stdio/perlio/locale:univ.utf8] -Duse64bitall
~~ ../cpan/Encode/t/Unicode.t .................................. FAILED 1-20 Non-zero exit status: 36
  [stdio/perlio/locale:univ.utf8] -Duse64bitall DEBUGGING
~~ ../cpan/Unicode-Collate/t/loc_fr.t .......................... FAILED 4-15
  [stdio/perlio/locale:univ.utf8] -Duse64bitall DEBUGGING
~~ ../cpan/IO-Compress/t/103newtied-deflate.t .................. FAILED 15 57-58 Non-zero exit status: 33
  [stdio/perlio/locale:univ.utf8] -Duseithreads -Duse64bitall DEBUGGING
  [stdio/perlio/locale:univ.utf8] -Duseithreads -Duse64bitall
  [stdio/perlio/locale:univ.utf8] -Duse64bitall DEBUGGING
  [stdio/perlio/locale:univ.utf8] -Duse64bitall
~~ ../cpan/IO-Zlib/t/getline.t ................................. FAILED 4 Non-zero exit status: 255 Bad plan.  You planned 23 tests but ran 4.
  [stdio/perlio/locale:univ.utf8] -Duseithreads -Duse64bitall DEBUGGING
  [stdio/perlio/locale:univ.utf8] -Duseithreads -Duse64bitall
  [stdio/perlio/locale:univ.utf8] -Duse64bitall DEBUGGING
  [stdio/perlio/locale:univ.utf8] -Duse64bitall
~~ ../cpan/Unicode-Collate/t/loc_th.t .......................... FAILED 8
  [stdio/perlio/locale:univ.utf8] -Duse64bitall DEBUGGING
~~ ../cpan/Archive-Tar/t/02_methods.t .......................... FAILED 252 490 742-744 Non-zero exit status: 24
  [stdio/perlio/locale:univ.utf8] -Duseithreads -Duse64bitall DEBUGGING
  [stdio/perlio/locale:univ.utf8] -Duseithreads -Duse64bitall
  [stdio/perlio/locale:univ.utf8] -Duse64bitall DEBUGGING
  [stdio/perlio/locale:univ.utf8] -Duse64bitall
~~ ../cpan/Unicode-Collate/t/loc_cs.t .......................... FAILED 3-4
  [stdio/perlio/locale:univ.utf8] -Duse64bitall DEBUGGING
~~ ../cpan/Unicode-Collate/t/loc_ugcy.t ........................ FAILED 25
  [stdio/perlio/locale:univ.utf8] -Duseithreads -Duse64bitall DEBUGGING
  [stdio/perlio/locale:univ.utf8] -Duseithreads -Duse64bitall
  [stdio/perlio/locale:univ.utf8] -Duse64bitall
~~ ../cpan/Unicode-Collate/t/loc_test.t ........................ FAILED 8 49-52 74 105-106
  [stdio/perlio/locale:univ.utf8] -Duse64bitall DEBUGGING
~~ ../cpan/Unicode-Collate/t/loc_mt.t .......................... FAILED 7
  [stdio/perlio/locale:univ.utf8] -Duseithreads -Duse64bitall DEBUGGING
  [stdio/perlio/locale:univ.utf8] -Duseithreads -Duse64bitall
  [stdio/perlio/locale:univ.utf8] -Duse64bitall
~~ ../cpan/IO-Compress/t/cz-14gzopen.t ......................... FAILED 14 Non-zero exit status: 255 Bad plan.  You planned 264 tests but ran 14.
  [stdio/perlio/locale:univ.utf8] -Duseithreads -Duse64bitall DEBUGGING
  [stdio/perlio/locale:univ.utf8] -Duseithreads -Duse64bitall
  [stdio/perlio/locale:univ.utf8] -Duse64bitall DEBUGGING
  [stdio/perlio/locale:univ.utf8] -Duse64bitall
~~ ../cpan/Unicode-Collate/t/loc_japr.t ........................ FAILED 23-24 149-166
  [stdio/perlio/locale:univ.utf8] -Duse64bitall DEBUGGING

Test todo-passed:
~~ ../dist/Net-Ping/t/450_service.t ............................ PASSED 9
  [stdio/perlio/locale:univ.utf8] 
  [stdio/perlio/locale:univ.utf8] -Duseithreads DEBUGGING
  [stdio/perlio/locale:univ.utf8] -Duseithreads -Duse64bitall DEBUGGING
  [stdio/perlio/locale:univ.utf8] -Duse64bitall DEBUGGING
  [stdio/perlio/locale:univ.utf8]  DEBUGGING
  [stdio/perlio/locale:univ.utf8] -Duseithreads
  [stdio/perlio/locale:univ.utf8] -Duse64bitall
  [stdio/perlio/locale:univ.utf8] -Duseithreads -Duse64bitall
~~ ../lib/B/Deparse.t .......................................... PASSED 2
  [locale:univ.utf8] 
  [locale:univ.utf8] -Duseithreads DEBUGGING
  [locale:univ.utf8] -Duseithreads -Duse64bitall DEBUGGING
  [locale:univ.utf8] -Duse64bitall DEBUGGING
  [locale:univ.utf8]  DEBUGGING
  [locale:univ.utf8] -Duseithreads
  [locale:univ.utf8] -Duse64bitall
  [locale:univ.utf8] -Duseithreads -Duse64bitall

MANIFEST messages:

Compiler messages:
  cc: "try.c", line 56: warning 604: Pointers are not assignment-compatible.
  cc: "try.c", line 56: warning 563: Argument #2 is not the correct type.

About this smoke:
    smoking-perl: 5.14.2
  smoker-version: 1.72_05/0.046
       timestamp: 2018-07-01 20:45:06+00
          tester: merijn

Status overview available here: https://tux.nl/perl5/smoke/
-- 
Report generated by Test::Smoke::Gateway v0.09_01