Automated smoke report for branch blead 5.27.11 patch e39a41302266ba11423cb88bb253d4879250082e v5.27.10-103-ge39a413022
i3: PPC_POWER5 (PPC/1 cpus)
    on        AIX 5.3.0.0/TL12-05
    using     xlc -q32 version 12.1.0.12 (*1)
    using     xlc -q64 version 12.1.0.12 (*2)
    using     xlc_r -q32 version 12.1.0.12 (*3)
    using     xlc_r -q64 version 12.1.0.12 (*4)
    smoketime 1 day 2 hours 58 minutes (average 2 hours 14 minutes)

Summary: FAIL(F)

O = OK  F = Failure(s), extended report at the bottom
X = Failure(s) under TEST but not under harness
? = still running or test results not (yet) available
Build failures during:       - = unknown or N/A
c = Configure, m = make, M = make (after miniperl), t = make test-prep

v5.27.10-103-ge39a413022
---------------------- ----------------------------------------------------
F  F  F  F  F  F         (*1)
F  F  F  F  F  F        -Duse64bitint (*1)
-  -  -  -  -  -        -Duse64bitall (*1)
-  -  -  -  -  -        -Duseithreads (*1)
-  -  -  -  -  -        -Duseithreads -Duse64bitint (*1)
-  -  -  -  -  -        -Duseithreads -Duse64bitall (*1)
-  -  -  -  -  -         (*2)
-  -  -  -  -  -        -Duse64bitint (*2)
F  F  F  F  F  F        -Duse64bitall (*2)
-  -  -  -  -  -        -Duseithreads (*2)
-  -  -  -  -  -        -Duseithreads -Duse64bitint (*2)
-  -  -  -  -  -        -Duseithreads -Duse64bitall (*2)
-  -  -  -  -  -         (*3)
-  -  -  -  -  -        -Duse64bitint (*3)
-  -  -  -  -  -        -Duse64bitall (*3)
F  F  F  F  F  F        -Duseithreads (*3)
F  F  F  F  F  F        -Duseithreads -Duse64bitint (*3)
-  -  -  -  -  -        -Duseithreads -Duse64bitall (*3)
-  -  -  -  -  -         (*4)
-  -  -  -  -  -        -Duse64bitint (*4)
-  -  -  -  -  -        -Duse64bitall (*4)
-  -  -  -  -  -        -Duseithreads (*4)
-  -  -  -  -  -        -Duseithreads -Duse64bitint (*4)
F  F  F  F  F  F        -Duseithreads -Duse64bitall (*4)
|  |  |  |  |  |
|  |  |  |  |  +------  locale:EN_US.UTF-8 DEBUGGING
|  |  |  |  +---------  perlio DEBUGGING
|  |  |  +------------  stdio DEBUGGING
|  |  +---------------  locale:EN_US.UTF-8
|  +------------------  perlio
+---------------------  stdio

Applied patches:
  SMOKEe39a41302266ba11423cb88bb253d4879250082e

Skipped tests:
  None

Test failures:
~~ ../t/re/regexp_trielist.t ................................... FAILED 1987 Non-zero exit status: 255
  [stdio] -Duseithreads -Duse64bitint DEBUGGING
  [stdio] -Duseithreads DEBUGGING
~~ ../t/re/regexp_notrie.t ..................................... FAILED 1987 Non-zero exit status: 255
  [stdio] -Duseithreads -Duse64bitint DEBUGGING
  [stdio] -Duseithreads DEBUGGING
~~ ../t/re/regexp_qr.t ......................................... FAILED 1987 Non-zero exit status: 29
  [perlio/locale:EN_US.UTF-8] -Duseithreads -Duse64bitint DEBUGGING
  [perlio/locale:EN_US.UTF-8] -Duseithreads DEBUGGING
~~ ../t/re/regexp.t ............................................ FAILED 1987 Non-zero exit status: 29
  [perlio/locale:EN_US.UTF-8] -Duseithreads -Duse64bitint DEBUGGING
  [perlio/locale:EN_US.UTF-8] -Duseithreads DEBUGGING
~~ ../ext/XS-APItest/t/utf8_to_bytes.t ......................... FAILED 6-9 Non-zero exit status: 4
  [perlio/locale:EN_US.UTF-8] 
  [stdio/locale:EN_US.UTF-8]  DEBUGGING
  [stdio/perlio] -Duseithreads -Duse64bitint
  [stdio/perlio/locale:EN_US.UTF-8] -Duse64bitint DEBUGGING
  [perlio/locale:EN_US.UTF-8] -Duse64bitint
  [locale:EN_US.UTF-8] -Duseithreads
~~ ../cpan/Encode/t/fallback.t ................................. FAILED 1 Non-zero exit status: 11
  [stdio/perlio] 
  [stdio/perlio]  DEBUGGING
  [stdio/perlio] -Duseithreads -Duse64bitint
  [stdio/perlio] -Duse64bitint DEBUGGING
  [stdio/perlio] -Duse64bitint
  [stdio/perlio] -Duseithreads
~~ ../cpan/IO-Compress/t/cz-08encoding.t ....................... FAILED 7-8 Non-zero exit status: 2
  [stdio/perlio/locale:EN_US.UTF-8] 
  [stdio/perlio/locale:EN_US.UTF-8]  DEBUGGING
  [stdio/perlio/locale:EN_US.UTF-8] -Duseithreads -Duse64bitint
  [stdio/perlio/locale:EN_US.UTF-8] -Duse64bitint DEBUGGING
  [stdio/perlio/locale:EN_US.UTF-8] -Duse64bitint
  [stdio/locale:EN_US.UTF-8] -Duseithreads
~~ ../ext/XS-APItest/t/hash.t .................................. FAILED 968 1101 Non-zero exit status: 255
  [stdio] -Duseithreads -Duse64bitint DEBUGGING
~~ ../t/op/read.t .............................................. FAILED 222 238 Non-zero exit status: 1 Bad plan.  You planned 2116 tests but ran 238.
  [stdio/perlio] 
  [stdio/perlio]  DEBUGGING
  [stdio/perlio] -Duseithreads -Duse64bitint
  [stdio/perlio] -Duse64bitint DEBUGGING
  [stdio/perlio] -Duse64bitint
  [stdio/perlio] -Duseithreads
~~ ../ext/XS-APItest/t/utf8_to_bytes.t ......................... FAILED Non-zero exit status: -1 No plan found in TAP output
  [stdio/perlio/locale:EN_US.UTF-8] -Duseithreads -Duse64bitint DEBUGGING
  [stdio] 
  [stdio/perlio/locale:EN_US.UTF-8] -Duseithreads DEBUGGING
  [perlio]  DEBUGGING
  [locale:EN_US.UTF-8] -Duseithreads -Duse64bitint
  [stdio] -Duse64bitint
  [stdio/perlio] -Duseithreads
~~ ../t/re/regexp_qr.t ......................................... FAILED 1987 Non-zero exit status: 255
  [stdio] -Duseithreads -Duse64bitint DEBUGGING
  [stdio] -Duseithreads DEBUGGING
~~ ../cpan/ExtUtils-MakeMaker/t/03-xsstatic.t .................. FAILED 5 Non-zero exit status: 6
  [stdio/perlio/locale:EN_US.UTF-8] -Duseithreads -Duse64bitint DEBUGGING
  [stdio/perlio/locale:EN_US.UTF-8] 
  [stdio/perlio/locale:EN_US.UTF-8] -Duseithreads DEBUGGING
  [stdio/perlio/locale:EN_US.UTF-8] -Duseithreads -Duse64bitall DEBUGGING
  [stdio/perlio/locale:EN_US.UTF-8] -Duse64bitall DEBUGGING
  [stdio/perlio/locale:EN_US.UTF-8]  DEBUGGING
  [stdio/perlio/locale:EN_US.UTF-8] -Duseithreads -Duse64bitint
  [stdio/perlio/locale:EN_US.UTF-8] -Duse64bitint DEBUGGING
  [stdio/perlio/locale:EN_US.UTF-8] -Duse64bitint
  [stdio/perlio/locale:EN_US.UTF-8] -Duseithreads
  [stdio/perlio/locale:EN_US.UTF-8] -Duseithreads -Duse64bitall
  [stdio/perlio/locale:EN_US.UTF-8] -Duse64bitall
~~ ../cpan/IO-Compress/t/cz-08encoding.t ....................... FAILED Non-zero exit status: -1 Bad plan.  You planned 29 tests but ran 6.
  [stdio/perlio/locale:EN_US.UTF-8] -Duseithreads -Duse64bitint DEBUGGING
  [stdio/perlio/locale:EN_US.UTF-8] -Duseithreads DEBUGGING
~~ ../cpan/JSON-PP/t/zero-mojibake.t ........................... FAILED 1 Non-zero exit status: 1
  [stdio/perlio/locale:EN_US.UTF-8] -Duseithreads -Duse64bitint DEBUGGING
  [stdio/perlio/locale:EN_US.UTF-8] 
  [stdio/perlio/locale:EN_US.UTF-8] -Duseithreads DEBUGGING
  [stdio/perlio/locale:EN_US.UTF-8]  DEBUGGING
  [stdio/perlio/locale:EN_US.UTF-8] -Duseithreads -Duse64bitint
  [stdio/perlio/locale:EN_US.UTF-8] -Duse64bitint DEBUGGING
  [stdio/perlio/locale:EN_US.UTF-8] -Duse64bitint
  [stdio/perlio/locale:EN_US.UTF-8] -Duseithreads
~~ ../dist/Data-Dumper/t/dumper.t .............................. FAILED 385
  [stdio/perlio/locale:EN_US.UTF-8] -Duseithreads -Duse64bitint DEBUGGING
  [stdio/perlio/locale:EN_US.UTF-8] 
  [stdio/perlio/locale:EN_US.UTF-8] -Duseithreads DEBUGGING
  [stdio/perlio/locale:EN_US.UTF-8]  DEBUGGING
  [stdio/perlio/locale:EN_US.UTF-8] -Duseithreads -Duse64bitint
  [stdio/perlio/locale:EN_US.UTF-8] -Duse64bitint DEBUGGING
  [stdio/perlio/locale:EN_US.UTF-8] -Duse64bitint
  [stdio/perlio/locale:EN_US.UTF-8] -Duseithreads
~~ ../t/re/pat_advanced_thr.t .................................. FAILED 304
  [stdio/perlio/locale:EN_US.UTF-8] -Duseithreads -Duse64bitint DEBUGGING
  [stdio/perlio/locale:EN_US.UTF-8] -Duseithreads DEBUGGING
  [stdio/perlio/locale:EN_US.UTF-8] -Duseithreads -Duse64bitint
  [stdio/perlio/locale:EN_US.UTF-8] -Duseithreads
~~ ../cpan/Unicode-Collate/t/index.t ........................... FAILED 10
  [stdio/perlio/locale:EN_US.UTF-8] -Duseithreads -Duse64bitint DEBUGGING
  [stdio/perlio/locale:EN_US.UTF-8] 
  [stdio/perlio/locale:EN_US.UTF-8] -Duseithreads DEBUGGING
  [stdio/perlio/locale:EN_US.UTF-8]  DEBUGGING
  [stdio/perlio/locale:EN_US.UTF-8] -Duseithreads -Duse64bitint
  [stdio/perlio/locale:EN_US.UTF-8] -Duse64bitint DEBUGGING
  [stdio/perlio/locale:EN_US.UTF-8] -Duse64bitint
  [stdio/perlio/locale:EN_US.UTF-8] -Duseithreads
~~ ../t/op/index_thr.t ......................................... FAILED 45-50
  [stdio/perlio/locale:EN_US.UTF-8] -Duseithreads -Duse64bitint DEBUGGING
  [stdio/perlio/locale:EN_US.UTF-8] -Duseithreads DEBUGGING
  [stdio/perlio/locale:EN_US.UTF-8] -Duseithreads -Duse64bitint
  [stdio/perlio/locale:EN_US.UTF-8] -Duseithreads
~~ ../cpan/JSON-PP/t/099_binary.t .............................. FAILED Non-zero exit status: 255 Bad plan.  You planned 2432 tests but ran 234.
  [stdio/perlio/locale:EN_US.UTF-8] -Duseithreads -Duse64bitint DEBUGGING
  [stdio/perlio/locale:EN_US.UTF-8] 
  [stdio/perlio/locale:EN_US.UTF-8] -Duseithreads DEBUGGING
  [stdio/perlio/locale:EN_US.UTF-8]  DEBUGGING
  [stdio/perlio/locale:EN_US.UTF-8] -Duseithreads -Duse64bitint
  [stdio/perlio/locale:EN_US.UTF-8] -Duse64bitint DEBUGGING
  [stdio/perlio/locale:EN_US.UTF-8] -Duse64bitint
  [stdio/perlio/locale:EN_US.UTF-8] -Duseithreads
~~ ../t/re/regexp_nonull.t ..................................... FAILED Non-zero exit status: 255 No plan found in TAP output
  [stdio] -Duseithreads -Duse64bitint DEBUGGING
  [stdio] -Duseithreads DEBUGGING
~~ ../t/op/sprintf2.t .......................................... FAILED 6-8
  [stdio/perlio/locale:EN_US.UTF-8] 
  [stdio/perlio/locale:EN_US.UTF-8]  DEBUGGING
  [stdio/perlio/locale:EN_US.UTF-8] -Duseithreads -Duse64bitint
  [stdio/perlio/locale:EN_US.UTF-8] -Duse64bitint DEBUGGING
  [stdio/perlio/locale:EN_US.UTF-8] -Duse64bitint
  [stdio/perlio/locale:EN_US.UTF-8] -Duseithreads
~~ ../cpan/Encode/t/fallback.t ................................. FAILED 1 Non-zero exit status: 10
  [locale:EN_US.UTF-8] 
  [locale:EN_US.UTF-8]  DEBUGGING
  [locale:EN_US.UTF-8] -Duseithreads -Duse64bitint
  [locale:EN_US.UTF-8] -Duse64bitint DEBUGGING
  [locale:EN_US.UTF-8] -Duse64bitint
  [locale:EN_US.UTF-8] -Duseithreads
~~ ../ext/XS-APItest/t/hash.t .................................. FAILED 947 987 1079 1172 1209 Non-zero exit status: 31
  [stdio] 
~~ ../t/re/regexp_trielist.t ................................... FAILED 1987 Non-zero exit status: 29
  [perlio/locale:EN_US.UTF-8] -Duseithreads -Duse64bitint DEBUGGING
  [perlio/locale:EN_US.UTF-8] -Duseithreads DEBUGGING
~~ ../cpan/Digest-MD5/t/utf8.t ................................. FAILED Non-zero exit status: 2
  [stdio/perlio/locale:EN_US.UTF-8] -Duseithreads -Duse64bitint DEBUGGING
  [stdio/perlio/locale:EN_US.UTF-8] -Duseithreads DEBUGGING
  [stdio] -Duseithreads -Duse64bitint
~~ ../t/op/read.t .............................................. FAILED Non-zero exit status: -1 Bad plan.  You planned 2116 tests but ran 127.
  [stdio] -Duseithreads -Duse64bitint DEBUGGING
  [stdio] -Duseithreads DEBUGGING
~~ ../t/op/tr.t ................................................ FAILED 48-86
  [stdio/perlio/locale:EN_US.UTF-8] -Duseithreads -Duse64bitint DEBUGGING
  [stdio/perlio/locale:EN_US.UTF-8] 
  [stdio/perlio/locale:EN_US.UTF-8] -Duseithreads DEBUGGING
  [stdio/perlio/locale:EN_US.UTF-8]  DEBUGGING
  [stdio/perlio/locale:EN_US.UTF-8] -Duseithreads -Duse64bitint
  [stdio/perlio/locale:EN_US.UTF-8] -Duse64bitint DEBUGGING
  [stdio/perlio/locale:EN_US.UTF-8] -Duse64bitint
  [stdio/perlio/locale:EN_US.UTF-8] -Duseithreads
~~ ../t/op/index.t ............................................. FAILED 45-50
  [stdio/perlio/locale:EN_US.UTF-8] -Duseithreads -Duse64bitint DEBUGGING
  [stdio/perlio/locale:EN_US.UTF-8] 
  [stdio/perlio/locale:EN_US.UTF-8] -Duseithreads DEBUGGING
  [stdio/perlio/locale:EN_US.UTF-8]  DEBUGGING
  [stdio/perlio/locale:EN_US.UTF-8] -Duseithreads -Duse64bitint
  [stdio/perlio/locale:EN_US.UTF-8] -Duse64bitint DEBUGGING
  [stdio/perlio/locale:EN_US.UTF-8] -Duse64bitint
  [stdio/perlio/locale:EN_US.UTF-8] -Duseithreads
~~ ../ext/XS-APItest/t/hash.t .................................. FAILED Non-zero exit status: -1 No plan found in TAP output
  [stdio/perlio/locale:EN_US.UTF-8] -Duseithreads DEBUGGING
~~ ../t/op/sprintf2.t .......................................... FAILED Non-zero exit status: -1 No plan found in TAP output
  [stdio/perlio/locale:EN_US.UTF-8] -Duseithreads -Duse64bitint DEBUGGING
  [stdio/perlio/locale:EN_US.UTF-8] -Duseithreads DEBUGGING
~~ ../t/re/regexp_noamp.t ...................................... FAILED 1987 Non-zero exit status: 255
  [stdio] -Duseithreads -Duse64bitint DEBUGGING
  [stdio] -Duseithreads DEBUGGING
~~ ../cpan/Encode/t/fallback.t ................................. FAILED 1 Non-zero exit status: 255
  [stdio/perlio/locale:EN_US.UTF-8] -Duseithreads -Duse64bitint DEBUGGING
  [stdio/perlio/locale:EN_US.UTF-8] -Duseithreads DEBUGGING
~~ ../t/uni/overload.t ......................................... FAILED 156 Non-zero exit status: 255 Bad plan.  You planned 217 tests but ran 156.
  [stdio/perlio/locale:EN_US.UTF-8] 
  [stdio/perlio/locale:EN_US.UTF-8]  DEBUGGING
  [stdio/perlio/locale:EN_US.UTF-8] -Duseithreads -Duse64bitint
  [stdio/perlio/locale:EN_US.UTF-8] -Duse64bitint DEBUGGING
  [stdio/perlio/locale:EN_US.UTF-8] -Duse64bitint
  [stdio/perlio/locale:EN_US.UTF-8] -Duseithreads
~~ ../t/re/regexp_notrie.t ..................................... FAILED 1987 Non-zero exit status: 29
  [perlio/locale:EN_US.UTF-8] -Duseithreads -Duse64bitint DEBUGGING
  [perlio/locale:EN_US.UTF-8] -Duseithreads DEBUGGING
~~ ../t/uni/overload.t ......................................... FAILED 156 Non-zero exit status: -1 Bad plan.  You planned 217 tests but ran 156.
  [stdio/perlio/locale:EN_US.UTF-8] -Duseithreads -Duse64bitint DEBUGGING
  [stdio/perlio/locale:EN_US.UTF-8] -Duseithreads DEBUGGING
~~ ../ext/XS-APItest/t/hash.t .................................. FAILED Non-zero exit status: 1 No plan found in TAP output
  [perlio/locale:EN_US.UTF-8] 
  [stdio/locale:EN_US.UTF-8]  DEBUGGING
  [stdio/perlio/locale:EN_US.UTF-8] -Duseithreads -Duse64bitint
  [stdio/perlio/locale:EN_US.UTF-8] -Duse64bitint DEBUGGING
  [stdio/perlio/locale:EN_US.UTF-8] -Duse64bitint
  [stdio/perlio/locale:EN_US.UTF-8] -Duseithreads
~~ ../cpan/Unicode-Collate/t/loc_test.t ........................ FAILED 104
  [stdio/perlio/locale:EN_US.UTF-8] -Duseithreads -Duse64bitint DEBUGGING
  [stdio/perlio/locale:EN_US.UTF-8] 
  [stdio/perlio/locale:EN_US.UTF-8] -Duseithreads DEBUGGING
  [stdio/perlio/locale:EN_US.UTF-8]  DEBUGGING
  [stdio/perlio/locale:EN_US.UTF-8] -Duseithreads -Duse64bitint
  [stdio/perlio/locale:EN_US.UTF-8] -Duse64bitint DEBUGGING
  [stdio/perlio/locale:EN_US.UTF-8] -Duse64bitint
  [stdio/perlio/locale:EN_US.UTF-8] -Duseithreads
~~ ../dist/base/t/base-open-line.t ............................. FAILED 14 Non-zero exit status: 1
  [stdio/perlio/locale:EN_US.UTF-8] -Duseithreads -Duse64bitint DEBUGGING
  [stdio/perlio/locale:EN_US.UTF-8] 
  [stdio/perlio/locale:EN_US.UTF-8] -Duseithreads DEBUGGING
  [stdio/perlio/locale:EN_US.UTF-8]  DEBUGGING
  [stdio/perlio/locale:EN_US.UTF-8] -Duseithreads -Duse64bitint
  [stdio/perlio/locale:EN_US.UTF-8] -Duse64bitint DEBUGGING
  [stdio/perlio/locale:EN_US.UTF-8] -Duse64bitint
  [stdio/perlio/locale:EN_US.UTF-8] -Duseithreads
~~ ../t/re/pat_advanced.t ...................................... FAILED 304
  [stdio/perlio/locale:EN_US.UTF-8] -Duseithreads -Duse64bitint DEBUGGING
  [stdio/perlio/locale:EN_US.UTF-8] 
  [stdio/perlio/locale:EN_US.UTF-8] -Duseithreads DEBUGGING
  [stdio/perlio/locale:EN_US.UTF-8]  DEBUGGING
  [stdio/perlio/locale:EN_US.UTF-8] -Duseithreads -Duse64bitint
  [stdio/perlio/locale:EN_US.UTF-8] -Duse64bitint DEBUGGING
  [stdio/perlio/locale:EN_US.UTF-8] -Duse64bitint
  [stdio/perlio/locale:EN_US.UTF-8] -Duseithreads
~~ ../t/re/regexp_nonull.t ..................................... FAILED Non-zero exit status: 29 No plan found in TAP output
  [perlio/locale:EN_US.UTF-8] -Duseithreads -Duse64bitint DEBUGGING
  [perlio/locale:EN_US.UTF-8] -Duseithreads DEBUGGING
~~ ../t/re/regexp_qr_embed_thr.t ............................... FAILED 1987 Non-zero exit status: -1 No plan found in TAP output
  [stdio/perlio/locale:EN_US.UTF-8] -Duseithreads -Duse64bitint DEBUGGING
  [stdio/perlio/locale:EN_US.UTF-8] -Duseithreads DEBUGGING
~~ ../t/op/write.t ............................................. FAILED Non-zero exit status: -1 No plan found in TAP output
  [stdio/perlio/locale:EN_US.UTF-8] -Duseithreads -Duse64bitint DEBUGGING
  [stdio/perlio] 
  [stdio/perlio/locale:EN_US.UTF-8] -Duseithreads DEBUGGING
  [stdio/perlio]  DEBUGGING
  [stdio/perlio] -Duse64bitint DEBUGGING
  [stdio/perlio] -Duse64bitint
~~ ../ext/XS-APItest/t/utf8.t .................................. FAILED 57 Non-zero exit status: 254
  [stdio/perlio/locale:EN_US.UTF-8] -Duseithreads -Duse64bitint DEBUGGING
  [stdio/perlio/locale:EN_US.UTF-8] 
  [stdio/perlio/locale:EN_US.UTF-8] -Duseithreads DEBUGGING
  [stdio/perlio/locale:EN_US.UTF-8]  DEBUGGING
  [stdio/perlio/locale:EN_US.UTF-8] -Duseithreads -Duse64bitint
  [stdio/perlio/locale:EN_US.UTF-8] -Duse64bitint DEBUGGING
  [stdio/perlio/locale:EN_US.UTF-8] -Duse64bitint
  [stdio/perlio/locale:EN_US.UTF-8] -Duseithreads
~~ ../cpan/IO-Compress/t/cz-08encoding.t ....................... FAILED 7-8 Non-zero exit status: -1 Bad plan.  You planned 29 tests but ran 10.
  [perlio] -Duseithreads
~~ ../t/re/regexp.t ............................................ FAILED 1987 Non-zero exit status: 255
  [stdio] -Duseithreads -Duse64bitint DEBUGGING
  [stdio] -Duseithreads DEBUGGING
~~ ../ext/XS-APItest/t/hash.t .................................. FAILED 935 984 1172 1209 Non-zero exit status: 29
  [locale:EN_US.UTF-8] -Duseithreads -Duse64bitint DEBUGGING
~~ ../t/op/read.t .............................................. FAILED 158 174 Non-zero exit status: 1 Bad plan.  You planned 2116 tests but ran 174.
  [locale:EN_US.UTF-8] 
  [locale:EN_US.UTF-8]  DEBUGGING
  [locale:EN_US.UTF-8] -Duseithreads -Duse64bitint
  [locale:EN_US.UTF-8] -Duse64bitint DEBUGGING
  [locale:EN_US.UTF-8] -Duse64bitint
  [locale:EN_US.UTF-8] -Duseithreads
~~ ../dist/base/t/base-open-chunk.t ............................ FAILED 14 Non-zero exit status: 1
  [stdio/perlio/locale:EN_US.UTF-8] -Duseithreads -Duse64bitint DEBUGGING
  [stdio/perlio/locale:EN_US.UTF-8] 
  [stdio/perlio/locale:EN_US.UTF-8] -Duseithreads DEBUGGING
  [stdio/perlio/locale:EN_US.UTF-8]  DEBUGGING
  [stdio/perlio/locale:EN_US.UTF-8] -Duseithreads -Duse64bitint
  [stdio/perlio/locale:EN_US.UTF-8] -Duse64bitint DEBUGGING
  [stdio/perlio/locale:EN_US.UTF-8] -Duse64bitint
  [stdio/perlio/locale:EN_US.UTF-8] -Duseithreads
~~ ../t/re/regexp_noamp.t ...................................... FAILED 1987 Non-zero exit status: 29
  [perlio/locale:EN_US.UTF-8] -Duseithreads -Duse64bitint DEBUGGING
  [perlio/locale:EN_US.UTF-8] -Duseithreads DEBUGGING
~~ ../ext/XS-APItest/t/hash.t .................................. FAILED 950 990 Non-zero exit status: -1 No plan found in TAP output
  [perlio] -Duseithreads -Duse64bitint DEBUGGING
~~ ../t/re/regexp_qr_embed.t ................................... FAILED 1987 Non-zero exit status: 255
  [stdio] -Duseithreads -Duse64bitint DEBUGGING
  [stdio] -Duseithreads DEBUGGING
~~ ../t/re/regexp_qr_embed.t ................................... FAILED 1987 Non-zero exit status: 29
  [perlio/locale:EN_US.UTF-8] -Duseithreads -Duse64bitint DEBUGGING
  [perlio/locale:EN_US.UTF-8] -Duseithreads DEBUGGING
~~ ../ext/XS-APItest/t/hash.t .................................. FAILED 935 987 1190 Non-zero exit status: 16
  [perlio]  DEBUGGING
~~ ../lib/feature/unicode_strings.t ............................ FAILED 5845 11775
  [stdio/perlio/locale:EN_US.UTF-8] 
  [stdio/perlio/locale:EN_US.UTF-8] -Duseithreads -Duse64bitint
  [stdio/perlio/locale:EN_US.UTF-8] -Duse64bitint
  [stdio/perlio/locale:EN_US.UTF-8] -Duseithreads
~~ ../lib/feature/unicode_strings.t ............................ FAILED 5845 Non-zero exit status: -1 Bad plan.  You planned 20736 tests but ran 9066.
  [stdio/perlio/locale:EN_US.UTF-8] -Duseithreads -Duse64bitint DEBUGGING
  [stdio/perlio/locale:EN_US.UTF-8] -Duseithreads DEBUGGING
  [stdio/perlio/locale:EN_US.UTF-8]  DEBUGGING
  [stdio/perlio/locale:EN_US.UTF-8] -Duse64bitint DEBUGGING
~~ ../t/op/read.t .............................................. FAILED Non-zero exit status: -1 No plan found in TAP output
  [perlio/locale:EN_US.UTF-8] -Duseithreads -Duse64bitint DEBUGGING
  [perlio/locale:EN_US.UTF-8] -Duseithreads DEBUGGING
~~ ../ext/XS-APItest/t/fetch_pad_names.t ....................... FAILED Non-zero exit status: -1 No plan found in TAP output
  [stdio/perlio/locale:EN_US.UTF-8] -Duseithreads -Duse64bitint DEBUGGING
  [stdio/perlio/locale:EN_US.UTF-8] -Duseithreads DEBUGGING

Test todo-passed:
~~ ../cpan/Encode/t/truncated_utf8.t ........................... PASSED 9
  [stdio/perlio/locale:EN_US.UTF-8] -Duseithreads -Duse64bitint DEBUGGING
  [stdio/perlio/locale:EN_US.UTF-8] 
  [stdio/perlio/locale:EN_US.UTF-8] -Duseithreads DEBUGGING
  [stdio/perlio/locale:EN_US.UTF-8] -Duseithreads -Duse64bitall DEBUGGING
  [stdio/perlio/locale:EN_US.UTF-8] -Duse64bitall DEBUGGING
  [stdio/perlio/locale:EN_US.UTF-8]  DEBUGGING
  [stdio/perlio/locale:EN_US.UTF-8] -Duseithreads -Duse64bitint
  [stdio/perlio/locale:EN_US.UTF-8] -Duse64bitint DEBUGGING
  [stdio/perlio/locale:EN_US.UTF-8] -Duse64bitint
  [stdio/perlio/locale:EN_US.UTF-8] -Duseithreads
  [stdio/perlio/locale:EN_US.UTF-8] -Duseithreads -Duse64bitall
  [stdio/perlio/locale:EN_US.UTF-8] -Duse64bitall
~~ ../lib/B/Deparse.t .......................................... PASSED 2
  [locale:EN_US.UTF-8] -Duseithreads -Duse64bitint DEBUGGING
  [locale:EN_US.UTF-8] 
  [locale:EN_US.UTF-8] -Duseithreads DEBUGGING
  [locale:EN_US.UTF-8] -Duseithreads -Duse64bitall DEBUGGING
  [locale:EN_US.UTF-8] -Duse64bitall DEBUGGING
  [locale:EN_US.UTF-8]  DEBUGGING
  [locale:EN_US.UTF-8] -Duseithreads -Duse64bitint
  [locale:EN_US.UTF-8] -Duse64bitint DEBUGGING
  [locale:EN_US.UTF-8] -Duse64bitint
  [locale:EN_US.UTF-8] -Duseithreads
  [locale:EN_US.UTF-8] -Duseithreads -Duse64bitall
  [locale:EN_US.UTF-8] -Duse64bitall

MANIFEST messages:
  MANIFEST did not declare 'rm.sh'
  MANIFEST did not declare 'rmf.sh'

Compiler messages:
  "pp_sys.c", line 3246.22: 1506-280 (W) Function argument assignment between types "char*" and "const char*" is not allowed.

About this smoke:
    smoking-perl: 5.14.2
  smoker-version: 1.72/0.046
       timestamp: 2018-04-05 00:58:13+00
          tester: merijn

Status overview available here: https://tux.nl/perl5/smoke/
-- 
Report generated by Test::Smoke::Gateway v0.09_01