Automated smoke report for branch blead 5.27.10 patch 6c34d5cdcda529066016688302cf91b9f1642ee3 v5.27.9-162-g6c34d5cdcd
cjg-netbsd6: Intel 686-class (amd64/1 cpus)
    on        netbsd 6.1.5
    using     cc version 4.5.3 (*1)
    smoketime 7 hours 10 minutes (average 53 minutes 47 seconds)

Summary: FAIL(F)

O = OK  F = Failure(s), extended report at the bottom
X = Failure(s) under TEST but not under harness
? = still running or test results not (yet) available
Build failures during:       - = unknown or N/A
c = Configure, m = make, M = make (after miniperl), t = make test-prep

v5.27.9-162-g6c34d5cdcd
---------------------- ----------------------------------------------------
F  F                     (*1)
F  F                    -Duse64bitall (*1)
F  F                    -Duseithreads (*1)
F  F                    -Duseithreads -Duse64bitall (*1)
|  |
|  +------------------  stdio DEBUGGING
+---------------------  stdio

Applied patches:
  SMOKE6c34d5cdcda529066016688302cf91b9f1642ee3

Skipped tests:
      # One test name on a line

Test failures:
~~ ../lib/File/Copy.t .......................................... FAILED Non-zero exit status: 2 Bad plan.  You planned 466 tests but ran 15.
  [stdio] 
  [stdio] -Duseithreads DEBUGGING
  [stdio] -Duseithreads -Duse64bitall DEBUGGING
  [stdio] -Duse64bitall DEBUGGING
  [stdio]  DEBUGGING
  [stdio] -Duseithreads
  [stdio] -Duse64bitall
  [stdio] -Duseithreads -Duse64bitall
~~ ../ext/I18N-Langinfo/t/Langinfo.t ........................... FAILED 86-89 Non-zero exit status: 4
  [stdio] 
  [stdio] -Duseithreads DEBUGGING
  [stdio] -Duseithreads -Duse64bitall DEBUGGING
  [stdio] -Duse64bitall DEBUGGING
  [stdio]  DEBUGGING
  [stdio] -Duseithreads
  [stdio] -Duse64bitall
  [stdio] -Duseithreads -Duse64bitall

Test todo-passed:
~~ ../lib/locale.t ............................................. PASSED 701
  [stdio] 
  [stdio] -Duseithreads DEBUGGING
  [stdio] -Duseithreads -Duse64bitall DEBUGGING
  [stdio] -Duse64bitall DEBUGGING
  [stdio]  DEBUGGING
  [stdio] -Duseithreads
  [stdio] -Duse64bitall
  [stdio] -Duseithreads -Duse64bitall
~~ ../cpan/Encode/t/truncated_utf8.t ........................... PASSED 9
  [stdio] 
  [stdio] -Duseithreads DEBUGGING
  [stdio] -Duseithreads -Duse64bitall DEBUGGING
  [stdio] -Duse64bitall DEBUGGING
  [stdio]  DEBUGGING
  [stdio] -Duseithreads
  [stdio] -Duse64bitall
  [stdio] -Duseithreads -Duse64bitall

MANIFEST messages:

Compiler messages:
  op.c: In function 'S_gen_constant_list':
  op.c:5659:31: warning: argument 'o' might be clobbered by 'longjmp' or 'vfork'
  toke.c: In function 'Perl_scan_num':
  toke.c:11121:24: warning: 'b' may be used uninitialized in this function
  pp.c: In function 'Perl_pp_argelem':
  pp.c:6782:13: warning: value computed is not used
  pp_sys.c: In function 'Perl_pp_stat':
  pp_sys.c:2997:6: warning: comparison of unsigned expression < 0 is always false
  doio.c: In function 'S_argvout_free':
  doio.c:1195:17: warning: implicit declaration of function 'unlinkat'
  doio.c: In function 'Perl_do_close':
  doio.c:1612:21: warning: implicit declaration of function 'linkat'
  doio.c:1625:25: warning: implicit declaration of function 'renameat'
  doio.c: In function 'Perl_do_msgsnd':
  doio.c:3027:25: warning: defining a type in a cast is invalid in C++
  doio.c: In function 'Perl_do_msgrcv':
  doio.c:3065:26: warning: defining a type in a cast is invalid in C++
  perl.h:6730:19: warning: non-local variable 'PL_inf' with anonymous type is questionable in C++
  perl.h:6766:19: warning: non-local variable 'PL_nan' with anonymous type is questionable in C++
  perlio.c: In function 'PerlIOStdio_set_ptrcnt':
  perlio.c:3599:2: warning: pointer targets in assignment differ in signedness
  /usr/include/sys/cdefs_elf.h:67:20: error: missing binary operator before token "("
  /usr/include/sys/cdefs_elf.h:73:20: error: missing binary operator before token "("
  RealPPPort.xs: In function 'XS_Devel__PPPort_check_HeUTF8':
  RealPPPort.xs:1817:17: warning: value computed is not used
  POSIX.xs:1062:11: warning: 'my_rint' defined but not used
  const-c.inc: In function 'constant_19':
  const-c.inc:351:42: warning: unused parameter 'iv_return'
  shared.xs: In function 'sharedsv_array_mg_CLEAR':
  shared.xs:1103:17: warning: 'iter' may be used uninitialized in this function

About this smoke:
    smoking-perl: 5.26.1
  smoker-version: 1.71/0.046
       timestamp: 2018-03-13 09:59:47+00
          tester: core

-- 
Report generated by Test::Smoke::Gateway v0.09