Show logfile
Automated smoke report for branch blead 5.27.9 patch f4e72dbfa4b0d957dd2dcfcf63b615ddd38ae786 v5.27.8-150-gf4e72db
nereid: i86pc (3011MHz) (i386/1 cpus)
    on        Solaris 2.11
    using     /opt/solarisstudio12.3/bin/cc version Sun C 5.12 SunOS_i386 2011/11/16 (*1)
    smoketime 14 hours 21 minutes (average 53 minutes 51 seconds)

Summary: FAIL(F)

O = OK  F = Failure(s), extended report at the bottom
X = Failure(s) under TEST but not under harness
? = still running or test results not (yet) available
Build failures during:       - = unknown or N/A
c = Configure, m = make, M = make (after miniperl), t = make test-prep

v5.27.8-150-gf4e72db
---------------------- ----------------------------------------------------
O  O  O  O              -Dmake=gmake (*1)
O  O  O  O              -Dmake=gmake -Dusedtrace -Duseshrplib (*1)
F  O  O  O              -Dmake=gmake -Dusemorebits (*1)
O  O  O  O              -Dmake=gmake -Duse64bitall (*1)
O  O  O  O              -Dmake=gmake -Duseithreads (*1)
O  O  O  F              -Dmake=gmake -Duseithreads -Dusedtrace -Duseshrplib (*1)
O  O  O  O              -Dmake=gmake -Duseithreads -Dusemorebits (*1)
F  O  O  O              -Dmake=gmake -Duseithreads -Duse64bitall (*1)
|  |  |  |
|  |  |  +------------  perlio DEBUGGING
|  |  +---------------  stdio DEBUGGING
|  +------------------  perlio
+---------------------  stdio

Applied patches:
  SMOKEf4e72dbfa4b0d957dd2dcfcf63b615ddd38ae786

Skipped tests:
  None

Test failures:
~~ ../t/uni/attrs.t ............................................ FAILED No plan found in TAP output
  [stdio] -Dmake=gmake -Dusemorebits
~~ ../dist/threads-shared/t/waithires.t ........................ FAILED Non-zero exit status: 1 Bad plan.  You planned 63 tests but ran 12.
  [perlio] -Dmake=gmake -Duseithreads -Dusedtrace -Duseshrplib DEBUGGING
~~ ../dist/threads-shared/t/waithires.t ........................ FAILED Non-zero exit status: 1 Bad plan.  You planned 63 tests but ran 6.
  [stdio] -Dmake=gmake -Duseithreads -Duse64bitall

Test todo-passed:

MANIFEST messages:

Compiler messages:
  "try.c", line 17: warning: statement not reached
  "try.c", line 66: warning: statement not reached
  "inline.h", line 1293: warning: statement not reached
  "inline.h", line 1330: warning: statement not reached
  "inline.h", line 1337: warning: statement not reached
  "inline.h", line 1377: warning: statement not reached
  "pp_sys.c", line 4569: warning: statement not reached
  "../../inline.h", line 1293: warning: statement not reached
  "../../inline.h", line 1330: warning: statement not reached
  "../../inline.h", line 1337: warning: statement not reached
  "../../inline.h", line 1377: warning: statement not reached
  "bzlib.c", line 868: warning: statement not reached
  "Cwd.xs", line 20: warning: macro redefined: SYSNAME
  "../../../inline.h", line 1293: warning: statement not reached
  "../../../inline.h", line 1330: warning: statement not reached
  "../../../inline.h", line 1337: warning: statement not reached
  "../../../inline.h", line 1377: warning: statement not reached
  "POSIX.c", line 4068: warning: statement not reached
  "POSIX.c", line 4428: warning: statement not reached
  "Piece.c", line 1202: warning: statement not reached
  "Piece.c", line 1261: warning: statement not reached
  "Piece.c", line 1306: warning: statement not reached
  "Piece.c", line 1347: warning: statement not reached
  "../../../../inline.h", line 1293: warning: statement not reached
  "../../../../inline.h", line 1330: warning: statement not reached
  "../../../../inline.h", line 1337: warning: statement not reached
  "../../../../inline.h", line 1377: warning: statement not reached
  "/export/home/perlsmok/smoke-me/perl-current/inline.h", line 1293: warning: statement not reached
  "/export/home/perlsmok/smoke-me/perl-current/inline.h", line 1330: warning: statement not reached
  "/export/home/perlsmok/smoke-me/perl-current/inline.h", line 1337: warning: statement not reached
  "/export/home/perlsmok/smoke-me/perl-current/inline.h", line 1377: warning: statement not reached
  "../inline.h", line 1293: warning: statement not reached
  "../inline.h", line 1330: warning: statement not reached
  "../inline.h", line 1337: warning: statement not reached
  "../inline.h", line 1377: warning: statement not reached
  "B.c", line 1138: warning: statement not reached
  "APItest.c", line 6223: warning: statement not reached
  "threads.xs", line 1033: warning: statement not reached
  "shared.xs", line 671: warning: statement not reached

About this smoke:
    smoking-perl: 5.16.1
  smoker-version: 1.53/0.045
       timestamp: 2018-02-13 18:09:51+00
          tester: perlsmok

UUID: 125F1F4A-10E9-11E8-9176-F6CDCCEE2131
Branch: smoke-me/leont/less-fragile-encoding
Config: default
Logs: http://perl.develop-help.com/reports/
-- 
Report generated by Test::Smoke::Gateway v0.09_01