Automated smoke report for branch smoke-me/khw-locale 5.27.9 patch ef18c48e28ace57aafd2f12e3a1dfce3f9a040f0 v5.27.8-278-gef18c48e28
cjg-freebsd11: Intel(R) Xeon(R) CPU           E5420  @ 2.50GHz (amd64/1 cpus)
    on        freebsd 11.1-RELEASE-p4
    using     cc version 4.2.1 Compatible FreeBSD Clang 4.0.0 (tags/RELEASE_400/final 297347) (*1)
    smoketime 3 hours 31 minutes (average 26 minutes 27 seconds)

Summary: FAIL(Fm)

O = OK  F = Failure(s), extended report at the bottom
X = Failure(s) under TEST but not under harness
? = still running or test results not (yet) available
Build failures during:       - = unknown or N/A
c = Configure, m = make, M = make (after miniperl), t = make test-prep

v5.27.8-278-gef18c48e28
---------------------- ----------------------------------------------------
m  m                     (*1)
m  m                    -Duse64bitall (*1)
F  F                    -Duseithreads (*1)
F  F                    -Duseithreads -Duse64bitall (*1)
|  |
|  +------------------  stdio DEBUGGING
+---------------------  stdio

Applied patches:
  SMOKEef18c48e28ace57aafd2f12e3a1dfce3f9a040f0

Skipped tests:
      # One test name on a line

Test failures:
~~ ../t/run/locale.t ........................................... FAILED 7-8
  [stdio] -Duseithreads DEBUGGING
  [stdio] -Duseithreads -Duse64bitall DEBUGGING
  [stdio] -Duseithreads -Duse64bitall
  [stdio] -Duseithreads

Test todo-passed:
~~ ../cpan/Encode/t/truncated_utf8.t ........................... PASSED 9
  [stdio] -Duseithreads DEBUGGING
  [stdio] -Duseithreads -Duse64bitall DEBUGGING
  [stdio] -Duseithreads -Duse64bitall
  [stdio] -Duseithreads

MANIFEST messages:

Compiler messages:
  perl.c:1173:9: error: use of undeclared identifier 'PL_setlocale_buf'
  perl.c:1174:18: error: use of undeclared identifier 'PL_setlocale_buf'
  perl.c:1175:9: error: use of undeclared identifier 'PL_setlocale_buf'

About this smoke:
    smoking-perl: 5.26.1
  smoker-version: 1.71/0.046
       timestamp: 2018-02-13 23:24:21+00
          tester: core

-- 
Report generated by Test::Smoke::Gateway v0.09_01