Automated smoke report for branch smoke-me/khw-locale 5.27.9 patch f72d562bdeeec2ec84ec14d44a2336598df62fcd v5.27.8-181-gf72d562bde
cjg-arch: Intel(R) Xeon(R) CPU E5420 @ 2.50GHz (GenuineIntel 2500MHz) (x86_64/1 cpus)
    on        linux 4.14.15-1-ARCH [Arch Linux]
    using     cc version 7.3.0 (*1)
    smoketime 41 minutes 53 seconds (average 5 minutes 14 seconds)

Summary: FAIL(m)

O = OK  F = Failure(s), extended report at the bottom
X = Failure(s) under TEST but not under harness
? = still running or test results not (yet) available
Build failures during:       - = unknown or N/A
c = Configure, m = make, M = make (after miniperl), t = make test-prep

v5.27.8-181-gf72d562bde
---------------------- ----------------------------------------------------
m  m                     (*1)
m  m                    -Duse64bitall (*1)
m  m                    -Duseithreads (*1)
m  m                    -Duseithreads -Duse64bitall (*1)
|  |
|  +------------------  stdio DEBUGGING
+---------------------  stdio

Applied patches:
  SMOKEf72d562bdeeec2ec84ec14d44a2336598df62fcd

Skipped tests:
      # One test name on a line

Test failures:

Test todo-passed:

MANIFEST messages:

Compiler messages:
  op.c: In function 'S_fold_constants':
  op.c:5470:34: warning: argument 'o' might be clobbered by 'longjmp' or 'vfork' [-Wclobbered]
  vutil.c: In function 'Perl_upg_version':
  vutil.c:724:5: error: expected '}' before 'else'
  vutil.c:703:17: warning: 'locale_name_on_entry' may be used uninitialized in this function [-Wmaybe-uninitialized]
  numeric.c: In function 'Perl_my_atof2':
  numeric.c:1315:16: warning: argument 1 null where non-null expected [-Wnonnull]
  /usr/include/stdlib.h:117:15: note: in a call to function 'strtod' declared here
  locale.c: In function 'S_emulate_setlocale':
  perl.h:174:16: error: 'my_perl' undeclared (first use in this function); did you mean 'my_fork'?
  embed.h:901:45: note: in expansion of macro 'aTHX'
  perl.h:3845:26: note: in expansion of macro 'PerlIO_stderr'
  locale.c:538:23: note: in expansion of macro 'Perl_debug_log'
  perl.h:174:16: note: each undeclared identifier is reported only once for each function it appears in
  locale.c:539:9: warning: implicit declaration of function 'dump_c_backtrace'; did you mean 'Perl_ck_backtick'? [-Wimplicit-function-declaration]
  perl.h:3408:36: error: bit-field '__error_if_negative' width not an integer constant
  perl.h:3424:52: note: in expansion of macro 'STATIC_ASSERT_DECL'
  locale.c:599:9: note: in expansion of macro 'STATIC_ASSERT_STMT'
  locale.c:779:17: error: ISO C90 forbids mixed declarations and code [-Werror=declaration-after-statement]
  locale.c: In function 'Perl__is_cur_LC_category_utf8':
  locale.c:4266:17: warning: variable 'save_errno' set but not used [-Wunused-but-set-variable]

About this smoke:
    smoking-perl: 5.26.1
  smoker-version: 1.71/0.046
       timestamp: 2018-02-07 16:05:13+00
          tester: core

-- 
Report generated by Test::Smoke::Gateway v0.09_01