Show logfile
Automated smoke report for branch blead 5.27.7 patch 660e06474df961abac1b2c35aeccdd1557cf6937 v5.27.6-121-g660e064
nereid: i86pc (3013MHz) (i386/1 cpus)
    on        Solaris 2.11
    using     /opt/solarisstudio12.3/bin/cc version Sun C 5.12 SunOS_i386 2011/11/16 (*1)
    smoketime 14 hours 40 minutes (average 55 minutes 2 seconds)

Summary: FAIL(F)

O = OK  F = Failure(s), extended report at the bottom
X = Failure(s) under TEST but not under harness
? = still running or test results not (yet) available
Build failures during:       - = unknown or N/A
c = Configure, m = make, M = make (after miniperl), t = make test-prep

v5.27.6-121-g660e064
---------------------- ----------------------------------------------------
O  F  O  F              -Dmake=gmake (*1)
O  O  O  O              -Dmake=gmake -Dusedtrace -Duseshrplib (*1)
O  F  O  O              -Dmake=gmake -Dusemorebits (*1)
O  O  O  O              -Dmake=gmake -Duse64bitall (*1)
O  O  O  O              -Dmake=gmake -Duseithreads (*1)
F  O  O  O              -Dmake=gmake -Duseithreads -Dusedtrace -Duseshrplib (*1)
O  O  F  F              -Dmake=gmake -Duseithreads -Dusemorebits (*1)
O  O  O  F              -Dmake=gmake -Duseithreads -Duse64bitall (*1)
|  |  |  |
|  |  |  +------------  perlio DEBUGGING
|  |  +---------------  stdio DEBUGGING
|  +------------------  perlio
+---------------------  stdio

Applied patches:
  SMOKE660e06474df961abac1b2c35aeccdd1557cf6937

Skipped tests:
  None

Test failures:
~~ ../ext/XS-APItest/t/utf8.t .................................. FAILED No plan found in TAP output
  [stdio/perlio] -Dmake=gmake -Duseithreads -Dusemorebits DEBUGGING
~~ ../dist/Time-HiRes/t/alarm.t ................................ FAILED 2 Non-zero exit status: 1
  [perlio] -Dmake=gmake -Dusemorebits
~~ ../t/uni/attrs.t ............................................ FAILED No plan found in TAP output
  [perlio] -Dmake=gmake
~~ ../dist/threads-shared/t/waithires.t ........................ FAILED Non-zero exit status: 1 Bad plan.  You planned 63 tests but ran 12.
  [stdio] -Dmake=gmake -Duseithreads -Dusedtrace -Duseshrplib
~~ ../dist/Attribute-Handlers/t/multi.t ........................ FAILED No plan found in TAP output
  [perlio] -Dmake=gmake DEBUGGING
~~ ../dist/threads-shared/t/waithires.t ........................ FAILED Non-zero exit status: 1 Bad plan.  You planned 63 tests but ran 6.
  [perlio] -Dmake=gmake -Duseithreads -Duse64bitall DEBUGGING

Test todo-passed:

MANIFEST messages:

Compiler messages:
  "try.c", line 17: warning: statement not reached
  "try.c", line 66: warning: statement not reached
  "pp_sys.c", line 4567: warning: statement not reached
  "bzlib.c", line 868: warning: statement not reached
  "Cwd.xs", line 20: warning: macro redefined: SYSNAME
  "POSIX.c", line 4042: warning: statement not reached
  "POSIX.c", line 4402: warning: statement not reached
  "Piece.c", line 1202: warning: statement not reached
  "Piece.c", line 1261: warning: statement not reached
  "Piece.c", line 1306: warning: statement not reached
  "Piece.c", line 1347: warning: statement not reached
  "B.c", line 1138: warning: statement not reached
  "APItest.c", line 6152: warning: statement not reached

About this smoke:
    smoking-perl: 5.16.1
  smoker-version: 1.53/0.045
       timestamp: 2017-12-06 16:11:20+00
          tester: perlsmok

UUID: 147F56A2-DAA0-11E7-9B18-9CDEB76ACC5E
Branch: smoke-me/khw-variant
Config: default
Logs: http://perl.develop-help.com/reports/
-- 
Report generated by Test::Smoke::Gateway v0.09