Automated smoke report for branch blead 5.27.7 patch 2ce94a867b15d96bd49eb8807d39df950f3a1087 v5.27.6-117-g2ce94a867b
r9: PA8900 (PA-RISC2.0/64/1 cpus)
    on        HP-UX B.11.11/64
    using     cc version B.11.11.18 (*1)
    smoketime 1 day 16 hours 35 minutes (average 5 hours 4 minutes)

Summary: FAIL(F)

O = OK  F = Failure(s), extended report at the bottom
X = Failure(s) under TEST but not under harness
? = still running or test results not (yet) available
Build failures during:       - = unknown or N/A
c = Configure, m = make, M = make (after miniperl), t = make test-prep

v5.27.6-117-g2ce94a867b
---------------------- ----------------------------------------------------
F  F  F  F  F  F         (*1)
F  F  F  F  F  F        -Duse64bitall (*1)
F  F  F  F  F  F        -Duseithreads (*1)
F  F  F  F  F  F        -Duseithreads -Duse64bitall (*1)
|  |  |  |  |  |
|  |  |  |  |  +------  locale:univ.utf8 DEBUGGING
|  |  |  |  +---------  perlio DEBUGGING
|  |  |  +------------  stdio DEBUGGING
|  |  +---------------  locale:univ.utf8
|  +------------------  perlio
+---------------------  stdio

Applied patches:
  SMOKE2ce94a867b15d96bd49eb8807d39df950f3a1087

Skipped tests:
  None

Test failures:
~~ ../t/re/pat_psycho.t ........................................ FAILED Bad plan.  You planned 15 tests but ran 12.
  [locale:univ.utf8]  DEBUGGING
~~ ../lib/warnings.t ........................................... FAILED 776-777
  [stdio/perlio/locale:univ.utf8] 
  [stdio/perlio/locale:univ.utf8] -Duseithreads DEBUGGING
  [stdio/perlio/locale:univ.utf8]  DEBUGGING
  [stdio/perlio/locale:univ.utf8] -Duseithreads
~~ ../t/io/iprefix.t ........................................... FAILED Bad plan.  You planned 2 tests but ran 0.
  [perlio] -Duseithreads -Duse64bitall DEBUGGING
~~ ../t/io/nargv.t ............................................. FAILED Bad plan.  You planned 6 tests but ran 0.
  [stdio] -Duseithreads -Duse64bitall DEBUGGING
~~ ../t/op/alarm.t ............................................. FAILED 2
  [perlio] -Duseithreads DEBUGGING
~~ ../dist/Thread-Queue/t/03_peek.t ............................ FAILED Bad plan.  You planned 19 tests but ran 1.
  [perlio] -Duseithreads -Duse64bitall
~~ ../lib/warnings.t ........................................... FAILED 365
  [stdio/perlio/locale:univ.utf8] -Duseithreads -Duse64bitall DEBUGGING
  [stdio/perlio/locale:univ.utf8] -Duseithreads -Duse64bitall
  [stdio/perlio/locale:univ.utf8] -Duse64bitall DEBUGGING
  [stdio/perlio/locale:univ.utf8] -Duse64bitall

Test todo-passed:
~~ ../lib/B/Deparse.t .......................................... PASSED 2
  [locale:univ.utf8] 
  [locale:univ.utf8] -Duseithreads DEBUGGING
  [locale:univ.utf8] -Duseithreads -Duse64bitall DEBUGGING
  [locale:univ.utf8] -Duse64bitall DEBUGGING
  [locale:univ.utf8]  DEBUGGING
  [locale:univ.utf8] -Duseithreads
  [locale:univ.utf8] -Duse64bitall
  [locale:univ.utf8] -Duseithreads -Duse64bitall
~~ ../dist/Net-Ping/t/450_service.t ............................ PASSED 9
  [stdio/perlio/locale:univ.utf8] 
  [stdio/perlio/locale:univ.utf8] -Duseithreads DEBUGGING
  [stdio/perlio/locale:univ.utf8] -Duseithreads -Duse64bitall DEBUGGING
  [stdio/perlio/locale:univ.utf8] -Duse64bitall DEBUGGING
  [stdio/perlio/locale:univ.utf8]  DEBUGGING
  [stdio/perlio/locale:univ.utf8] -Duseithreads
  [stdio/perlio/locale:univ.utf8] -Duse64bitall
  [stdio/perlio/locale:univ.utf8] -Duseithreads -Duse64bitall

MANIFEST messages:

Compiler messages:
  cc: "try.c", line 56: warning 604: Pointers are not assignment-compatible.
  cc: "try.c", line 56: warning 563: Argument #2 is not the correct type.
  cc: "locale.c", line 1267: warning 562: Redeclaration of "S_my_nl_langinfo" with a different storage class specifier: "S_my_nl_langinfo" will have internal linkage.

About this smoke:
    smoking-perl: 5.14.2
  smoker-version: 1.71_01/0.046
       timestamp: 2017-12-05 09:27:31+00
          tester: merijn

Status overview available here: https://smoke.procura.nl/
-- 
Report generated by Test::Smoke::Gateway v0.09