Automated smoke report for branch blead 5.27.5 patch d939098ccc7209faf586b0a2cca8b202f4c297f1 v5.27.4-76-gd939098
bulk: Intel(R) Core(TM) i7-4800MQ CPU @ 2.70GHz(~2693 MHz) (Intel64/8 cpus)
    on        MSWin32 Win7 Professional (64-bit) SP1
    using     gcc version 4.9.2 (*1)
    smoketime 2 hours 3 minutes (average 15 minutes 27 seconds)

Summary: FAIL(FM)

O = OK  F = Failure(s), extended report at the bottom
X = Failure(s) under TEST but not under harness
? = still running or test results not (yet) available
Build failures during:       - = unknown or N/A
c = Configure, m = make, M = make (after miniperl), t = make test-prep

v5.27.4-76-gd939098
---------------------- ----------------------------------------------------
M  -  M  -               (*1)
-  F  -  F              -Duselargefiles (*1)
M  -  M  -              -Duseithreads (*1)
-  F  -  F              -Duseithreads -Duselargefiles (*1)
|  |  |  |
|  |  |  +------------  stdio DEBUGGING
|  |  +---------------  minitest DEBUGGING
|  +------------------  stdio
+---------------------  minitest

Applied patches:
  SMOKEd939098ccc7209faf586b0a2cca8b202f4c297f1

Skipped tests:
      # One test name on a line
      cpan/IO-Compress/t/105oneshot-bzip2.t			IO::Compress
      cpan/IO-Compress/t/105oneshot-deflate.t			IO::Compress
      cpan/IO-Compress/t/105oneshot-gzip.t			IO::Compress
      cpan/IO-Compress/t/105oneshot-gzip-only.t		IO::Compress
      cpan/IO-Compress/t/105oneshot-rawdeflate.t		IO::Compress
      cpan/IO-Compress/t/105oneshot-zip.t			IO::Compress
      cpan/IO-Compress/t/105oneshot-zip-bzip2-only.t		IO::Compress
      cpan/IO-Compress/t/105oneshot-zip-only.t		IO::Compress
      cpan/IO-Compress/t/105oneshot-zip-store-only.t		IO::Compress

Test failures:
~~ ../t/porting/pod_rules.t .................................... FAILED 4
  [stdio] -Duseithreads -Duselargefiles
  [stdio] -Duselargefiles
  [stdio] -Duseithreads -Duselargefiles DEBUGGING
  [stdio] -Duselargefiles DEBUGGING
~~ ../cpan/File-Path/t/Path.t .................................. FAILED 6 Non-zero exit status: 1
  [stdio] -Duselargefiles
~~ ../t/op/mkdir.t ............................................. FAILED 13
  [stdio] -Duseithreads -Duselargefiles DEBUGGING
~~ ../t/op/taint.t ............................................. FAILED 1
  [stdio] -Duseithreads -Duselargefiles
  [stdio] -Duseithreads -Duselargefiles DEBUGGING
~~ ../t/porting/manifest.t ..................................... FAILED 10414
  [stdio] -Duseithreads -Duselargefiles
  [stdio] -Duselargefiles
  [stdio] -Duseithreads -Duselargefiles DEBUGGING
  [stdio] -Duselargefiles DEBUGGING

Test todo-passed:
~~ ../ext/IPC-Open3/t/IPC-Open3.t .............................. PASSED 25
  [stdio] -Duseithreads -Duselargefiles
  [stdio] -Duselargefiles
  [stdio] -Duseithreads -Duselargefiles DEBUGGING
  [stdio] -Duselargefiles DEBUGGING

MANIFEST messages:

Compiler messages:
  win32.c: In function 'win32_fseek':
  win32.c:2872:24: warning: passing argument 2 of 'fsetpos' from incompatible pointer type
  C:/Strawberry/c/x86_64-w64-mingw32/include/stdio.h:456:15: note: expected 'const fpos_t *' but argument is of type 'long int *'
  RealPPPort.xs: In function 'XS_Devel__PPPort_ptrtests':
  ..\..\lib\CORE/perl.h:1731:26: warning: cast from pointer to integer of different size [-Wpointer-to-int-cast]
  ..\..\lib\CORE/perl.h:1746:21: note: in expansion of macro 'INT2PTR'
  RealPPPort.xs:1598:27: note: in expansion of macro 'PTR2ul'
  POSIX.c: In function 'XS_POSIX__Termios_getattr':
  POSIX.c:2187:17: warning: cast from pointer to integer of different size [-Wpointer-to-int-cast]
  POSIX.c: In function 'XS_POSIX__Termios_setattr':
  POSIX.c:2243:17: warning: cast from pointer to integer of different size [-Wpointer-to-int-cast]
  POSIX.c: In function 'XS_POSIX__Termios_getispeed':
  POSIX.c:2310:17: warning: cast from pointer to integer of different size [-Wpointer-to-int-cast]
  POSIX.c: In function 'XS_POSIX__Termios_getiflag':
  POSIX.c:2341:17: warning: cast from pointer to integer of different size [-Wpointer-to-int-cast]
  POSIX.c: In function 'XS_POSIX__Termios_getcc':
  POSIX.c:2393:17: warning: cast from pointer to integer of different size [-Wpointer-to-int-cast]
  POSIX.c: In function 'XS_POSIX__Termios_setispeed':
  POSIX.c:2432:17: warning: cast from pointer to integer of different size [-Wpointer-to-int-cast]
  POSIX.c: In function 'XS_POSIX__Termios_setiflag':
  POSIX.c:2474:17: warning: cast from pointer to integer of different size [-Wpointer-to-int-cast]
  POSIX.c: In function 'XS_POSIX__Termios_setcc':
  POSIX.c:2522:17: warning: cast from pointer to integer of different size [-Wpointer-to-int-cast]
  POSIX.xs: In function 'XS_POSIX_ctermid':
  POSIX.xs:1454:20: warning: cast to pointer from integer of different size [-Wint-to-pointer-cast]
  POSIX.xs:3595:11: note: in expansion of macro 'ctermid'
  POSIX.c: In function 'XS_POSIX_ttyname':
  POSIX.xs:1373:22: warning: cast to pointer from integer of different size [-Wint-to-pointer-cast]
  POSIX.c:5415:11: note: in expansion of macro 'ttyname'
  scalar.xs: In function 'PerlIOScalar_read':
  ..\..\lib\CORE/perl.h:3715:20: error: negative width in bit-field '_static_assertion_failed_189'
  ..\..\lib\CORE/perl.h:3718:41: note: in expansion of macro 'STATIC_ASSERT_2'
  ..\..\lib\CORE/perl.h:3719:39: note: in expansion of macro 'STATIC_ASSERT_1'
  ..\..\lib\CORE/perl.h:3724:44: note: in expansion of macro 'STATIC_ASSERT_DECL'
  scalar.xs:189:9: note: in expansion of macro 'STATIC_ASSERT_STMT'
  DynaLoader.xs: In function 'XS_DynaLoader_dl_unload_file':
  dlutils.c:66:25: note: in definition of macro 'DLDEBUG'
  DynaLoader.xs:152:71: note: in expansion of macro 'PTR2ul'
  Socket.xs: In function 'XS_Socket_pack_sockaddr_un':
  Socket.xs:808:10: warning: cast to pointer from integer of different size [-Wint-to-pointer-cast]
  Socket.xs: In function 'XS_Socket_unpack_sockaddr_un':
  Socket.xs:870:10: warning: cast to pointer from integer of different size [-Wint-to-pointer-cast]
  Socket.xs: In function 'XS_Socket_pack_sockaddr_in6':
  Socket.xs:974:10: warning: cast to pointer from integer of different size [-Wint-to-pointer-cast]
  Socket.xs: In function 'XS_Socket_unpack_sockaddr_in6':
  Socket.xs:1013:10: warning: cast to pointer from integer of different size [-Wint-to-pointer-cast]
  Storable.xs: In function 'known_class':
  Storable.xs:479:31: warning: cast from pointer to integer of different size [-Wpointer-to-int-cast]
  Storable.xs:1982:15: note: in expansion of macro 'LOW_32BITS'
  Storable.xs: In function 'store_scalar':
  Storable.xs:538:3: warning: cast from pointer to integer of different size [-Wpointer-to-int-cast]
  Storable.xs:698:6: note: in expansion of macro 'int_aligned'
  Storable.xs:895:3: note: in expansion of macro 'MBUF_PUTINT'
  Storable.xs:2190:17: note: in expansion of macro 'WRITE_I32'
  Storable.xs:536:20: warning: cast from pointer to integer of different size [-Wpointer-to-int-cast]
  Storable.xs:538:26: note: in expansion of macro 'trunc_int'
  Storable.xs:907:4: note: in expansion of macro 'MBUF_PUTINT'
  Storable.xs:939:3: note: in expansion of macro 'WLEN'
  Storable.xs:2251:17: note: in expansion of macro 'STORE_PV_LEN'
  Storable.xs:912:4: note: in expansion of macro 'MBUF_PUTINT'
  Storable.xs:257:32: note: in expansion of macro 'STORE_PV_LEN'
  Storable.xs:2258:17: note: in expansion of macro 'STORE_UTF8STR'
  Storable.xs:944:31: note: in expansion of macro 'STORE_PV_LEN'
  Storable.xs:2260:17: note: in expansion of macro 'STORE_SCALAR'
  Storable.xs: In function 'store_array':
  Storable.xs:2292:2: note: in expansion of macro 'WLEN'
  Storable.xs: In function 'store_hash':
  Storable.xs:2404:2: note: in expansion of macro 'WLEN'
  Storable.xs:2571:4: note: in expansion of macro 'WLEN'
  Storable.xs:2677:29: note: in expansion of macro 'WLEN'
  Storable.xs: In function 'store_code':
  Storable.xs:2788:3: note: in expansion of macro 'STORE_UTF8STR'
  Storable.xs:2790:3: note: in expansion of macro 'STORE_SCALAR'
  Storable.xs: In function 'store_tied_item':
  Storable.xs:2921:3: note: in expansion of macro 'WLEN'
  Storable.xs: In function 'store_hook':
  Storable.xs:3302:4: note: in expansion of macro 'WLEN'
  Storable.xs:3309:4: note: in expansion of macro 'WLEN'
  Storable.xs:3320:3: note: in expansion of macro 'WLEN'
  Storable.xs:3332:4: note: in expansion of macro 'WLEN'
  Storable.xs:3344:23: note: in expansion of macro 'LOW_32BITS'
  Storable.xs:3345:4: note: in expansion of macro 'WRITE_I32'
  Storable.xs: In function 'store_blessed':
  Storable.xs:3461:4: note: in expansion of macro 'WLEN'
  Storable.xs:3472:4: note: in expansion of macro 'WLEN'
  Storable.xs: In function 'store_other':
  Storable.xs:3523:2: note: in expansion of macro 'STORE_SCALAR'
  Storable.xs: In function 'store':
  Storable.xs:3680:18: note: in expansion of macro 'LOW_32BITS'
  Storable.xs:3689:3: note: in expansion of macro 'WRITE_I32'
  Storable.xs: In function 'retrieve_idx_blessed':
  Storable.xs:636:7: note: in expansion of macro 'int_aligned'
  Storable.xs:987:3: note: in expansion of macro 'MBUF_GETINT'
  Storable.xs:4023:3: note: in expansion of macro 'RLEN'
  Storable.xs: In function 'retrieve_blessed':
  Storable.xs:4074:3: note: in expansion of macro 'RLEN'
  Storable.xs: In function 'retrieve_hook':
  Storable.xs:4236:4: note: in expansion of macro 'RLEN'
  Storable.xs:4259:4: note: in expansion of macro 'RLEN'
  Storable.xs:4301:3: note: in expansion of macro 'RLEN'
  Storable.xs:4323:4: note: in expansion of macro 'RLEN'
  Storable.xs:977:3: note: in expansion of macro 'MBUF_GETINT'
  Storable.xs:4353:4: note: in expansion of macro 'READ_I32'
  Storable.xs: In function 'retrieve_tied_idx':
  Storable.xs:4885:2: note: in expansion of macro 'RLEN'
  Storable.xs: In function 'retrieve_lscalar':
  Storable.xs:4910:2: note: in expansion of macro 'RLEN'
  Storable.xs: In function 'retrieve_lvstring':
  Storable.xs:5117:2: note: in expansion of macro 'RLEN'
  Storable.xs: In function 'retrieve_netint':
  Storable.xs:5179:2: note: in expansion of macro 'READ_I32'
  Storable.xs: In function 'retrieve_array':
  Storable.xs:5366:2: note: in expansion of macro 'RLEN'
  Storable.xs: In function 'retrieve_hash':
  Storable.xs:5427:2: note: in expansion of macro 'RLEN'
  Storable.xs:5457:3: note: in expansion of macro 'RLEN'
  Storable.xs: In function 'retrieve_flag_hash':
  Storable.xs:5516:5: note: in expansion of macro 'RLEN'
  Storable.xs:5590:13: note: in expansion of macro 'RLEN'
  Storable.xs: In function 'old_retrieve_array':
  Storable.xs:5779:2: note: in expansion of macro 'RLEN'
  Storable.xs: In function 'old_retrieve_hash':
  Storable.xs:5842:2: note: in expansion of macro 'RLEN'
  Storable.xs:5888:3: note: in expansion of macro 'RLEN'
  Storable.xs: In function 'retrieve':
  Storable.xs:6191:3: note: in expansion of macro 'READ_I32'
  Storable.xs:6247:5: note: in expansion of macro 'RLEN'
  APItest.c: In function 'XS_XS__APItest__PtrTable_clear':
  APItest.c:3059:2: warning: 'Perl_ptr_table_clear' is deprecated (declared at ..\..\lib\CORE/proto.h:2564) [-Wdeprecated-declarations]
  APItest.xs: In function 'XS_XS__APItest__Magic_test_toLOWER_utf8':
  APItest.xs:6254:13: warning: 'Perl_to_utf8_lower' is deprecated (declared at ..\..\lib\CORE/proto.h:3541) [-Wdeprecated-declarations]
  APItest.xs: In function 'XS_XS__APItest__Magic_test_toFOLD_utf8':
  APItest.xs:6344:13: warning: 'Perl_to_utf8_fold' is deprecated (declared at ..\..\lib\CORE/proto.h:3534) [-Wdeprecated-declarations]
  APItest.xs: In function 'XS_XS__APItest__Magic_test_toUPPER_utf8':
  APItest.xs:6434:13: warning: 'Perl_to_utf8_upper' is deprecated (declared at ..\..\lib\CORE/proto.h:3555) [-Wdeprecated-declarations]
  APItest.xs: In function 'XS_XS__APItest__Magic_test_toTITLE_utf8':
  APItest.xs:6517:13: warning: 'Perl_to_utf8_title' is deprecated (declared at ..\..\lib\CORE/proto.h:3548) [-Wdeprecated-declarations]
  compilet.exp:fake:(.edata+0x3c): undefined reference to `boot_compilet'
  t\cplust.exp:fake:(.edata+0x38): undefined reference to `boot_cplust'
  ..\..\lib\CORE/iperlsys.h:1266:30: note: in definition of macro 'PerlSock_htonl'
  perllib.c: In function 'void xs_init(PerlInterpreter*)':
  perllib.c:37:1: warning: deprecated conversion from string constant to 'char*' [-Wwrite-strings]
  perlhost.h: In function 'CPerlHost* IPerlMem2Host(IPerlMem*)':
  perlhost.h:244:34: warning: invalid access to non-static data member 'CPerlHost::m_hostperlMem'  of NULL object [-Winvalid-offsetof]
  perlhost.h:244:12: note: in expansion of macro 'STRUCT2RAWPTR'
  perlhost.h:244:34: warning: (perhaps the 'offsetof' macro was used incorrectly) [-Winvalid-offsetof]
  perlhost.h: In function 'CPerlHost* IPerlMemShared2Host(IPerlMem*)':
  perlhost.h:249:34: warning: invalid access to non-static data member 'CPerlHost::m_hostperlMemShared'  of NULL object [-Winvalid-offsetof]
  perlhost.h:249:12: note: in expansion of macro 'STRUCT2RAWPTR'
  perlhost.h:249:34: warning: (perhaps the 'offsetof' macro was used incorrectly) [-Winvalid-offsetof]
  perlhost.h: In function 'CPerlHost* IPerlMemParse2Host(IPerlMem*)':
  perlhost.h:254:34: warning: invalid access to non-static data member 'CPerlHost::m_hostperlMemParse'  of NULL object [-Winvalid-offsetof]
  perlhost.h:254:12: note: in expansion of macro 'STRUCT2RAWPTR'
  perlhost.h:254:34: warning: (perhaps the 'offsetof' macro was used incorrectly) [-Winvalid-offsetof]
  perlhost.h: In function 'CPerlHost* IPerlEnv2Host(IPerlEnv*)':
  perlhost.h:259:31: warning: invalid access to non-static data member 'CPerlHost::m_hostperlEnv'  of NULL object [-Winvalid-offsetof]
  perlhost.h:237:38: note: in expansion of macro 'STRUCT2RAWPTR'
  perlhost.h:259:12: note: in expansion of macro 'STRUCT2PTR'
  perlhost.h:259:31: warning: (perhaps the 'offsetof' macro was used incorrectly) [-Winvalid-offsetof]
  perlhost.h: In function 'CPerlHost* IPerlStdIO2Host(IPerlStdIO*)':
  perlhost.h:264:31: warning: invalid access to non-static data member 'CPerlHost::m_hostperlStdIO'  of NULL object [-Winvalid-offsetof]
  perlhost.h:264:12: note: in expansion of macro 'STRUCT2PTR'
  perlhost.h:264:31: warning: (perhaps the 'offsetof' macro was used incorrectly) [-Winvalid-offsetof]
  perlhost.h: In function 'CPerlHost* IPerlLIO2Host(IPerlLIO*)':
  perlhost.h:269:31: warning: invalid access to non-static data member 'CPerlHost::m_hostperlLIO'  of NULL object [-Winvalid-offsetof]
  perlhost.h:269:12: note: in expansion of macro 'STRUCT2PTR'
  perlhost.h:269:31: warning: (perhaps the 'offsetof' macro was used incorrectly) [-Winvalid-offsetof]
  perlhost.h: In function 'CPerlHost* IPerlDir2Host(IPerlDir*)':
  perlhost.h:274:31: warning: invalid access to non-static data member 'CPerlHost::m_hostperlDir'  of NULL object [-Winvalid-offsetof]
  perlhost.h:274:12: note: in expansion of macro 'STRUCT2PTR'
  perlhost.h:274:31: warning: (perhaps the 'offsetof' macro was used incorrectly) [-Winvalid-offsetof]
  perlhost.h: In function 'CPerlHost* IPerlSock2Host(IPerlSock*)':
  perlhost.h:279:31: warning: invalid access to non-static data member 'CPerlHost::m_hostperlSock'  of NULL object [-Winvalid-offsetof]
  perlhost.h:279:12: note: in expansion of macro 'STRUCT2PTR'
  perlhost.h:279:31: warning: (perhaps the 'offsetof' macro was used incorrectly) [-Winvalid-offsetof]
  perlhost.h: In function 'CPerlHost* IPerlProc2Host(IPerlProc*)':
  perlhost.h:284:31: warning: invalid access to non-static data member 'CPerlHost::m_hostperlProc'  of NULL object [-Winvalid-offsetof]
  perlhost.h:284:12: note: in expansion of macro 'STRUCT2PTR'
  perlhost.h:284:31: warning: (perhaps the 'offsetof' macro was used incorrectly) [-Winvalid-offsetof]
  C:/Strawberry/c/lib/gcc/x86_64-w64-mingw32/4.9.2/include/fma4intrin.h:25:3: error: #error "Never use  directly; include  instead."

About this smoke:
    smoking-perl: 5.24.1
  smoker-version: 1.71/0.046
       timestamp: 2017-10-12 23:10:09+00
          tester: mauke

-- 
Report generated by Test::Smoke::Gateway v0.09