Automated smoke report for branch blead 5.27.5 patch a68a847ef5e609337bd3f538810884d3b918bfb8 v5.27.4-75-ga68a847ef5
boettgerilla-pallens.xenu.pl: x86_64 (x86_64/? cpus)
    on        dragonfly 4.8-RELEASE
    using     cc version 5.4.1 [DragonFly] Release/2016-08-27 (*1)
    smoketime 5 hours 37 minutes (average 42 minutes 12 seconds)

Summary: FAIL(XF)

O = OK  F = Failure(s), extended report at the bottom
X = Failure(s) under TEST but not under harness
? = still running or test results not (yet) available
Build failures during:       - = unknown or N/A
c = Configure, m = make, M = make (after miniperl), t = make test-prep

v5.27.4-75-ga68a847ef5
---------------------- ----------------------------------------------------
X  O  O  O               (*1)
F  F  F  F              -Duselongdouble (*1)
F  F  F  F              -Duseithreads (*1)
F  F  F  F              -Duseithreads -Duselongdouble (*1)
|  |  |  |
|  |  |  +------------  perlio DEBUGGING
|  |  +---------------  stdio DEBUGGING
|  +------------------  perlio
+---------------------  stdio

Applied patches:
  SMOKEa68a847ef5e609337bd3f538810884d3b918bfb8

Skipped tests:
      # One test name on a line

Test failures:
~~ ../cpan/Time-Local/t/Local.t ................................ FAILED No plan found in TAP output
  [stdio/perlio] -Duseithreads -Duselongdouble DEBUGGING
  [stdio/perlio] -Duselongdouble DEBUGGING
~~ ../t/op/time.t .............................................. FAILED 19-22
  [stdio] -Duseithreads -Duselongdouble
~~ ../lib/locale.t ............................................. FAILED 453
  [stdio/perlio] -Duseithreads -Duselongdouble
  [stdio/perlio] -Duseithreads DEBUGGING
  [stdio/perlio] -Duseithreads -Duselongdouble DEBUGGING
  [stdio/perlio] -Duseithreads
~~ ../t/op/time.t .............................................. FAILED Bad plan.  You planned 72 tests but ran 16.
  [stdio] -Duselongdouble DEBUGGING
~~ ../cpan/Time-Local/t/Local.t ................................ FAILED 142 Non-zero exit status: 4
  [stdio/perlio] -Duseithreads -Duselongdouble
  [stdio/perlio] -Duselongdouble
~~ ../t/op/time.t .............................................. FAILED 13-14
  [perlio] -Duseithreads -Duselongdouble
  [stdio/perlio] -Duselongdouble
~~ ../lib/Time/gmtime.t ........................................ FAILED Bad plan.  You planned 121 tests but ran 21.
  [stdio/perlio] -Duseithreads -Duselongdouble DEBUGGING
  [stdio/perlio] -Duselongdouble DEBUGGING
~~ ../t/op/time.t .............................................. FAILED Bad plan.  You planned 72 tests but ran 0.
  [perlio] -Duseithreads -Duselongdouble DEBUGGING
  [perlio] -Duselongdouble DEBUGGING
~~ ../t/op/time.t .............................................. FAILED Bad plan.  You planned 72 tests but ran 12.
  [stdio] -Duseithreads -Duselongdouble DEBUGGING

Test todo-passed:

MANIFEST messages:

Compiler messages:
  Socket.c: In function 'XS_Socket_pack_ip_mreq_source':
  Socket.c:1558:7: warning: variable 'interface' set but not used [-Wunused-but-set-variable]
  B.c: In function 'XS_B__PADNAME_TYPE':
  B.xs:2219:8: warning: 'ret' may be used uninitialized in this function [-Wmaybe-uninitialized]
  B.xs:2203:6: note: 'ret' was declared here

About this smoke:
    smoking-perl: 5.26.0
  smoker-version: 1.71/0.046
       timestamp: 2017-10-12 12:11:07+02
          tester: smoker

-- 
Report generated by Test::Smoke::Gateway v0.09