Automated smoke report for branch blead 5.27.5 patch e04fc1aa1cb8f08ee6e04f5c80e645cad2b3c75a v5.27.4-52-ge04fc1aa1c
r9: PA8900 (PA-RISC2.0/64/1 cpus)
    on        HP-UX B.11.11/64
    using     cc version B.11.11.18 (*1)
    smoketime 1 day 13 hours 15 minutes (average 4 hours 39 minutes)

Summary: FAIL(F)

O = OK  F = Failure(s), extended report at the bottom
X = Failure(s) under TEST but not under harness
? = still running or test results not (yet) available
Build failures during:       - = unknown or N/A
c = Configure, m = make, M = make (after miniperl), t = make test-prep

v5.27.4-52-ge04fc1aa1c
---------------------- ----------------------------------------------------
O  O  O  O  O  O         (*1)
F  F  F  F  F  F        -Duse64bitall (*1)
O  O  O  O  O  O        -Duseithreads (*1)
F  F  F  F  F  F        -Duseithreads -Duse64bitall (*1)
|  |  |  |  |  |
|  |  |  |  |  +------  locale:univ.utf8 DEBUGGING
|  |  |  |  +---------  perlio DEBUGGING
|  |  |  +------------  stdio DEBUGGING
|  |  +---------------  locale:univ.utf8
|  +------------------  perlio
+---------------------  stdio

Applied patches:
  SMOKEe04fc1aa1cb8f08ee6e04f5c80e645cad2b3c75a

Skipped tests:
  None

Test failures:
~~ ../dist/Time-HiRes/t/alarm.t ................................ FAILED 8-9 Non-zero exit status: 2
  [locale:univ.utf8] -Duseithreads -Duse64bitall
~~ ../lib/warnings.t ........................................... FAILED 364
  [stdio/perlio/locale:univ.utf8] -Duseithreads -Duse64bitall DEBUGGING
  [stdio/perlio/locale:univ.utf8] -Duseithreads -Duse64bitall
  [stdio/perlio/locale:univ.utf8] -Duse64bitall DEBUGGING
  [stdio/perlio/locale:univ.utf8] -Duse64bitall
~~ ../t/op/alarm.t ............................................. FAILED 2
  [locale:univ.utf8] -Duse64bitall
~~ ../ext/Hash-Util-FieldHash/t/03_class.t ..................... FAILED Bad plan.  You planned 7 tests but ran 6.
  [locale:univ.utf8] -Duseithreads -Duse64bitall DEBUGGING
~~ ../t/io/nargv.t ............................................. FAILED Bad plan.  You planned 6 tests but ran 5.
  [stdio] -Duseithreads -Duse64bitall DEBUGGING

Test todo-passed:
~~ ../lib/B/Deparse.t .......................................... PASSED 2
  [locale:univ.utf8] 
  [locale:univ.utf8] -Duseithreads DEBUGGING
  [locale:univ.utf8] -Duseithreads -Duse64bitall DEBUGGING
  [locale:univ.utf8] -Duse64bitall DEBUGGING
  [locale:univ.utf8]  DEBUGGING
  [locale:univ.utf8] -Duseithreads
  [locale:univ.utf8] -Duse64bitall
  [locale:univ.utf8] -Duseithreads -Duse64bitall
~~ ../dist/Net-Ping/t/450_service.t ............................ PASSED 9
  [stdio/perlio/locale:univ.utf8] 
  [stdio/perlio/locale:univ.utf8] -Duseithreads DEBUGGING
  [stdio/perlio/locale:univ.utf8] -Duseithreads -Duse64bitall DEBUGGING
  [stdio/perlio/locale:univ.utf8] -Duse64bitall DEBUGGING
  [stdio/perlio/locale:univ.utf8]  DEBUGGING
  [stdio/perlio/locale:univ.utf8] -Duseithreads
  [stdio/perlio/locale:univ.utf8] -Duse64bitall
  [stdio/perlio/locale:univ.utf8] -Duseithreads -Duse64bitall

MANIFEST messages:

Compiler messages:

About this smoke:
    smoking-perl: 5.14.2
  smoker-version: 1.71_01/0.046
       timestamp: 2017-10-10 11:15:20+02
          tester: merijn

Status overview available here: https://smoke.procura.nl/
-- 
Report generated by Test::Smoke::Gateway v0.09