Automated smoke report for branch blead 5.27.5 patch 1fd91301492e395c7dd0a0b9fb56395147df763b v5.27.4-72-g1fd9130149
cjg-netbsd7.localdomain: Intel 686-class (amd64/2 cpus)
    on        netbsd 7.1
    using     cc version 4.8.5 (*1)
    smoketime 3 hours 57 minutes (average 29 minutes 40 seconds)

Summary: FAIL(F)

O = OK  F = Failure(s), extended report at the bottom
X = Failure(s) under TEST but not under harness
? = still running or test results not (yet) available
Build failures during:       - = unknown or N/A
c = Configure, m = make, M = make (after miniperl), t = make test-prep

v5.27.4-72-g1fd9130149
---------------------- ----------------------------------------------------
O  O                     (*1)
O  O                    -Duse64bitall (*1)
O  F                    -Duseithreads (*1)
O  O                    -Duseithreads -Duse64bitall (*1)
|  |
|  +------------------  stdio DEBUGGING
+---------------------  stdio

Applied patches:
  SMOKE1fd91301492e395c7dd0a0b9fb56395147df763b

Skipped tests:
      # One test name on a line

Test failures:
~~ ../cpan/Sys-Syslog/t/syslog.t ............................... FAILED 145 Non-zero exit status: 1
  [stdio] -Duseithreads DEBUGGING

Test todo-passed:

MANIFEST messages:

Compiler messages:
  toke.c: In function 'Perl_yylex':
  toke.c:3032:24: warning: 'offset_to_max' may be used uninitialized in this function [-Wmaybe-uninitialized]
  toke.c:2896:12: note: 'offset_to_max' was declared here
  /usr/include/sys/cdefs_elf.h:67:20: error: missing binary operator before token "("
  /usr/include/sys/cdefs_elf.h:73:20: error: missing binary operator before token "("
  /usr/include/sys/cdefs_elf.h:79:20: error: missing binary operator before token "("
  Socket.c: In function 'XS_Socket_pack_ip_mreq_source':
  Socket.c:1558:7: warning: variable 'interface' set but not used [-Wunused-but-set-variable]
  const-c.inc: In function 'constant_19':
  const-c.inc:351:42: warning: unused parameter 'iv_return' [-Wunused-parameter]
  Piece.xs: In function '_strptime':
  Piece.xs:719:8: warning: 'len' may be used uninitialized in this function [-Wmaybe-uninitialized]

About this smoke:
    smoking-perl: 5.26.1
  smoker-version: 1.71/0.046
       timestamp: 2017-10-09 14:20:57+00
          tester: core

-- 
Report generated by Test::Smoke::Gateway v0.09