Show logfile
Automated smoke report for branch blead 5.27.3 patch cc289c9e6344a3d6386f2ed69849186df75de054 v5.27.2-127-gcc289c9
nereid: i86pc (3015MHz) (i386/1 cpus)
    on        Solaris 2.11
    using     /opt/solarisstudio12.3/bin/cc version Sun C 5.12 SunOS_i386 2011/11/16 (*1)
    smoketime 12 hours 57 minutes (average 48 minutes 34 seconds)

Summary: FAIL(F)

O = OK  F = Failure(s), extended report at the bottom
X = Failure(s) under TEST but not under harness
? = still running or test results not (yet) available
Build failures during:       - = unknown or N/A
c = Configure, m = make, M = make (after miniperl), t = make test-prep

v5.27.2-127-gcc289c9
---------------------- ----------------------------------------------------
O  O  O  O              -Dmake=gmake (*1)
F  O  O  O              -Dmake=gmake -Dusedtrace -Duseshrplib (*1)
O  O  O  O              -Dmake=gmake -Dusemorebits (*1)
O  O  O  O              -Dmake=gmake -Duse64bitall (*1)
O  O  O  O              -Dmake=gmake -Duseithreads (*1)
O  O  O  O              -Dmake=gmake -Duseithreads -Dusedtrace -Duseshrplib (*1)
O  O  F  O              -Dmake=gmake -Duseithreads -Dusemorebits (*1)
O  O  F  O              -Dmake=gmake -Duseithreads -Duse64bitall (*1)
|  |  |  |
|  |  |  +------------  perlio DEBUGGING
|  |  +---------------  stdio DEBUGGING
|  +------------------  perlio
+---------------------  stdio

Applied patches:
  SMOKEcc289c9e6344a3d6386f2ed69849186df75de054

Skipped tests:
  None

Test failures:
~~ ../cpan/Memoize/t/expmod_t.t ................................ FAILED 11-12
  [stdio] -Dmake=gmake -Dusedtrace -Duseshrplib
~~ ../dist/Time-HiRes/t/alarm.t ................................ FAILED 8 Non-zero exit status: 1
  [stdio] -Dmake=gmake -Duseithreads -Dusemorebits DEBUGGING
~~ ../dist/threads-shared/t/waithires.t ........................ FAILED Non-zero exit status: 1 Bad plan.  You planned 63 tests but ran 6.
  [stdio] -Dmake=gmake -Duseithreads -Duse64bitall DEBUGGING

Test todo-passed:

MANIFEST messages:

Compiler messages:
  "try.c", line 17: warning: statement not reached
  "try.c", line 66: warning: statement not reached
  "zaphod32_hash.h", line 241: warning: statement not reached
  "pp_sys.c", line 4533: warning: statement not reached
  "../../zaphod32_hash.h", line 241: warning: statement not reached
  "bzlib.c", line 868: warning: statement not reached
  "Cwd.xs", line 20: warning: macro redefined: SYSNAME
  "../../../zaphod32_hash.h", line 241: warning: statement not reached
  "POSIX.c", line 4024: warning: statement not reached
  "POSIX.c", line 4384: warning: statement not reached
  "Piece.c", line 1202: warning: statement not reached
  "Piece.c", line 1261: warning: statement not reached
  "Piece.c", line 1306: warning: statement not reached
  "Piece.c", line 1347: warning: statement not reached
  "../../../../zaphod32_hash.h", line 241: warning: statement not reached
  "/export/home/perlsmok/smoke-me/perl-current/zaphod32_hash.h", line 241: warning: statement not reached
  "../zaphod32_hash.h", line 241: warning: statement not reached
  "B.c", line 1146: warning: statement not reached
  "APItest.c", line 6152: warning: statement not reached

About this smoke:
    smoking-perl: 5.16.1
  smoker-version: 1.53/0.045
       timestamp: 2017-08-11 08:04:26+02
          tester: perlsmok

UUID: E84EEF76-7E5A-11E7-BCC4-94DA7A7A5119
Branch: blead
Config: default
Logs: http://perl.develop-help.com/reports/
-- 
Report generated by Test::Smoke::Gateway v0.09