Automated smoke report for branch blead 5.27.2 patch ec268cc8df7c7a90811a099d422eef6a31bf9f8b v5.27.1-239-gec268cc8df
cjg-netbsd7.localdomain: Intel 686-class (amd64/2 cpus)
    on        netbsd 7.1
    using     cc version 4.8.5 (*1)
    smoketime 6 hours 38 minutes (average 49 minutes 52 seconds)

Summary: FAIL(F)

O = OK  F = Failure(s), extended report at the bottom
X = Failure(s) under TEST but not under harness
? = still running or test results not (yet) available
Build failures during:       - = unknown or N/A
c = Configure, m = make, M = make (after miniperl), t = make test-prep

v5.27.1-239-gec268cc8df
---------------------- ----------------------------------------------------
F  F  F  F              -Duse64bitall (*1)
F  F  F  F              -Duseithreads (*1)
F  F  F  F              -Duseithreads -Duse64bitall (*1)
F  F  F  F               (*1)
|  |  |  |
|  |  |  +------------  perlio DEBUGGING
|  |  +---------------  stdio DEBUGGING
|  +------------------  perlio
+---------------------  stdio

Applied patches:
  SMOKEec268cc8df7c7a90811a099d422eef6a31bf9f8b

Skipped tests:
      # One test name on a line

Test failures:
~~ ../lib/locale.t ............................................. FAILED 431
  [stdio/perlio] 
  [stdio/perlio] -Duseithreads DEBUGGING
  [stdio/perlio] -Duseithreads -Duse64bitall DEBUGGING
  [stdio/perlio] -Duseithreads -Duse64bitall
  [stdio/perlio] -Duse64bitall DEBUGGING
  [stdio/perlio] -Duse64bitall
  [stdio/perlio]  DEBUGGING
  [stdio/perlio] -Duseithreads

Test todo-passed:

MANIFEST messages:

Compiler messages:
  toke.c: In function 'Perl_yylex':
  toke.c:3015:24: warning: 'offset_to_max' may be used uninitialized in this function [-Wmaybe-uninitialized]
  toke.c:2879:12: note: 'offset_to_max' was declared here
  /usr/include/sys/cdefs_elf.h:67:20: error: missing binary operator before token "("
  /usr/include/sys/cdefs_elf.h:73:20: error: missing binary operator before token "("
  /usr/include/sys/cdefs_elf.h:79:20: error: missing binary operator before token "("
  Zlib.c: In function 'XS_Compress__Raw__Zlib_constant':
  ../../embed.h:668:42: warning: 'iv' may be used uninitialized in this function [-Wmaybe-uninitialized]
  ./constants.xs:11:6: note: 'iv' was declared here
  DB_File.c: In function 'XS_DB_File_constant':
  SysV.c: In function 'XS_IPC__SysV__constant':
  ./const-xs.inc:11:6: note: 'iv' was declared here
  Socket.c: In function 'XS_Socket_pack_ip_mreq_source':
  Socket.c:1556:7: warning: variable 'interface' set but not used [-Wunused-but-set-variable]
  HiRes.c: In function 'XS_Time__HiRes_constant':
  Piece.xs: In function '_strptime':
  Piece.xs:719:8: warning: 'len' may be used uninitialized in this function [-Wmaybe-uninitialized]
  ExtTest.c: In function 'XS_ExtTest_constant':
  ../../../../embed.h:684:40: warning: 'pv' may be used uninitialized in this function [-Wmaybe-uninitialized]
  ExtTest.xs:420:14: note: 'pv' was declared here
  ../../../../embed.h:684:40: warning: 'iv' may be used uninitialized in this function [-Wmaybe-uninitialized]
  ExtTest.xs:418:6: note: 'iv' was declared here
  ExtTest.xs:194:14: note: 'pv' was declared here
  ../../../../embed.h:668:42: warning: 'iv' may be used uninitialized in this function [-Wmaybe-uninitialized]
  ExtTest.xs:209:6: note: 'iv' was declared here
  ExtTest.xs:190:6: note: 'iv' was declared here
  ExtTest.xs:166:6: note: 'iv' was declared here

About this smoke:
    smoking-perl: 5.26.0
  smoker-version: 1.71/0.046
       timestamp: 2017-07-16 01:10:34+02
          tester: smoke

-- 
Report generated by Test::Smoke::Gateway v0.09