Automated smoke report for branch blead 5.26.0 patch b4972372a75776de3c9e6bd234a398d103677316 v5.25.12-28-gb4972372a7
DESKTOP-DUOI7F4: Intel(R) Core(TM) i7-6700K CPU @ 4.00GHz(~4008 MHz) (Intel64/8 cpus)
    on        MSWin32 Win10 Enterprise (64-bit)
    using     gcc version 6.1.0 (*1)
    smoketime 2 hours 48 minutes (average 21 minutes 7 seconds)

Summary: FAIL(F)

O = OK  F = Failure(s), extended report at the bottom
X = Failure(s) under TEST but not under harness
? = still running or test results not (yet) available
Build failures during:       - = unknown or N/A
c = Configure, m = make, M = make (after miniperl), t = make test-prep

v5.25.12-28-gb4972372a7
---------------------- ----------------------------------------------------
F  F                    -DCCHOME=C:\mingw-w64\x86_64-6.1.0\mingw64 (*1)
F  F                    -DCCHOME=C:\mingw-w64\x86_64-6.1.0\mingw64 -Duselargefiles (*1)
F  F                    -DCCHOME=C:\mingw-w64\x86_64-6.1.0\mingw64 -Duseithreads (*1)
F  F                    -DCCHOME=C:\mingw-w64\x86_64-6.1.0\mingw64 -Duseithreads -Duselargefiles (*1)
|  |
|  +------------------  stdio DEBUGGING
+---------------------  stdio

Applied patches:
  SMOKEb4972372a75776de3c9e6bd234a398d103677316

Skipped tests:
      # One test name on a line

Test failures:
~~ ../ext/PerlIO-scalar/t/scalar.t ............................. FAILED Non-zero exit status: 255 Bad plan.  You planned 122 tests but ran 2.
  [stdio] -DCCHOME=C:\mingw-w64\x86_64-6.1.0\mingw64 -Duseithreads DEBUGGING
  [stdio] -DCCHOME=C:\mingw-w64\x86_64-6.1.0\mingw64 DEBUGGING
~~ ../t/op/inccode-tie.t ....................................... FAILED Non-zero exit status: 255 No plan found in TAP output
  [stdio] -DCCHOME=C:\mingw-w64\x86_64-6.1.0\mingw64 -Duseithreads DEBUGGING
  [stdio] -DCCHOME=C:\mingw-w64\x86_64-6.1.0\mingw64 DEBUGGING
~~ ../t/io/perlio.t ............................................ FAILED Non-zero exit status: 255 Bad plan.  You planned 48 tests but ran 41.
  [stdio] -DCCHOME=C:\mingw-w64\x86_64-6.1.0\mingw64 -Duseithreads DEBUGGING
  [stdio] -DCCHOME=C:\mingw-w64\x86_64-6.1.0\mingw64 DEBUGGING
~~ ../cpan/IO-Compress/t/105oneshot-zip.t ...................... FAILED Non-zero exit status: 255 Bad plan.  You planned 1002 tests but ran 997.
  [stdio] -DCCHOME=C:\mingw-w64\x86_64-6.1.0\mingw64 -Duseithreads DEBUGGING
  [stdio] -DCCHOME=C:\mingw-w64\x86_64-6.1.0\mingw64 DEBUGGING
~~ ../cpan/IO-Compress/t/105oneshot-gzip.t ..................... FAILED Non-zero exit status: 255 Bad plan.  You planned 1002 tests but ran 997.
  [stdio] -DCCHOME=C:\mingw-w64\x86_64-6.1.0\mingw64 -Duseithreads DEBUGGING
  [stdio] -DCCHOME=C:\mingw-w64\x86_64-6.1.0\mingw64 DEBUGGING
~~ ../t/op/print.t ............................................. FAILED 3
  [stdio] -DCCHOME=C:\mingw-w64\x86_64-6.1.0\mingw64 -Duseithreads DEBUGGING
  [stdio] -DCCHOME=C:\mingw-w64\x86_64-6.1.0\mingw64 DEBUGGING
~~ ../t/base/rs.t .............................................. FAILED Non-zero exit status: 255 No plan found in TAP output
  [stdio] -DCCHOME=C:\mingw-w64\x86_64-6.1.0\mingw64 -Duseithreads DEBUGGING
  [stdio] -DCCHOME=C:\mingw-w64\x86_64-6.1.0\mingw64 DEBUGGING
~~ ../t/io/utf8.t .............................................. FAILED Non-zero exit status: 255 Bad plan.  You planned 63 tests but ran 61.
  [stdio] -DCCHOME=C:\mingw-w64\x86_64-6.1.0\mingw64 -Duseithreads DEBUGGING
  [stdio] -DCCHOME=C:\mingw-w64\x86_64-6.1.0\mingw64 DEBUGGING
~~ ../t/op/inccode.t ........................................... FAILED Non-zero exit status: 255 No plan found in TAP output
  [stdio] -DCCHOME=C:\mingw-w64\x86_64-6.1.0\mingw64 -Duseithreads DEBUGGING
  [stdio] -DCCHOME=C:\mingw-w64\x86_64-6.1.0\mingw64 DEBUGGING
~~ ../t/op/do.t ................................................ FAILED Non-zero exit status: 255 No plan found in TAP output
  [stdio] -DCCHOME=C:\mingw-w64\x86_64-6.1.0\mingw64 -Duseithreads DEBUGGING
  [stdio] -DCCHOME=C:\mingw-w64\x86_64-6.1.0\mingw64 DEBUGGING
~~ ../dist/Storable/t/store.t .................................. FAILED Non-zero exit status: 255 Bad plan.  You planned 25 tests but ran 21.
  [stdio] -DCCHOME=C:\mingw-w64\x86_64-6.1.0\mingw64 -Duseithreads DEBUGGING
  [stdio] -DCCHOME=C:\mingw-w64\x86_64-6.1.0\mingw64 DEBUGGING
~~ ../ext/PerlIO-scalar/t/scalar_ungetc.t ...................... FAILED Non-zero exit status: 255 Bad plan.  You planned 20 tests but ran 3.
  [stdio] -DCCHOME=C:\mingw-w64\x86_64-6.1.0\mingw64 -Duseithreads DEBUGGING
  [stdio] -DCCHOME=C:\mingw-w64\x86_64-6.1.0\mingw64 DEBUGGING
~~ ../t/op/coreamp.t ........................................... FAILED Non-zero exit status: 255 No plan found in TAP output
  [stdio] -DCCHOME=C:\mingw-w64\x86_64-6.1.0\mingw64 -Duseithreads DEBUGGING
  [stdio] -DCCHOME=C:\mingw-w64\x86_64-6.1.0\mingw64 DEBUGGING
~~ ../t/op/filetest.t .......................................... FAILED 10
  [stdio] -DCCHOME=C:\mingw-w64\x86_64-6.1.0\mingw64 -Duseithreads DEBUGGING
  [stdio] -DCCHOME=C:\mingw-w64\x86_64-6.1.0\mingw64 DEBUGGING
~~ ../cpan/ExtUtils-MakeMaker/t/02-xsdynamic.t ................. FAILED 3 Non-zero exit status: 8
  [stdio] -DCCHOME=C:\mingw-w64\x86_64-6.1.0\mingw64 -Duseithreads -Duselargefiles DEBUGGING
  [stdio] -DCCHOME=C:\mingw-w64\x86_64-6.1.0\mingw64
  [stdio] -DCCHOME=C:\mingw-w64\x86_64-6.1.0\mingw64 -Duseithreads -Duselargefiles
  [stdio] -DCCHOME=C:\mingw-w64\x86_64-6.1.0\mingw64 -Duseithreads
  [stdio] -DCCHOME=C:\mingw-w64\x86_64-6.1.0\mingw64 -Duselargefiles
  [stdio] -DCCHOME=C:\mingw-w64\x86_64-6.1.0\mingw64 -Duseithreads DEBUGGING
  [stdio] -DCCHOME=C:\mingw-w64\x86_64-6.1.0\mingw64 -Duselargefiles DEBUGGING
  [stdio] -DCCHOME=C:\mingw-w64\x86_64-6.1.0\mingw64 DEBUGGING
~~ ../t/op/filehandle.t ........................................ FAILED Non-zero exit status: 255 No plan found in TAP output
  [stdio] -DCCHOME=C:\mingw-w64\x86_64-6.1.0\mingw64 -Duseithreads DEBUGGING
  [stdio] -DCCHOME=C:\mingw-w64\x86_64-6.1.0\mingw64 DEBUGGING
~~ ../t/op/stat.t .............................................. FAILED 48
  [stdio] -DCCHOME=C:\mingw-w64\x86_64-6.1.0\mingw64 -Duseithreads -Duselargefiles DEBUGGING
  [stdio] -DCCHOME=C:\mingw-w64\x86_64-6.1.0\mingw64
  [stdio] -DCCHOME=C:\mingw-w64\x86_64-6.1.0\mingw64 -Duseithreads -Duselargefiles
  [stdio] -DCCHOME=C:\mingw-w64\x86_64-6.1.0\mingw64 -Duseithreads
  [stdio] -DCCHOME=C:\mingw-w64\x86_64-6.1.0\mingw64 -Duselargefiles
  [stdio] -DCCHOME=C:\mingw-w64\x86_64-6.1.0\mingw64 -Duseithreads DEBUGGING
  [stdio] -DCCHOME=C:\mingw-w64\x86_64-6.1.0\mingw64 -Duselargefiles DEBUGGING
  [stdio] -DCCHOME=C:\mingw-w64\x86_64-6.1.0\mingw64 DEBUGGING
~~ ../cpan/Module-Metadata/t/contains_pod.t .................... FAILED Non-zero exit status: 255 Bad plan.  You planned 3 tests but ran 0.
  [stdio] -DCCHOME=C:\mingw-w64\x86_64-6.1.0\mingw64 -Duseithreads DEBUGGING
  [stdio] -DCCHOME=C:\mingw-w64\x86_64-6.1.0\mingw64 DEBUGGING
~~ ../cpan/IO-Compress/t/105oneshot-rawdeflate.t ............... FAILED Non-zero exit status: 255 Bad plan.  You planned 1002 tests but ran 997.
  [stdio] -DCCHOME=C:\mingw-w64\x86_64-6.1.0\mingw64 -Duseithreads DEBUGGING
  [stdio] -DCCHOME=C:\mingw-w64\x86_64-6.1.0\mingw64 DEBUGGING
~~ ../cpan/IO-Compress/t/105oneshot-bzip2.t .................... FAILED Non-zero exit status: 255 Bad plan.  You planned 1002 tests but ran 997.
  [stdio] -DCCHOME=C:\mingw-w64\x86_64-6.1.0\mingw64 -Duseithreads DEBUGGING
  [stdio] -DCCHOME=C:\mingw-w64\x86_64-6.1.0\mingw64 DEBUGGING
~~ ../t/io/pvbm.t .............................................. FAILED 8
  [stdio] -DCCHOME=C:\mingw-w64\x86_64-6.1.0\mingw64 -Duseithreads DEBUGGING
  [stdio] -DCCHOME=C:\mingw-w64\x86_64-6.1.0\mingw64 DEBUGGING
~~ ../cpan/Win32/t/GetShortPathName.t .......................... FAILED 2
  [stdio] -DCCHOME=C:\mingw-w64\x86_64-6.1.0\mingw64 -Duseithreads -Duselargefiles DEBUGGING
  [stdio] -DCCHOME=C:\mingw-w64\x86_64-6.1.0\mingw64
  [stdio] -DCCHOME=C:\mingw-w64\x86_64-6.1.0\mingw64 -Duseithreads -Duselargefiles
  [stdio] -DCCHOME=C:\mingw-w64\x86_64-6.1.0\mingw64 -Duseithreads
  [stdio] -DCCHOME=C:\mingw-w64\x86_64-6.1.0\mingw64 -Duselargefiles
  [stdio] -DCCHOME=C:\mingw-w64\x86_64-6.1.0\mingw64 -Duseithreads DEBUGGING
  [stdio] -DCCHOME=C:\mingw-w64\x86_64-6.1.0\mingw64 -Duselargefiles DEBUGGING
  [stdio] -DCCHOME=C:\mingw-w64\x86_64-6.1.0\mingw64 DEBUGGING
~~ ../cpan/Win32/t/Unicode.t ................................... FAILED 1-3 Bad plan.  You planned 12 tests but ran 11.
  [stdio] -DCCHOME=C:\mingw-w64\x86_64-6.1.0\mingw64 -Duseithreads -Duselargefiles DEBUGGING
  [stdio] -DCCHOME=C:\mingw-w64\x86_64-6.1.0\mingw64
  [stdio] -DCCHOME=C:\mingw-w64\x86_64-6.1.0\mingw64 -Duseithreads -Duselargefiles
  [stdio] -DCCHOME=C:\mingw-w64\x86_64-6.1.0\mingw64 -Duseithreads
  [stdio] -DCCHOME=C:\mingw-w64\x86_64-6.1.0\mingw64 -Duselargefiles
  [stdio] -DCCHOME=C:\mingw-w64\x86_64-6.1.0\mingw64 -Duseithreads DEBUGGING
  [stdio] -DCCHOME=C:\mingw-w64\x86_64-6.1.0\mingw64 -Duselargefiles DEBUGGING
  [stdio] -DCCHOME=C:\mingw-w64\x86_64-6.1.0\mingw64 DEBUGGING
~~ ../t/op/incfilter.t ......................................... FAILED Non-zero exit status: 255 No plan found in TAP output
  [stdio] -DCCHOME=C:\mingw-w64\x86_64-6.1.0\mingw64 -Duseithreads DEBUGGING
  [stdio] -DCCHOME=C:\mingw-w64\x86_64-6.1.0\mingw64 DEBUGGING
~~ ../t/op/leaky-magic.t ....................................... FAILED Non-zero exit status: 255 Bad plan.  You planned 72 tests but ran 2.
  [stdio] -DCCHOME=C:\mingw-w64\x86_64-6.1.0\mingw64 -Duseithreads DEBUGGING
  [stdio] -DCCHOME=C:\mingw-w64\x86_64-6.1.0\mingw64 DEBUGGING
~~ ../cpan/IO-Compress/t/105oneshot-deflate.t .................. FAILED Non-zero exit status: 255 Bad plan.  You planned 1002 tests but ran 997.
  [stdio] -DCCHOME=C:\mingw-w64\x86_64-6.1.0\mingw64 -Duseithreads DEBUGGING
  [stdio] -DCCHOME=C:\mingw-w64\x86_64-6.1.0\mingw64 DEBUGGING

Test todo-passed:
~~ ../ext/IPC-Open3/t/IPC-Open3.t .............................. PASSED 25
  [stdio] -DCCHOME=C:\mingw-w64\x86_64-6.1.0\mingw64 -Duseithreads -Duselargefiles DEBUGGING
  [stdio] -DCCHOME=C:\mingw-w64\x86_64-6.1.0\mingw64
  [stdio] -DCCHOME=C:\mingw-w64\x86_64-6.1.0\mingw64 -Duseithreads -Duselargefiles
  [stdio] -DCCHOME=C:\mingw-w64\x86_64-6.1.0\mingw64 -Duseithreads
  [stdio] -DCCHOME=C:\mingw-w64\x86_64-6.1.0\mingw64 -Duselargefiles
  [stdio] -DCCHOME=C:\mingw-w64\x86_64-6.1.0\mingw64 -Duseithreads DEBUGGING
  [stdio] -DCCHOME=C:\mingw-w64\x86_64-6.1.0\mingw64 -Duselargefiles DEBUGGING
  [stdio] -DCCHOME=C:\mingw-w64\x86_64-6.1.0\mingw64 DEBUGGING

MANIFEST messages:

Compiler messages:
  win32.c: In function 'win32_fseek':
  win32.c:2872:24: warning: passing argument 2 of 'fsetpos' from incompatible pointer type [-Wincompatible-pointer-types]
  C:/mingw-w64/x86_64-6.1.0/mingw64/x86_64-w64-mingw32/include/stdio.h:468:15: note: expected 'const fpos_t * {aka const long long int *}' but argument is of type 'long int *'
  RealPPPort.xs: In function 'XS_Devel__PPPort_ptrtests':
  ..\..\lib\CORE/perl.h:1734:26: warning: cast from pointer to integer of different size [-Wpointer-to-int-cast]
  ..\..\lib\CORE/perl.h:1749:21: note: in expansion of macro 'INT2PTR'
  RealPPPort.xs:1598:27: note: in expansion of macro 'PTR2ul'
  POSIX.c: In function 'XS_POSIX__Termios_getattr':
  POSIX.c:2187:17: warning: cast from pointer to integer of different size [-Wpointer-to-int-cast]
  POSIX.c: In function 'XS_POSIX__Termios_setattr':
  POSIX.c:2243:17: warning: cast from pointer to integer of different size [-Wpointer-to-int-cast]
  POSIX.c: In function 'XS_POSIX__Termios_getispeed':
  POSIX.c:2310:17: warning: cast from pointer to integer of different size [-Wpointer-to-int-cast]
  POSIX.c: In function 'XS_POSIX__Termios_getiflag':
  POSIX.c:2341:17: warning: cast from pointer to integer of different size [-Wpointer-to-int-cast]
  POSIX.c: In function 'XS_POSIX__Termios_getcc':
  POSIX.c:2393:17: warning: cast from pointer to integer of different size [-Wpointer-to-int-cast]
  POSIX.c: In function 'XS_POSIX__Termios_setispeed':
  POSIX.c:2432:17: warning: cast from pointer to integer of different size [-Wpointer-to-int-cast]
  POSIX.c: In function 'XS_POSIX__Termios_setiflag':
  POSIX.c:2474:17: warning: cast from pointer to integer of different size [-Wpointer-to-int-cast]
  POSIX.c: In function 'XS_POSIX__Termios_setcc':
  POSIX.c:2522:17: warning: cast from pointer to integer of different size [-Wpointer-to-int-cast]
  POSIX.xs: In function 'XS_POSIX_ctermid':
  POSIX.xs:1454:20: warning: cast to pointer from integer of different size [-Wint-to-pointer-cast]
  POSIX.xs:3695:11: note: in expansion of macro 'ctermid'
  POSIX.c: In function 'XS_POSIX_ttyname':
  POSIX.xs:1373:22: warning: cast to pointer from integer of different size [-Wint-to-pointer-cast]
  POSIX.c:5513:11: note: in expansion of macro 'ttyname'
  Socket.xs: In function 'XS_Socket_pack_sockaddr_un':
  Socket.xs:808:10: warning: cast to pointer from integer of different size [-Wint-to-pointer-cast]
  Socket.xs: In function 'XS_Socket_unpack_sockaddr_un':
  Socket.xs:870:10: warning: cast to pointer from integer of different size [-Wint-to-pointer-cast]
  Socket.xs: In function 'XS_Socket_pack_sockaddr_in6':
  Socket.xs:974:10: warning: cast to pointer from integer of different size [-Wint-to-pointer-cast]
  Socket.xs: In function 'XS_Socket_unpack_sockaddr_in6':
  Socket.xs:1013:10: warning: cast to pointer from integer of different size [-Wint-to-pointer-cast]
  Storable.xs: In function 'known_class':
  Storable.xs:475:31: warning: cast from pointer to integer of different size [-Wpointer-to-int-cast]
  Storable.xs:1978:15: note: in expansion of macro 'LOW_32BITS'
  Storable.xs: In function 'store_scalar':
  Storable.xs:534:3: warning: cast from pointer to integer of different size [-Wpointer-to-int-cast]
  Storable.xs:694:6: note: in expansion of macro 'int_aligned'
  Storable.xs:891:3: note: in expansion of macro 'MBUF_PUTINT'
  Storable.xs:2186:17: note: in expansion of macro 'WRITE_I32'
  Storable.xs:532:20: warning: cast from pointer to integer of different size [-Wpointer-to-int-cast]
  Storable.xs:534:26: note: in expansion of macro 'trunc_int'
  Storable.xs:903:4: note: in expansion of macro 'MBUF_PUTINT'
  Storable.xs:935:3: note: in expansion of macro 'WLEN'
  Storable.xs:2247:17: note: in expansion of macro 'STORE_PV_LEN'
  Storable.xs:908:4: note: in expansion of macro 'MBUF_PUTINT'
  Storable.xs:253:32: note: in expansion of macro 'STORE_PV_LEN'
  Storable.xs:2254:17: note: in expansion of macro 'STORE_UTF8STR'
  Storable.xs:940:31: note: in expansion of macro 'STORE_PV_LEN'
  Storable.xs:2256:17: note: in expansion of macro 'STORE_SCALAR'
  Storable.xs: In function 'store_array':
  Storable.xs:2288:2: note: in expansion of macro 'WLEN'
  Storable.xs: In function 'store_hash':
  Storable.xs:2400:2: note: in expansion of macro 'WLEN'
  Storable.xs:2567:4: note: in expansion of macro 'WLEN'
  Storable.xs:2673:29: note: in expansion of macro 'WLEN'
  Storable.xs: In function 'store_code':
  Storable.xs:2784:3: note: in expansion of macro 'STORE_UTF8STR'
  Storable.xs:2786:3: note: in expansion of macro 'STORE_SCALAR'
  Storable.xs: In function 'store_tied_item':
  Storable.xs:2917:3: note: in expansion of macro 'WLEN'
  Storable.xs: In function 'store_hook':
  Storable.xs:3298:4: note: in expansion of macro 'WLEN'
  Storable.xs:3305:4: note: in expansion of macro 'WLEN'
  Storable.xs:3316:3: note: in expansion of macro 'WLEN'
  Storable.xs:3328:4: note: in expansion of macro 'WLEN'
  Storable.xs:3340:23: note: in expansion of macro 'LOW_32BITS'
  Storable.xs:3341:4: note: in expansion of macro 'WRITE_I32'
  Storable.xs: In function 'store_blessed':
  Storable.xs:3457:4: note: in expansion of macro 'WLEN'
  Storable.xs:3468:4: note: in expansion of macro 'WLEN'
  Storable.xs: In function 'store_other':
  Storable.xs:3519:2: note: in expansion of macro 'STORE_SCALAR'
  Storable.xs: In function 'store':
  Storable.xs:3676:18: note: in expansion of macro 'LOW_32BITS'
  Storable.xs:3685:3: note: in expansion of macro 'WRITE_I32'
  Storable.xs: In function 'retrieve_idx_blessed':
  Storable.xs:632:7: note: in expansion of macro 'int_aligned'
  Storable.xs:983:3: note: in expansion of macro 'MBUF_GETINT'
  Storable.xs:4019:3: note: in expansion of macro 'RLEN'
  Storable.xs: In function 'retrieve_blessed':
  Storable.xs:4070:3: note: in expansion of macro 'RLEN'
  Storable.xs: In function 'retrieve_hook':
  Storable.xs:4232:4: note: in expansion of macro 'RLEN'
  Storable.xs:4255:4: note: in expansion of macro 'RLEN'
  Storable.xs:4297:3: note: in expansion of macro 'RLEN'
  Storable.xs:4319:4: note: in expansion of macro 'RLEN'
  Storable.xs:973:3: note: in expansion of macro 'MBUF_GETINT'
  Storable.xs:4349:4: note: in expansion of macro 'READ_I32'
  Storable.xs: In function 'retrieve_tied_idx':
  Storable.xs:4881:2: note: in expansion of macro 'RLEN'
  Storable.xs: In function 'retrieve_lscalar':
  Storable.xs:4906:2: note: in expansion of macro 'RLEN'
  Storable.xs: In function 'retrieve_lvstring':
  Storable.xs:5113:2: note: in expansion of macro 'RLEN'
  Storable.xs: In function 'retrieve_netint':
  Storable.xs:5175:2: note: in expansion of macro 'READ_I32'
  Storable.xs: In function 'retrieve_array':
  Storable.xs:5362:2: note: in expansion of macro 'RLEN'
  Storable.xs: In function 'retrieve_hash':
  Storable.xs:5423:2: note: in expansion of macro 'RLEN'
  Storable.xs:5453:3: note: in expansion of macro 'RLEN'
  Storable.xs: In function 'retrieve_flag_hash':
  Storable.xs:5512:5: note: in expansion of macro 'RLEN'
  Storable.xs:5586:13: note: in expansion of macro 'RLEN'
  Storable.xs: In function 'old_retrieve_array':
  Storable.xs:5775:2: note: in expansion of macro 'RLEN'
  Storable.xs: In function 'old_retrieve_hash':
  Storable.xs:5838:2: note: in expansion of macro 'RLEN'
  Storable.xs:5884:3: note: in expansion of macro 'RLEN'
  Storable.xs: In function 'retrieve':
  Storable.xs:6187:3: note: in expansion of macro 'READ_I32'
  Storable.xs:6243:5: note: in expansion of macro 'RLEN'
  APItest.c: In function 'XS_XS__APItest__PtrTable_clear':
  APItest.c:3058:2: warning: 'Perl_ptr_table_clear' is deprecated [-Wdeprecated-declarations]
  ..\..\lib\CORE/proto.h:2553:20: note: declared here
  APItest.xs: In function 'XS_XS__APItest__Magic_test_toLOWER_utf8':
  APItest.xs:6227:13: warning: 'Perl_to_utf8_lower' is deprecated [-Wdeprecated-declarations]
  ..\..\lib\CORE/proto.h:3531:18: note: declared here
  APItest.xs: In function 'XS_XS__APItest__Magic_test_toFOLD_utf8':
  APItest.xs:6317:13: warning: 'Perl_to_utf8_fold' is deprecated [-Wdeprecated-declarations]
  ..\..\lib\CORE/proto.h:3524:18: note: declared here
  APItest.xs: In function 'XS_XS__APItest__Magic_test_toUPPER_utf8':
  APItest.xs:6407:13: warning: 'Perl_to_utf8_upper' is deprecated [-Wdeprecated-declarations]
  ..\..\lib\CORE/proto.h:3545:18: note: declared here
  APItest.xs: In function 'XS_XS__APItest__Magic_test_toTITLE_utf8':
  APItest.xs:6490:13: warning: 'Perl_to_utf8_title' is deprecated [-Wdeprecated-declarations]
  ..\..\lib\CORE/proto.h:3538:18: note: declared here
  C:/mingw-w64/x86_64-6.1.0/mingw64/lib/gcc/x86_64-w64-mingw32/6.1.0/include/avx512cdintrin.h:25:2: error: #error "Never use  directly; include  instead."
  compilet.exp:fake:(.edata+0x3c): undefined reference to `boot_compilet'
  t\cplust.exp:fake:(.edata+0x38): undefined reference to `boot_cplust'
  DynaLoader.xs: In function 'XS_DynaLoader_dl_unload_file':
  dlutils.c:66:25: note: in definition of macro 'DLDEBUG'
  DynaLoader.xs:152:71: note: in expansion of macro 'PTR2ul'
  ..\..\lib\CORE/iperlsys.h:1266:30: note: in definition of macro 'PerlSock_htonl'
  threads.xs: In function 'S_jmpenv_run':
  threads.xs:18:23: warning: implicit declaration of function '_setjmpex' [-Wimplicit-function-declaration]
  threads.xs:18:23: note: in definition of macro 'setjmp'
  ..\..\lib\CORE/iperlsys.h:1075:31: note: in expansion of macro 'Sigsetjmp'
  ..\..\lib\CORE/cop.h:105:19: note: in expansion of macro 'PerlProc_setjmp'
  threads.xs:493:5: note: in expansion of macro 'JMPENV_PUSH'
  perllib.c: In function 'void xs_init(PerlInterpreter*)':
  perllib.c:37:18: warning: ISO C++ forbids converting a string constant to 'char*' [-Wwrite-strings]
  perlhost.h: In function 'CPerlHost* IPerlMem2Host(IPerlMem*)':
  perlhost.h:230:63: warning: offsetof within non-standard-layout type 'CPerlHost' is undefined [-Winvalid-offsetof]
  perlhost.h:244:12: note: in expansion of macro 'STRUCT2RAWPTR'
  perlhost.h: In function 'CPerlHost* IPerlMemShared2Host(IPerlMem*)':
  perlhost.h:249:12: note: in expansion of macro 'STRUCT2RAWPTR'
  perlhost.h: In function 'CPerlHost* IPerlMemParse2Host(IPerlMem*)':
  perlhost.h:254:12: note: in expansion of macro 'STRUCT2RAWPTR'
  perlhost.h: In function 'CPerlHost* IPerlEnv2Host(IPerlEnv*)':
  perlhost.h:237:38: note: in expansion of macro 'STRUCT2RAWPTR'
  perlhost.h:259:12: note: in expansion of macro 'STRUCT2PTR'
  perlhost.h: In function 'CPerlHost* IPerlStdIO2Host(IPerlStdIO*)':
  perlhost.h:264:12: note: in expansion of macro 'STRUCT2PTR'
  perlhost.h: In function 'CPerlHost* IPerlLIO2Host(IPerlLIO*)':
  perlhost.h:269:12: note: in expansion of macro 'STRUCT2PTR'
  perlhost.h: In function 'CPerlHost* IPerlDir2Host(IPerlDir*)':
  perlhost.h:274:12: note: in expansion of macro 'STRUCT2PTR'
  perlhost.h: In function 'CPerlHost* IPerlSock2Host(IPerlSock*)':
  perlhost.h:279:12: note: in expansion of macro 'STRUCT2PTR'
  perlhost.h: In function 'CPerlHost* IPerlProc2Host(IPerlProc*)':
  perlhost.h:284:12: note: in expansion of macro 'STRUCT2PTR'
  C:/mingw-w64/x86_64-6.1.0/mingw64/lib/gcc/x86_64-w64-mingw32/6.1.0/include/avx512pfintrin.h:25:2: error: #error "Never use  directly; include  instead."
  C:/mingw-w64/x86_64-6.1.0/mingw64/lib/gcc/x86_64-w64-mingw32/6.1.0/include/ia32intrin.h:25:3: error: #error "Never use  directly; include  instead."
  C:/mingw-w64/x86_64-6.1.0/mingw64/lib/gcc/x86_64-w64-mingw32/6.1.0/include/fmaintrin.h:25:3: error: #error "Never use  directly; include  instead."

About this smoke:
    smoking-perl: 5.24.0
  smoker-version: 1.70_02/0.046
       timestamp: 2017-04-28 09:27:09+02
          tester: buildbot

-- 
Report generated by Test::Smoke::Gateway v0.09