Show logfile
Automated smoke report for branch smoke-me/jkeenan/dire-wolf 7.0.0 patch bd88bd2a72478af4411aa8a4868c294e649d0e00 v5.32.0-64-gbd88bd2a72
cjg-netbsd9: Intel 686-class (amd64/1 cpus)
    on        netbsd 9.0
    using     g++ version 7.4.0 (*1)
    smoketime 8 hours 19 minutes (average 41 minutes 35 seconds)

Summary: FAIL(F)

O = OK  F = Failure(s), extended report at the bottom
X = Failure(s) under TEST but not under harness
? = still running or test results not (yet) available
Build failures during:       - = unknown or N/A
c = Configure, m = make, M = make (after miniperl), t = make test-prep

v5.32.0-64-gbd88bd2a72
---------------------- ----------------------------------------------------
O  O                    -Dcc=g++ (*1)
O  O                    -Dcc=g++ -Duse64bitall (*1)
F  F                    -Dcc=g++ -Duselongdouble (*1)
O  O                    -Dcc=g++ -Duseithreads (*1)
O  O                    -Dcc=g++ -Duseithreads -Duse64bitall (*1)
F  F                    -Dcc=g++ -Duseithreads -Duselongdouble (*1)
|  |
|  +------------------  stdio DEBUGGING
+---------------------  stdio

Applied patches:
  SMOKEbd88bd2a72478af4411aa8a4868c294e649d0e00

Skipped tests:
      # One test name on a line

Test failures:
~~ ../cpan/ExtUtils-MakeMaker/t/03-xsstatic.t .................. FAILED 5 Non-zero exit status: 6
  [stdio] -Dcc=g++ -Duseithreads -Duselongdouble
  [stdio] -Dcc=g++ -Duselongdouble DEBUGGING
  [stdio] -Dcc=g++ -Duseithreads -Duselongdouble DEBUGGING
  [stdio] -Dcc=g++ -Duselongdouble
~~ ../cpan/ExtUtils-MakeMaker/t/basic.t ........................ FAILED 22-28 Non-zero exit status: 7
  [stdio] -Dcc=g++ -Duseithreads -Duselongdouble
  [stdio] -Dcc=g++ -Duselongdouble DEBUGGING
  [stdio] -Dcc=g++ -Duseithreads -Duselongdouble DEBUGGING
  [stdio] -Dcc=g++ -Duselongdouble
~~ ../ext/POSIX/t/math.t ....................................... FAILED Non-zero exit status: 1 No plan found in TAP output
  [stdio] -Dcc=g++ -Duseithreads -Duselongdouble
  [stdio] -Dcc=g++ -Duselongdouble DEBUGGING
  [stdio] -Dcc=g++ -Duseithreads -Duselongdouble DEBUGGING
  [stdio] -Dcc=g++ -Duselongdouble
~~ ../cpan/ExtUtils-MakeMaker/t/02-xsdynamic.t ................. FAILED 5 71 Non-zero exit status: 12
  [stdio] -Dcc=g++ -Duseithreads -Duselongdouble
  [stdio] -Dcc=g++ -Duselongdouble DEBUGGING
  [stdio] -Dcc=g++ -Duseithreads -Duselongdouble DEBUGGING
  [stdio] -Dcc=g++ -Duselongdouble

Test todo-passed:

MANIFEST messages:
  MANIFEST did not declare '.mailmap'

Compiler messages:
  /usr/include/sys/cdefs_elf.h:67:20: error: missing binary operator before token "("
  /usr/include/sys/cdefs_elf.h:73:20: error: missing binary operator before token "("
  /usr/include/sys/cdefs_elf.h:79:20: error: missing binary operator before token "("
  inflate.c: In function 'int inflate(z_streamp, int)':
  inflate.c:724:25: warning: this statement may fall through [-Wimplicit-fallthrough=]
  inflate.c:725:9: note: here
  inflate.c:732:25: warning: this statement may fall through [-Wimplicit-fallthrough=]
  inflate.c:733:9: note: here
  inflate.c:947:25: warning: this statement may fall through [-Wimplicit-fallthrough=]
  inflate.c:948:9: note: here
  inflate.c:968:25: warning: this statement may fall through [-Wimplicit-fallthrough=]
  inflate.c:969:9: note: here
  DB_File.xs: In function 'DB_File_type* ParseOpenInfo(int, char*, int, int, SV*)':
  DB_File.xs:476:44: warning: suggest braces around empty body in an 'if' statement [-Wempty-body]
  DB_File.xs:1044:13: note: in expansion of macro 'croak_and_free'
  DB_File.xs:1050:13: note: in expansion of macro 'croak_and_free'
  DB_File.xs:1056:17: note: in expansion of macro 'croak_and_free'
  DB_File.xs:1091:17: note: in expansion of macro 'croak_and_free'
  DB_File.xs:1140:17: note: in expansion of macro 'croak_and_free'
  DB_File.xs:1229:13: note: in expansion of macro 'croak_and_free'
  Socket.c: In function 'void XS_Socket_pack_ip_mreq_source(CV*)':
  Socket.c:1673:7: warning: variable 'interface' set but not used [-Wunused-but-set-variable]
  const-c.inc: In function 'int constant_19(const char*, IV*)':
  const-c.inc:351:42: warning: unused parameter 'iv_return' [-Wunused-parameter]
  HiRes.xs: In function 'void XS_Time__HiRes_setitimer(CV*)':
  HiRes.xs:1438:42: warning: option '-Wc++-compat' is valid for C/ObjC but not for C++ [-Wpragmas]
  HiRes.xs: In function 'void XS_Time__HiRes_getitimer(CV*)':
  HiRes.xs:1458:42: warning: option '-Wc++-compat' is valid for C/ObjC but not for C++ [-Wpragmas]
  Piece.xs: In function 'char* _strptime(const char*, const char*, tm*, int*)':
  Piece.xs:719:8: warning: 'len' may be used uninitialized in this function [-Wmaybe-uninitialized]
  re_exec.c: In function 'bool S_regtry(regmatch_info*, char**)':
  re_exec.c:6539:38: warning: 'fold_array' may be used uninitialized in this function [-Wmaybe-uninitialized]
  re_exec.c:6443:17: note: 'fold_array' was declared here
  re_exec.c:6545:28: warning: 'folder' may be used uninitialized in this function [-Wmaybe-uninitialized]
  re_exec.c:6442:16: note: 'folder' was declared here
  regexec.c: In function 'bool S_regtry(regmatch_info*, char**)':
  regexec.c:6539:38: warning: 'fold_array' may be used uninitialized in this function [-Wmaybe-uninitialized]
  regexec.c:6443:17: note: 'fold_array' was declared here
  regexec.c:6545:28: warning: 'folder' may be used uninitialized in this function [-Wmaybe-uninitialized]
  regexec.c:6442:16: note: 'folder' was declared here
  time64.c: In function 'TM64* Perl_localtime64_r(const Time64_T*, TM64*)':
  time64.c:573:30: warning: 'orig_year' may be used uninitialized in this function [-Wmaybe-uninitialized]
  DB_File.xs: In function 'DB_File_type* ParseOpenInfo(PerlInterpreter*, int, char*, int, int, SV*)':
  Socket.c: In function 'void XS_Socket_pack_ip_mreq_source(PerlInterpreter*, CV*)':
  const-c.inc: In function 'int constant_19(PerlInterpreter*, const char*, IV*)':
  HiRes.xs: In function 'void XS_Time__HiRes_setitimer(PerlInterpreter*, CV*)':
  HiRes.xs: In function 'void XS_Time__HiRes_getitimer(PerlInterpreter*, CV*)':
  Piece.xs: In function 'char* _strptime(PerlInterpreter*, const char*, const char*, tm*, int*)':
  re_exec.c: In function 'bool S_regtry(PerlInterpreter*, regmatch_info*, char**)':
  regexec.c: In function 'bool S_regtry(PerlInterpreter*, regmatch_info*, char**)':

About this smoke:
    smoking-perl: 5.26.1
  smoker-version: 1.71/0.046
       timestamp: 2020-07-30 10:43:02+00
          tester: core

-- 
Report generated by Test::Smoke::Gateway v0.09_01