Show logfile
Automated smoke report for branch smoke-me/jkeenan/sugar-magnolia 7.0.0 patch 39568decb91df7e01426bdd32a20f626e3953186 v5.32.0-586-g39568decb9
cjg-fedora31: Intel(R) Xeon(R) CPU E5-2620 v2 @ 2.10GHz (GenuineIntel 2110MHz) (x86_64/1 cpus)
    on        linux 5.7.7-100.fc31.x86_64 [Fedora 31 (Server Edition)]
    using     g++ version 9.3.1 20200408 (Red Hat 9.3.1-2) (*1)
    smoketime 4 hours 40 minutes (average 23 minutes 24 seconds)

Summary: FAIL(FM)

O = OK  F = Failure(s), extended report at the bottom
X = Failure(s) under TEST but not under harness
? = still running or test results not (yet) available
Build failures during:       - = unknown or N/A
c = Configure, m = make, M = make (after miniperl), t = make test-prep

v5.32.0-586-g39568decb9
---------------------- ----------------------------------------------------
-  F  -  F              -Dcc=g++ (*1)
-  F  -  F              -Dcc=g++ -Duse64bitall (*1)
-  F  -  F              -Dcc=g++ -Dusequadmath (*1)
M  -  M  -              -Dcc=g++ -Duseithreads (*1)
M  -  M  -              -Dcc=g++ -Duseithreads -Duse64bitall (*1)
M  -  M  -              -Dcc=g++ -Duseithreads -Dusequadmath (*1)
|  |  |  |
|  |  |  +------------  stdio DEBUGGING
|  |  +---------------  minitest DEBUGGING
|  +------------------  stdio
+---------------------  minitest

Applied patches:
  SMOKE39568decb91df7e01426bdd32a20f626e3953186

Skipped tests:
      # One test name on a line

Test failures:
~~ ../cpan/Test-Simple/t/Test2/acceptance/try_it_fork.t ........ FAILED Non-zero exit status: 255 No plan found in TAP output
  [stdio] -Dcc=g++ -Duse64bitall
  [stdio] -Dcc=g++ -Dusequadmath
  [stdio] -Dcc=g++ DEBUGGING
  [stdio] -Dcc=g++
  [stdio] -Dcc=g++ -Dusequadmath DEBUGGING
  [stdio] -Dcc=g++ -Duse64bitall DEBUGGING
~~ ../cpan/Tie-RefHash/t/storable.t ............................ FAILED Non-zero exit status: 255 No plan found in TAP output
  [stdio] -Dcc=g++ -Duse64bitall
  [stdio] -Dcc=g++ -Dusequadmath
  [stdio] -Dcc=g++ DEBUGGING
  [stdio] -Dcc=g++
  [stdio] -Dcc=g++ -Dusequadmath DEBUGGING
  [stdio] -Dcc=g++ -Duse64bitall DEBUGGING
~~ ../cpan/Test-Simple/t/Legacy/Builder/current_test.t ......... FAILED Non-zero exit status: 255 No plan found in TAP output
  [stdio] -Dcc=g++ -Duse64bitall
  [stdio] -Dcc=g++ -Dusequadmath
  [stdio] -Dcc=g++ DEBUGGING
  [stdio] -Dcc=g++
  [stdio] -Dcc=g++ -Dusequadmath DEBUGGING
  [stdio] -Dcc=g++ -Duse64bitall DEBUGGING
~~ ../ext/XS-APItest/t/svpv_magic.t ............................ FAILED 9-10 Non-zero exit status: 2
  [stdio] -Dcc=g++ -Duse64bitall
  [stdio] -Dcc=g++ -Dusequadmath
  [stdio] -Dcc=g++ DEBUGGING
  [stdio] -Dcc=g++
  [stdio] -Dcc=g++ -Dusequadmath DEBUGGING
  [stdio] -Dcc=g++ -Duse64bitall DEBUGGING
~~ ../cpan/Text-ParseWords/t/ParseWords.t ...................... FAILED Non-zero exit status: 255 Bad plan.  You planned 27 tests but ran 0.
  [stdio] -Dcc=g++ -Duse64bitall
  [stdio] -Dcc=g++ -Dusequadmath
  [stdio] -Dcc=g++ DEBUGGING
  [stdio] -Dcc=g++
  [stdio] -Dcc=g++ -Dusequadmath DEBUGGING
  [stdio] -Dcc=g++ -Duse64bitall DEBUGGING
~~ ../cpan/Test-Simple/t/Legacy/Regression/736_use_ok.t ........ FAILED Non-zero exit status: 255 No plan found in TAP output
  [stdio] -Dcc=g++ -Duse64bitall
  [stdio] -Dcc=g++ -Dusequadmath
  [stdio] -Dcc=g++ DEBUGGING
  [stdio] -Dcc=g++
  [stdio] -Dcc=g++ -Dusequadmath DEBUGGING
  [stdio] -Dcc=g++ -Duse64bitall DEBUGGING
~~ ../t/porting/utils.t ........................................ FAILED 17
  [stdio] -Dcc=g++ -Duse64bitall
  [stdio] -Dcc=g++ -Dusequadmath
  [stdio] -Dcc=g++ DEBUGGING
  [stdio] -Dcc=g++
  [stdio] -Dcc=g++ -Dusequadmath DEBUGGING
  [stdio] -Dcc=g++ -Duse64bitall DEBUGGING
~~ ../cpan/ExtUtils-MakeMaker/t/cd.t ........................... FAILED Non-zero exit status: 255 Bad plan.  You planned 4 tests but ran 0.
  [stdio] -Dcc=g++ -Duse64bitall
  [stdio] -Dcc=g++ -Dusequadmath
  [stdio] -Dcc=g++ DEBUGGING
  [stdio] -Dcc=g++
  [stdio] -Dcc=g++ -Dusequadmath DEBUGGING
  [stdio] -Dcc=g++ -Duse64bitall DEBUGGING
~~ ../ext/POSIX/t/posix.t ...................................... FAILED Non-zero exit status: 255 No plan found in TAP output
  [stdio] -Dcc=g++ -Duse64bitall
  [stdio] -Dcc=g++ -Dusequadmath
  [stdio] -Dcc=g++ DEBUGGING
  [stdio] -Dcc=g++
  [stdio] -Dcc=g++ -Dusequadmath DEBUGGING
  [stdio] -Dcc=g++ -Duse64bitall DEBUGGING
~~ ../cpan/Pod-Checker/t/pod/selfcheck.t ....................... FAILED Non-zero exit status: 255 No plan found in TAP output
  [stdio] -Dcc=g++ -Duse64bitall
  [stdio] -Dcc=g++ -Dusequadmath
  [stdio] -Dcc=g++ DEBUGGING
  [stdio] -Dcc=g++
  [stdio] -Dcc=g++ -Dusequadmath DEBUGGING
  [stdio] -Dcc=g++ -Duse64bitall DEBUGGING
~~ ../lib/locale.t ............................................. FAILED Non-zero exit status: 255 No plan found in TAP output
  [stdio] -Dcc=g++ -Duse64bitall
  [stdio] -Dcc=g++ -Dusequadmath
  [stdio] -Dcc=g++ DEBUGGING
  [stdio] -Dcc=g++
  [stdio] -Dcc=g++ -Dusequadmath DEBUGGING
  [stdio] -Dcc=g++ -Duse64bitall DEBUGGING
~~ ../dist/Storable/t/regexp.t ................................. FAILED Non-zero exit status: 255 Bad plan.  You planned 64 tests but ran 4.
  [stdio] -Dcc=g++ -Duse64bitall
  [stdio] -Dcc=g++ -Dusequadmath
  [stdio] -Dcc=g++
~~ ../cpan/ExtUtils-MakeMaker/t/min_perl_version.t ............. FAILED 16 Non-zero exit status: 1
  [stdio] -Dcc=g++ -Duse64bitall
  [stdio] -Dcc=g++ -Dusequadmath
  [stdio] -Dcc=g++ DEBUGGING
  [stdio] -Dcc=g++
  [stdio] -Dcc=g++ -Dusequadmath DEBUGGING
  [stdio] -Dcc=g++ -Duse64bitall DEBUGGING
~~ ../dist/Storable/t/downgrade.t .............................. FAILED 13-14 61-63 109-110 Non-zero exit status: 34
  [stdio] -Dcc=g++ -Duse64bitall
~~ ../cpan/version/t/07locale.t ................................ FAILED Non-zero exit status: 255 Bad plan.  You planned 8 tests but ran 1.
  [stdio] -Dcc=g++ -Duse64bitall
  [stdio] -Dcc=g++ -Dusequadmath
  [stdio] -Dcc=g++ DEBUGGING
  [stdio] -Dcc=g++
  [stdio] -Dcc=g++ -Dusequadmath DEBUGGING
  [stdio] -Dcc=g++ -Duse64bitall DEBUGGING
~~ ../lib/sigtrap.t ............................................ FAILED 13
  [stdio] -Dcc=g++ -Duse64bitall
  [stdio] -Dcc=g++ -Dusequadmath
  [stdio] -Dcc=g++ DEBUGGING
  [stdio] -Dcc=g++
  [stdio] -Dcc=g++ -Dusequadmath DEBUGGING
  [stdio] -Dcc=g++ -Duse64bitall DEBUGGING
~~ ../ext/B/t/optree_concise.t ................................. FAILED Non-zero exit status: 255 No plan found in TAP output
  [stdio] -Dcc=g++ -Duse64bitall
  [stdio] -Dcc=g++ -Dusequadmath
  [stdio] -Dcc=g++ DEBUGGING
  [stdio] -Dcc=g++
  [stdio] -Dcc=g++ -Dusequadmath DEBUGGING
  [stdio] -Dcc=g++ -Duse64bitall DEBUGGING
~~ ../ext/B/t/optree_specials.t ................................ FAILED 3
  [stdio] -Dcc=g++ -Duse64bitall
  [stdio] -Dcc=g++ -Dusequadmath
  [stdio] -Dcc=g++ DEBUGGING
  [stdio] -Dcc=g++
  [stdio] -Dcc=g++ -Dusequadmath DEBUGGING
  [stdio] -Dcc=g++ -Duse64bitall DEBUGGING
~~ ../cpan/Test-Simple/t/Legacy/is_deeply_fail.t ............... FAILED Non-zero exit status: 255 No plan found in TAP output
  [stdio] -Dcc=g++ -Duse64bitall
  [stdio] -Dcc=g++ -Dusequadmath
  [stdio] -Dcc=g++ DEBUGGING
  [stdio] -Dcc=g++
  [stdio] -Dcc=g++ -Dusequadmath DEBUGGING
  [stdio] -Dcc=g++ -Duse64bitall DEBUGGING
~~ ../cpan/ExtUtils-MakeMaker/t/eu_command.t ................... FAILED Non-zero exit status: 255 No plan found in TAP output
  [stdio] -Dcc=g++ -Duse64bitall
  [stdio] -Dcc=g++ -Dusequadmath
  [stdio] -Dcc=g++ DEBUGGING
  [stdio] -Dcc=g++
  [stdio] -Dcc=g++ -Dusequadmath DEBUGGING
  [stdio] -Dcc=g++ -Duse64bitall DEBUGGING
~~ ../ext/FileCache/t/05override.t ............................. FAILED Non-zero exit status: 25 Bad plan.  You planned 1 tests but ran 0.
  [stdio] -Dcc=g++ -Duse64bitall
  [stdio] -Dcc=g++ -Dusequadmath
  [stdio] -Dcc=g++ DEBUGGING
  [stdio] -Dcc=g++
  [stdio] -Dcc=g++ -Dusequadmath DEBUGGING
  [stdio] -Dcc=g++ -Duse64bitall DEBUGGING
~~ ../cpan/Compress-Raw-Zlib/t/18lvalue.t ...................... FAILED Non-zero exit status: 255 No plan found in TAP output
  [stdio] -Dcc=g++ -Duse64bitall
  [stdio] -Dcc=g++ -Dusequadmath
  [stdio] -Dcc=g++ DEBUGGING
  [stdio] -Dcc=g++
  [stdio] -Dcc=g++ -Dusequadmath DEBUGGING
  [stdio] -Dcc=g++ -Duse64bitall DEBUGGING
~~ ../dist/Storable/t/weak.t ................................... FAILED No plan found in TAP output
  [stdio] -Dcc=g++ DEBUGGING
  [stdio] -Dcc=g++ -Dusequadmath DEBUGGING
  [stdio] -Dcc=g++ -Duse64bitall DEBUGGING
~~ ../cpan/Text-Balanced/t/03_extcbk.t ......................... FAILED Non-zero exit status: 255 Bad plan.  You planned 41 tests but ran 0.
  [stdio] -Dcc=g++ -Duse64bitall
  [stdio] -Dcc=g++ -Dusequadmath
  [stdio] -Dcc=g++ DEBUGGING
  [stdio] -Dcc=g++
  [stdio] -Dcc=g++ -Dusequadmath DEBUGGING
  [stdio] -Dcc=g++ -Duse64bitall DEBUGGING
~~ ../cpan/Test-Simple/t/Test2/acceptance/try_it_threads.t ..... FAILED Non-zero exit status: 255 No plan found in TAP output
  [stdio] -Dcc=g++ -Duse64bitall
  [stdio] -Dcc=g++ -Dusequadmath
  [stdio] -Dcc=g++ DEBUGGING
  [stdio] -Dcc=g++
  [stdio] -Dcc=g++ -Dusequadmath DEBUGGING
  [stdio] -Dcc=g++ -Duse64bitall DEBUGGING
~~ ../ext/B/t/optree_samples.t ................................. FAILED Non-zero exit status: 2 No plan found in TAP output
  [stdio] -Dcc=g++ -Duse64bitall
  [stdio] -Dcc=g++ -Dusequadmath
  [stdio] -Dcc=g++ DEBUGGING
  [stdio] -Dcc=g++
  [stdio] -Dcc=g++ -Dusequadmath DEBUGGING
  [stdio] -Dcc=g++ -Duse64bitall DEBUGGING
~~ ../cpan/Compress-Raw-Bzip2/t/19nonpv.t ...................... FAILED Non-zero exit status: 255 No plan found in TAP output
  [stdio] -Dcc=g++ -Duse64bitall
  [stdio] -Dcc=g++ -Dusequadmath
  [stdio] -Dcc=g++ DEBUGGING
  [stdio] -Dcc=g++
  [stdio] -Dcc=g++ -Dusequadmath DEBUGGING
  [stdio] -Dcc=g++ -Duse64bitall DEBUGGING
~~ ../ext/B/t/optree_constants.t ............................... FAILED Non-zero exit status: 2 No plan found in TAP output
  [stdio] -Dcc=g++ -Duse64bitall
  [stdio] -Dcc=g++ -Dusequadmath
  [stdio] -Dcc=g++ DEBUGGING
  [stdio] -Dcc=g++
  [stdio] -Dcc=g++ -Dusequadmath DEBUGGING
  [stdio] -Dcc=g++ -Duse64bitall DEBUGGING
~~ ../dist/Storable/t/downgrade.t .............................. FAILED 13-14 66-67 125-127 Non-zero exit status: 30
  [stdio] -Dcc=g++
~~ ../cpan/Test-Simple/t/Test2/modules/API/Context.t ........... FAILED Non-zero exit status: 255 No plan found in TAP output
  [stdio] -Dcc=g++ -Duse64bitall
  [stdio] -Dcc=g++ -Dusequadmath
  [stdio] -Dcc=g++ DEBUGGING
  [stdio] -Dcc=g++
  [stdio] -Dcc=g++ -Dusequadmath DEBUGGING
  [stdio] -Dcc=g++ -Duse64bitall DEBUGGING
~~ ../dist/Devel-PPPort/t/ppphtest.t ........................... FAILED 5-13 50-53 83-84 118-132 152-161 202-204 Bad plan.  You planned 238 tests but ran 209.
  [stdio] -Dcc=g++ -Duse64bitall
  [stdio] -Dcc=g++ -Dusequadmath
  [stdio] -Dcc=g++ DEBUGGING
  [stdio] -Dcc=g++
  [stdio] -Dcc=g++ -Dusequadmath DEBUGGING
  [stdio] -Dcc=g++ -Duse64bitall DEBUGGING
~~ ../ext/File-Glob/t/case.t ................................... FAILED Non-zero exit status: 2 No plan found in TAP output
  [stdio] -Dcc=g++ -Duse64bitall
  [stdio] -Dcc=g++ -Dusequadmath
  [stdio] -Dcc=g++ DEBUGGING
  [stdio] -Dcc=g++
  [stdio] -Dcc=g++ -Dusequadmath DEBUGGING
  [stdio] -Dcc=g++ -Duse64bitall DEBUGGING
~~ ../dist/Exporter/t/warn.t ................................... FAILED Non-zero exit status: 255 No plan found in TAP output
  [stdio] -Dcc=g++ -Duse64bitall
  [stdio] -Dcc=g++ -Dusequadmath
  [stdio] -Dcc=g++ DEBUGGING
  [stdio] -Dcc=g++
  [stdio] -Dcc=g++ -Dusequadmath DEBUGGING
  [stdio] -Dcc=g++ -Duse64bitall DEBUGGING
~~ ../ext/B/t/optree_misc.t .................................... FAILED Non-zero exit status: 255 No plan found in TAP output
  [stdio] -Dcc=g++ -Duse64bitall
  [stdio] -Dcc=g++ -Dusequadmath
  [stdio] -Dcc=g++ DEBUGGING
  [stdio] -Dcc=g++
  [stdio] -Dcc=g++ -Dusequadmath DEBUGGING
  [stdio] -Dcc=g++ -Duse64bitall DEBUGGING
~~ ../ext/POSIX/t/sigaction.t .................................. FAILED Non-zero exit status: 255 Bad plan.  You planned 36 tests but ran 0.
  [stdio] -Dcc=g++ -Duse64bitall
  [stdio] -Dcc=g++ -Dusequadmath
  [stdio] -Dcc=g++ DEBUGGING
  [stdio] -Dcc=g++
  [stdio] -Dcc=g++ -Dusequadmath DEBUGGING
  [stdio] -Dcc=g++ -Duse64bitall DEBUGGING
~~ ../cpan/Test-Simple/t/regression/todo_and_facets.t .......... FAILED Non-zero exit status: 255 No plan found in TAP output
  [stdio] -Dcc=g++ -Duse64bitall
  [stdio] -Dcc=g++ -Dusequadmath
  [stdio] -Dcc=g++ DEBUGGING
  [stdio] -Dcc=g++
  [stdio] -Dcc=g++ -Dusequadmath DEBUGGING
  [stdio] -Dcc=g++ -Duse64bitall DEBUGGING
~~ ../ext/Fcntl/t/mode.t ....................................... FAILED Non-zero exit status: 255 No plan found in TAP output
  [stdio] -Dcc=g++ -Duse64bitall
  [stdio] -Dcc=g++ -Dusequadmath
  [stdio] -Dcc=g++ DEBUGGING
  [stdio] -Dcc=g++
  [stdio] -Dcc=g++ -Dusequadmath DEBUGGING
  [stdio] -Dcc=g++ -Duse64bitall DEBUGGING
~~ ../cpan/Test-Simple/t/Legacy/buffer.t ....................... FAILED Non-zero exit status: 255 Bad plan.  You planned 20 tests but ran 0.
  [stdio] -Dcc=g++ -Duse64bitall
  [stdio] -Dcc=g++ -Dusequadmath
  [stdio] -Dcc=g++ DEBUGGING
  [stdio] -Dcc=g++
  [stdio] -Dcc=g++ -Dusequadmath DEBUGGING
  [stdio] -Dcc=g++ -Duse64bitall DEBUGGING
~~ ../ext/POSIX/t/mb.t ......................................... FAILED Non-zero exit status: 255 No plan found in TAP output
  [stdio] -Dcc=g++ -Duse64bitall
  [stdio] -Dcc=g++ -Dusequadmath
  [stdio] -Dcc=g++ DEBUGGING
  [stdio] -Dcc=g++
  [stdio] -Dcc=g++ -Dusequadmath DEBUGGING
  [stdio] -Dcc=g++ -Duse64bitall DEBUGGING
~~ ../ext/XS-APItest/t/xs_special_subs_require.t ............... FAILED 71-73 Non-zero exit status: 3
  [stdio] -Dcc=g++ -Duse64bitall
  [stdio] -Dcc=g++ -Dusequadmath
  [stdio] -Dcc=g++ DEBUGGING
  [stdio] -Dcc=g++
  [stdio] -Dcc=g++ -Dusequadmath DEBUGGING
  [stdio] -Dcc=g++ -Duse64bitall DEBUGGING
~~ ../lib/Symbol.t ............................................. FAILED Non-zero exit status: 255 Bad plan.  You planned 26 tests but ran 0.
  [stdio] -Dcc=g++ -Duse64bitall
  [stdio] -Dcc=g++ -Dusequadmath
  [stdio] -Dcc=g++ DEBUGGING
  [stdio] -Dcc=g++
  [stdio] -Dcc=g++ -Dusequadmath DEBUGGING
  [stdio] -Dcc=g++ -Duse64bitall DEBUGGING
~~ ../cpan/Pod-Checker/t/pod/poderrs.t ......................... FAILED Non-zero exit status: 255 No plan found in TAP output
  [stdio] -Dcc=g++ -Duse64bitall
  [stdio] -Dcc=g++ -Dusequadmath
  [stdio] -Dcc=g++ DEBUGGING
  [stdio] -Dcc=g++
  [stdio] -Dcc=g++ -Dusequadmath DEBUGGING
  [stdio] -Dcc=g++ -Duse64bitall DEBUGGING
~~ ../ext/POSIX/t/taint.t ...................................... FAILED Non-zero exit status: 255 No plan found in TAP output
  [stdio] -Dcc=g++ -Duse64bitall
  [stdio] -Dcc=g++ -Dusequadmath
  [stdio] -Dcc=g++ DEBUGGING
  [stdio] -Dcc=g++
  [stdio] -Dcc=g++ -Dusequadmath DEBUGGING
  [stdio] -Dcc=g++ -Duse64bitall DEBUGGING
~~ ../ext/File-Find/t/find.t ................................... FAILED Non-zero exit status: 2 No plan found in TAP output
  [stdio] -Dcc=g++ -Duse64bitall
  [stdio] -Dcc=g++ -Dusequadmath
  [stdio] -Dcc=g++ DEBUGGING
  [stdio] -Dcc=g++
  [stdio] -Dcc=g++ -Dusequadmath DEBUGGING
  [stdio] -Dcc=g++ -Duse64bitall DEBUGGING
~~ ../dist/Data-Dumper/t/qr.t .................................. FAILED 1-2 Non-zero exit status: 2
  [stdio] -Dcc=g++ -Duse64bitall
  [stdio] -Dcc=g++ -Dusequadmath
  [stdio] -Dcc=g++ DEBUGGING
  [stdio] -Dcc=g++
  [stdio] -Dcc=g++ -Dusequadmath DEBUGGING
  [stdio] -Dcc=g++ -Duse64bitall DEBUGGING
~~ ../cpan/Compress-Raw-Zlib/t/09limitoutput.t ................. FAILED Non-zero exit status: 255 No plan found in TAP output
  [stdio] -Dcc=g++ -Duse64bitall
  [stdio] -Dcc=g++ -Dusequadmath
  [stdio] -Dcc=g++ DEBUGGING
  [stdio] -Dcc=g++
  [stdio] -Dcc=g++ -Dusequadmath DEBUGGING
  [stdio] -Dcc=g++ -Duse64bitall DEBUGGING
~~ ../dist/ExtUtils-CBuilder/t/00-have-compiler.t .............. FAILED Non-zero exit status: 255 No plan found in TAP output
  [stdio] -Dcc=g++ -Duse64bitall
  [stdio] -Dcc=g++ -Dusequadmath
  [stdio] -Dcc=g++ DEBUGGING
  [stdio] -Dcc=g++
  [stdio] -Dcc=g++ -Dusequadmath DEBUGGING
  [stdio] -Dcc=g++ -Duse64bitall DEBUGGING
~~ ../cpan/Compress-Raw-Bzip2/t/09limitoutput.t ................ FAILED Non-zero exit status: 255 No plan found in TAP output
  [stdio] -Dcc=g++ -Duse64bitall
  [stdio] -Dcc=g++ -Dusequadmath
  [stdio] -Dcc=g++ DEBUGGING
  [stdio] -Dcc=g++
  [stdio] -Dcc=g++ -Dusequadmath DEBUGGING
  [stdio] -Dcc=g++ -Duse64bitall DEBUGGING
~~ ../cpan/version/t/01base.t .................................. FAILED Non-zero exit status: 255
  [stdio] -Dcc=g++ -Duse64bitall
  [stdio] -Dcc=g++ -Dusequadmath
  [stdio] -Dcc=g++ DEBUGGING
  [stdio] -Dcc=g++
  [stdio] -Dcc=g++ -Dusequadmath DEBUGGING
  [stdio] -Dcc=g++ -Duse64bitall DEBUGGING
~~ ../dist/Data-Dumper/t/dumper.t .............................. FAILED 1 Non-zero exit status: 2 Bad plan.  You planned 468 tests but ran 36.
  [stdio] -Dcc=g++ -Duse64bitall
  [stdio] -Dcc=g++ -Dusequadmath
  [stdio] -Dcc=g++ DEBUGGING
  [stdio] -Dcc=g++
  [stdio] -Dcc=g++ -Dusequadmath DEBUGGING
  [stdio] -Dcc=g++ -Duse64bitall DEBUGGING
~~ ../cpan/Test-Simple/t/Legacy/todo.t ......................... FAILED Non-zero exit status: 255 No plan found in TAP output
  [stdio] -Dcc=g++ -Duse64bitall
  [stdio] -Dcc=g++ -Dusequadmath
  [stdio] -Dcc=g++ DEBUGGING
  [stdio] -Dcc=g++
  [stdio] -Dcc=g++ -Dusequadmath DEBUGGING
  [stdio] -Dcc=g++ -Duse64bitall DEBUGGING
~~ ../t/porting/regen.t ........................................ FAILED 20-21
  [stdio] -Dcc=g++ -Duse64bitall
  [stdio] -Dcc=g++ -Dusequadmath
  [stdio] -Dcc=g++ DEBUGGING
  [stdio] -Dcc=g++
  [stdio] -Dcc=g++ -Dusequadmath DEBUGGING
  [stdio] -Dcc=g++ -Duse64bitall DEBUGGING
~~ ../lib/B/Deparse-subclass.t ................................. FAILED Non-zero exit status: 255 Bad plan.  You planned 2 tests but ran 0.
  [stdio] -Dcc=g++ -Duse64bitall
  [stdio] -Dcc=g++ -Dusequadmath
  [stdio] -Dcc=g++ DEBUGGING
  [stdio] -Dcc=g++
  [stdio] -Dcc=g++ -Dusequadmath DEBUGGING
  [stdio] -Dcc=g++ -Duse64bitall DEBUGGING
~~ ../dist/Storable/t/downgrade.t .............................. FAILED 13 77 130-131 Non-zero exit status: 24
  [stdio] -Dcc=g++ -Dusequadmath DEBUGGING
~~ ../cpan/Compress-Raw-Zlib/t/07bufsize.t ..................... FAILED Non-zero exit status: 255 No plan found in TAP output
  [stdio] -Dcc=g++ -Duse64bitall
  [stdio] -Dcc=g++ -Dusequadmath
  [stdio] -Dcc=g++ DEBUGGING
  [stdio] -Dcc=g++
  [stdio] -Dcc=g++ -Dusequadmath DEBUGGING
  [stdio] -Dcc=g++ -Duse64bitall DEBUGGING
~~ ../cpan/Time-Piece/t/07arith.t .............................. FAILED Non-zero exit status: 255 Bad plan.  You planned 43 tests but ran 2.
  [stdio] -Dcc=g++ -Duse64bitall
  [stdio] -Dcc=g++ -Dusequadmath
  [stdio] -Dcc=g++ DEBUGGING
  [stdio] -Dcc=g++
  [stdio] -Dcc=g++ -Dusequadmath DEBUGGING
  [stdio] -Dcc=g++ -Duse64bitall DEBUGGING
~~ ../cpan/IPC-SysV/t/msg.t .................................... FAILED Non-zero exit status: 255 No plan found in TAP output
  [stdio] -Dcc=g++ -Duse64bitall
  [stdio] -Dcc=g++ -Dusequadmath
  [stdio] -Dcc=g++ DEBUGGING
  [stdio] -Dcc=g++
  [stdio] -Dcc=g++ -Dusequadmath DEBUGGING
  [stdio] -Dcc=g++ -Duse64bitall DEBUGGING
~~ ../cpan/Test-Simple/t/Legacy/fail-more.t .................... FAILED Non-zero exit status: 255 No plan found in TAP output
  [stdio] -Dcc=g++ -Duse64bitall
  [stdio] -Dcc=g++ -Dusequadmath
  [stdio] -Dcc=g++ DEBUGGING
  [stdio] -Dcc=g++
  [stdio] -Dcc=g++ -Dusequadmath DEBUGGING
  [stdio] -Dcc=g++ -Duse64bitall DEBUGGING
~~ ../ext/B/t/concise-xs.t ..................................... FAILED Non-zero exit status: 255
  [stdio] -Dcc=g++ -Duse64bitall
  [stdio] -Dcc=g++ -Dusequadmath
  [stdio] -Dcc=g++ DEBUGGING
  [stdio] -Dcc=g++
  [stdio] -Dcc=g++ -Dusequadmath DEBUGGING
  [stdio] -Dcc=g++ -Duse64bitall DEBUGGING
~~ ../ext/B/t/pragma.t ......................................... FAILED Non-zero exit status: 255 Bad plan.  You planned 12 tests but ran 0.
  [stdio] -Dcc=g++ -Duse64bitall
  [stdio] -Dcc=g++ -Dusequadmath
  [stdio] -Dcc=g++ DEBUGGING
  [stdio] -Dcc=g++
  [stdio] -Dcc=g++ -Dusequadmath DEBUGGING
  [stdio] -Dcc=g++ -Duse64bitall DEBUGGING
~~ ../lib/warnings.t ........................................... FAILED 1-8 133 188 231-232 267-268 298 345 369 431-436 459-471 491-498 523-526 614-617 640 668 705-708 739 796 829 857 911-913
  [stdio] -Dcc=g++ -Duse64bitall
  [stdio] -Dcc=g++ -Dusequadmath
  [stdio] -Dcc=g++ DEBUGGING
  [stdio] -Dcc=g++
  [stdio] -Dcc=g++ -Dusequadmath DEBUGGING
  [stdio] -Dcc=g++ -Duse64bitall DEBUGGING
~~ ../ext/XS-APItest/t/sym-hook.t .............................. FAILED Non-zero exit status: 255 Bad plan.  You planned 4 tests but ran 0.
  [stdio] -Dcc=g++ -Duse64bitall
  [stdio] -Dcc=g++ -Dusequadmath
  [stdio] -Dcc=g++ DEBUGGING
  [stdio] -Dcc=g++
  [stdio] -Dcc=g++ -Dusequadmath DEBUGGING
  [stdio] -Dcc=g++ -Duse64bitall DEBUGGING
~~ ../cpan/Pod-Simple/t/verb_fmt.t ............................. FAILED Non-zero exit status: 255 Bad plan.  You planned 62 tests but ran 0.
  [stdio] -Dcc=g++ -Duse64bitall
  [stdio] -Dcc=g++ -Dusequadmath
  [stdio] -Dcc=g++ DEBUGGING
  [stdio] -Dcc=g++
  [stdio] -Dcc=g++ -Dusequadmath DEBUGGING
  [stdio] -Dcc=g++ -Duse64bitall DEBUGGING
~~ ../ext/IPC-Open3/t/IPC-Open3.t .............................. FAILED Non-zero exit status: 255 No plan found in TAP output
  [stdio] -Dcc=g++ -Duse64bitall
  [stdio] -Dcc=g++ -Dusequadmath
  [stdio] -Dcc=g++ DEBUGGING
  [stdio] -Dcc=g++
  [stdio] -Dcc=g++ -Dusequadmath DEBUGGING
  [stdio] -Dcc=g++ -Duse64bitall DEBUGGING
~~ ../cpan/Getopt-Long/t/gol-oo.t .............................. FAILED Non-zero exit status: 255 No plan found in TAP output
  [stdio] -Dcc=g++ -Duse64bitall
  [stdio] -Dcc=g++ -Dusequadmath
  [stdio] -Dcc=g++ DEBUGGING
  [stdio] -Dcc=g++
  [stdio] -Dcc=g++ -Dusequadmath DEBUGGING
  [stdio] -Dcc=g++ -Duse64bitall DEBUGGING
~~ ../cpan/Test-Simple/t/Legacy/exit.t ......................... FAILED 1-257
  [stdio] -Dcc=g++ -Dusequadmath
  [stdio] -Dcc=g++ -Dusequadmath DEBUGGING
~~ ../ext/FileCache/t/02maxopen.t .............................. FAILED Non-zero exit status: 25 Bad plan.  You planned 5 tests but ran 0.
  [stdio] -Dcc=g++ -Duse64bitall
  [stdio] -Dcc=g++ -Dusequadmath
  [stdio] -Dcc=g++ DEBUGGING
  [stdio] -Dcc=g++
  [stdio] -Dcc=g++ -Dusequadmath DEBUGGING
  [stdio] -Dcc=g++ -Duse64bitall DEBUGGING
~~ ../cpan/Test-Simple/t/Legacy/Tester/tbt_05faildiag.t ........ FAILED Non-zero exit status: 255 Bad plan.  You planned 5 tests but ran 0.
  [stdio] -Dcc=g++ -Duse64bitall
  [stdio] -Dcc=g++ -Dusequadmath
  [stdio] -Dcc=g++ DEBUGGING
  [stdio] -Dcc=g++
  [stdio] -Dcc=g++ -Dusequadmath DEBUGGING
  [stdio] -Dcc=g++ -Duse64bitall DEBUGGING
~~ ../ext/Opcode/t/ops.t ....................................... FAILED Non-zero exit status: 255 No plan found in TAP output
  [stdio] -Dcc=g++ -Duse64bitall
  [stdio] -Dcc=g++ -Dusequadmath
  [stdio] -Dcc=g++ DEBUGGING
  [stdio] -Dcc=g++
  [stdio] -Dcc=g++ -Dusequadmath DEBUGGING
  [stdio] -Dcc=g++ -Duse64bitall DEBUGGING
~~ ../cpan/ExtUtils-MakeMaker/t/oneliner.t ..................... FAILED 5 Non-zero exit status: 1
  [stdio] -Dcc=g++ -Duse64bitall
  [stdio] -Dcc=g++ -Dusequadmath
  [stdio] -Dcc=g++ DEBUGGING
  [stdio] -Dcc=g++
  [stdio] -Dcc=g++ -Dusequadmath DEBUGGING
  [stdio] -Dcc=g++ -Duse64bitall DEBUGGING
~~ ../t/re/recompile.t ......................................... FAILED 43
  [stdio] -Dcc=g++ DEBUGGING
  [stdio] -Dcc=g++ -Dusequadmath DEBUGGING
  [stdio] -Dcc=g++ -Duse64bitall DEBUGGING
~~ ../cpan/Pod-Checker/t/pod/podchkenc.t ....................... FAILED Non-zero exit status: 255 No plan found in TAP output
  [stdio] -Dcc=g++ -Duse64bitall
  [stdio] -Dcc=g++ -Dusequadmath
  [stdio] -Dcc=g++ DEBUGGING
  [stdio] -Dcc=g++
  [stdio] -Dcc=g++ -Dusequadmath DEBUGGING
  [stdio] -Dcc=g++ -Duse64bitall DEBUGGING
~~ ../cpan/Test-Simple/t/Legacy/subtest/singleton.t ............ FAILED Non-zero exit status: 255 Bad plan.  You planned 3 tests but ran 0.
  [stdio] -Dcc=g++ -Duse64bitall
  [stdio] -Dcc=g++ -Dusequadmath
  [stdio] -Dcc=g++ DEBUGGING
  [stdio] -Dcc=g++
  [stdio] -Dcc=g++ -Dusequadmath DEBUGGING
  [stdio] -Dcc=g++ -Duse64bitall DEBUGGING
~~ ../cpan/Test-Simple/t/Test2/acceptance/try_it_plan.t ........ FAILED Non-zero exit status: 255 No plan found in TAP output
  [stdio] -Dcc=g++ -Duse64bitall
  [stdio] -Dcc=g++ -Dusequadmath
  [stdio] -Dcc=g++ DEBUGGING
  [stdio] -Dcc=g++
  [stdio] -Dcc=g++ -Dusequadmath DEBUGGING
  [stdio] -Dcc=g++ -Duse64bitall DEBUGGING
~~ ../cpan/Compress-Raw-Zlib/t/19nonpv.t ....................... FAILED Non-zero exit status: 255 No plan found in TAP output
  [stdio] -Dcc=g++ -Duse64bitall
  [stdio] -Dcc=g++ -Dusequadmath
  [stdio] -Dcc=g++ DEBUGGING
  [stdio] -Dcc=g++
  [stdio] -Dcc=g++ -Dusequadmath DEBUGGING
  [stdio] -Dcc=g++ -Duse64bitall DEBUGGING
~~ ../cpan/Text-Balanced/t/08_extvar.t ......................... FAILED Non-zero exit status: 255 Bad plan.  You planned 183 tests but ran 0.
  [stdio] -Dcc=g++ -Duse64bitall
  [stdio] -Dcc=g++ -Dusequadmath
  [stdio] -Dcc=g++ DEBUGGING
  [stdio] -Dcc=g++
  [stdio] -Dcc=g++ -Dusequadmath DEBUGGING
  [stdio] -Dcc=g++ -Duse64bitall DEBUGGING
~~ ../cpan/ExtUtils-MakeMaker/t/MM_VMS.t ....................... FAILED Non-zero exit status: 255 No plan found in TAP output
  [stdio] -Dcc=g++ -Duse64bitall
  [stdio] -Dcc=g++ -Dusequadmath
  [stdio] -Dcc=g++ DEBUGGING
  [stdio] -Dcc=g++
  [stdio] -Dcc=g++ -Dusequadmath DEBUGGING
  [stdio] -Dcc=g++ -Duse64bitall DEBUGGING
~~ ../cpan/Test-Simple/t/Legacy/exit.t ......................... FAILED 1-259
  [stdio] -Dcc=g++ -Duse64bitall
~~ ../ext/XS-APItest/t/my_exit.t ............................... FAILED Non-zero exit status: 2 No plan found in TAP output
  [stdio] -Dcc=g++ -Duse64bitall
  [stdio] -Dcc=g++ -Dusequadmath
  [stdio] -Dcc=g++ DEBUGGING
  [stdio] -Dcc=g++
  [stdio] -Dcc=g++ -Dusequadmath DEBUGGING
  [stdio] -Dcc=g++ -Duse64bitall DEBUGGING
~~ ../dist/constant/t/constant.t ............................... FAILED Non-zero exit status: 7 Bad plan.  You planned 109 tests but ran 1.
  [stdio] -Dcc=g++ -Duse64bitall
  [stdio] -Dcc=g++ -Dusequadmath
  [stdio] -Dcc=g++ DEBUGGING
  [stdio] -Dcc=g++
  [stdio] -Dcc=g++ -Dusequadmath DEBUGGING
  [stdio] -Dcc=g++ -Duse64bitall DEBUGGING
~~ ../ext/Fcntl/t/syslfs.t ..................................... FAILED Non-zero exit status: 255 No plan found in TAP output
  [stdio] -Dcc=g++ -Duse64bitall
  [stdio] -Dcc=g++ -Dusequadmath
  [stdio] -Dcc=g++ DEBUGGING
  [stdio] -Dcc=g++
  [stdio] -Dcc=g++ -Dusequadmath DEBUGGING
  [stdio] -Dcc=g++ -Duse64bitall DEBUGGING
~~ ../cpan/Test-Simple/t/Test2/acceptance/try_it_todo.t ........ FAILED Non-zero exit status: 255 No plan found in TAP output
  [stdio] -Dcc=g++ -Duse64bitall
  [stdio] -Dcc=g++ -Dusequadmath
  [stdio] -Dcc=g++ DEBUGGING
  [stdio] -Dcc=g++
  [stdio] -Dcc=g++ -Dusequadmath DEBUGGING
  [stdio] -Dcc=g++ -Duse64bitall DEBUGGING
~~ ../cpan/Test-Simple/t/Legacy/exit.t ......................... FAILED 1-256
  [stdio] -Dcc=g++ DEBUGGING
  [stdio] -Dcc=g++ -Duse64bitall DEBUGGING
~~ ../cpan/Test-Simple/t/Legacy/exit.t ......................... FAILED 1-262
  [stdio] -Dcc=g++
~~ ../ext/FileCache/t/01open.t ................................. FAILED Non-zero exit status: 25 Bad plan.  You planned 1 tests but ran 0.
  [stdio] -Dcc=g++ -Duse64bitall
  [stdio] -Dcc=g++ -Dusequadmath
  [stdio] -Dcc=g++ DEBUGGING
  [stdio] -Dcc=g++
  [stdio] -Dcc=g++ -Dusequadmath DEBUGGING
  [stdio] -Dcc=g++ -Duse64bitall DEBUGGING
~~ ../dist/ExtUtils-CBuilder/t/02-link.t ....................... FAILED Non-zero exit status: 255 No plan found in TAP output
  [stdio] -Dcc=g++ -Duse64bitall
  [stdio] -Dcc=g++ -Dusequadmath
  [stdio] -Dcc=g++ DEBUGGING
  [stdio] -Dcc=g++
  [stdio] -Dcc=g++ -Dusequadmath DEBUGGING
  [stdio] -Dcc=g++ -Duse64bitall DEBUGGING
~~ ../ext/FileCache/t/07noimport.t ............................. FAILED Non-zero exit status: 25 Bad plan.  You planned 1 tests but ran 0.
  [stdio] -Dcc=g++ -Duse64bitall
  [stdio] -Dcc=g++ -Dusequadmath
  [stdio] -Dcc=g++ DEBUGGING
  [stdio] -Dcc=g++
  [stdio] -Dcc=g++ -Dusequadmath DEBUGGING
  [stdio] -Dcc=g++ -Duse64bitall DEBUGGING
~~ ../lib/B/Deparse.t .......................................... FAILED 69 279 303 Bad plan.  You planned 315 tests but ran 314.
  [stdio] -Dcc=g++ -Duse64bitall
  [stdio] -Dcc=g++ -Dusequadmath
  [stdio] -Dcc=g++ DEBUGGING
  [stdio] -Dcc=g++
  [stdio] -Dcc=g++ -Dusequadmath DEBUGGING
  [stdio] -Dcc=g++ -Duse64bitall DEBUGGING
~~ ../cpan/Test-Simple/t/Test2/behavior/Taint.t ................ FAILED Non-zero exit status: 255 No plan found in TAP output
  [stdio] -Dcc=g++ -Duse64bitall
  [stdio] -Dcc=g++ -Dusequadmath
  [stdio] -Dcc=g++ DEBUGGING
  [stdio] -Dcc=g++
  [stdio] -Dcc=g++ -Dusequadmath DEBUGGING
  [stdio] -Dcc=g++ -Duse64bitall DEBUGGING
~~ ../dist/ExtUtils-CBuilder/t/01-basic.t ...................... FAILED Non-zero exit status: 255 No plan found in TAP output
  [stdio] -Dcc=g++ -Duse64bitall
  [stdio] -Dcc=g++ -Dusequadmath
  [stdio] -Dcc=g++ DEBUGGING
  [stdio] -Dcc=g++
  [stdio] -Dcc=g++ -Dusequadmath DEBUGGING
  [stdio] -Dcc=g++ -Duse64bitall DEBUGGING
~~ ../ext/B/t/concise.t ........................................ FAILED Non-zero exit status: 2 No plan found in TAP output
  [stdio] -Dcc=g++ -Duse64bitall
  [stdio] -Dcc=g++ -Dusequadmath
  [stdio] -Dcc=g++ DEBUGGING
  [stdio] -Dcc=g++
  [stdio] -Dcc=g++ -Dusequadmath DEBUGGING
  [stdio] -Dcc=g++ -Duse64bitall DEBUGGING
~~ ../ext/Hash-Util/t/builtin.t ................................ FAILED 8 Non-zero exit status: 3
  [stdio] -Dcc=g++ -Duse64bitall
  [stdio] -Dcc=g++ -Dusequadmath
  [stdio] -Dcc=g++ DEBUGGING
  [stdio] -Dcc=g++
  [stdio] -Dcc=g++ -Dusequadmath DEBUGGING
  [stdio] -Dcc=g++ -Duse64bitall DEBUGGING
~~ ../cpan/Digest-MD5/t/files.t ................................ FAILED 2
  [stdio] -Dcc=g++ -Duse64bitall
  [stdio] -Dcc=g++ -Dusequadmath
  [stdio] -Dcc=g++ DEBUGGING
  [stdio] -Dcc=g++
  [stdio] -Dcc=g++ -Dusequadmath DEBUGGING
  [stdio] -Dcc=g++ -Duse64bitall DEBUGGING
~~ ../t/re/pat_re_eval.t ....................................... FAILED 422-423
  [stdio] -Dcc=g++ DEBUGGING
  [stdio] -Dcc=g++ -Dusequadmath DEBUGGING
  [stdio] -Dcc=g++ -Duse64bitall DEBUGGING
~~ ../cpan/version/t/04strict_lax.t ............................ FAILED Non-zero exit status: 255
  [stdio] -Dcc=g++ -Duse64bitall
  [stdio] -Dcc=g++ -Dusequadmath
  [stdio] -Dcc=g++ DEBUGGING
  [stdio] -Dcc=g++
  [stdio] -Dcc=g++ -Dusequadmath DEBUGGING
  [stdio] -Dcc=g++ -Duse64bitall DEBUGGING
~~ ../cpan/Text-Balanced/t/06_extqlk.t ......................... FAILED Non-zero exit status: 255 Bad plan.  You planned 95 tests but ran 0.
  [stdio] -Dcc=g++ -Duse64bitall
  [stdio] -Dcc=g++ -Dusequadmath
  [stdio] -Dcc=g++ DEBUGGING
  [stdio] -Dcc=g++
  [stdio] -Dcc=g++ -Dusequadmath DEBUGGING
  [stdio] -Dcc=g++ -Duse64bitall DEBUGGING
~~ ../ext/File-Glob/t/taint.t .................................. FAILED Non-zero exit status: 2 No plan found in TAP output
  [stdio] -Dcc=g++ -Duse64bitall
  [stdio] -Dcc=g++ -Dusequadmath
  [stdio] -Dcc=g++ DEBUGGING
  [stdio] -Dcc=g++
  [stdio] -Dcc=g++ -Dusequadmath DEBUGGING
  [stdio] -Dcc=g++ -Duse64bitall DEBUGGING
~~ ../ext/XS-APItest/t/xsub_h.t ................................ FAILED Non-zero exit status: 255 No plan found in TAP output
  [stdio] -Dcc=g++ -Duse64bitall
  [stdio] -Dcc=g++ -Dusequadmath
  [stdio] -Dcc=g++ DEBUGGING
  [stdio] -Dcc=g++
  [stdio] -Dcc=g++ -Dusequadmath DEBUGGING
  [stdio] -Dcc=g++ -Duse64bitall DEBUGGING
~~ ../dist/Storable/t/downgrade.t .............................. FAILED 13 77 130-131 Non-zero exit status: 26
  [stdio] -Dcc=g++ -Duse64bitall DEBUGGING
~~ ../dist/Storable/t/downgrade.t .............................. FAILED 13 66-67 125 Non-zero exit status: 30
  [stdio] -Dcc=g++ DEBUGGING
~~ ../t/re/pat_advanced.t ...................................... FAILED 1658
  [stdio] -Dcc=g++ -Duse64bitall
  [stdio] -Dcc=g++ -Dusequadmath
  [stdio] -Dcc=g++ DEBUGGING
  [stdio] -Dcc=g++
  [stdio] -Dcc=g++ -Dusequadmath DEBUGGING
  [stdio] -Dcc=g++ -Duse64bitall DEBUGGING
~~ ../ext/re/t/lexical_debug.t ................................. FAILED 3
  [stdio] -Dcc=g++ -Duse64bitall
  [stdio] -Dcc=g++ -Dusequadmath
  [stdio] -Dcc=g++ DEBUGGING
  [stdio] -Dcc=g++
  [stdio] -Dcc=g++ -Dusequadmath DEBUGGING
  [stdio] -Dcc=g++ -Duse64bitall DEBUGGING
~~ ../dist/Storable/t/malice.t ................................. FAILED 8 249 414 Non-zero exit status: 20
  [stdio] -Dcc=g++ -Duse64bitall
  [stdio] -Dcc=g++ -Dusequadmath
  [stdio] -Dcc=g++ DEBUGGING
  [stdio] -Dcc=g++
  [stdio] -Dcc=g++ -Dusequadmath DEBUGGING
  [stdio] -Dcc=g++ -Duse64bitall DEBUGGING
~~ ../ext/Opcode/t/Opcode.t .................................... FAILED Non-zero exit status: 255 No plan found in TAP output
  [stdio] -Dcc=g++ -Duse64bitall
  [stdio] -Dcc=g++ -Dusequadmath
  [stdio] -Dcc=g++ DEBUGGING
  [stdio] -Dcc=g++
  [stdio] -Dcc=g++ -Dusequadmath DEBUGGING
  [stdio] -Dcc=g++ -Duse64bitall DEBUGGING
~~ ../ext/FileCache/t/03append.t ............................... FAILED Non-zero exit status: 25 Bad plan.  You planned 2 tests but ran 0.
  [stdio] -Dcc=g++ -Duse64bitall
  [stdio] -Dcc=g++ -Dusequadmath
  [stdio] -Dcc=g++ DEBUGGING
  [stdio] -Dcc=g++
  [stdio] -Dcc=g++ -Dusequadmath DEBUGGING
  [stdio] -Dcc=g++ -Duse64bitall DEBUGGING
~~ ../cpan/Text-Balanced/t/02_extbrk.t ......................... FAILED Non-zero exit status: 255 Bad plan.  You planned 19 tests but ran 0.
  [stdio] -Dcc=g++ -Duse64bitall
  [stdio] -Dcc=g++ -Dusequadmath
  [stdio] -Dcc=g++ DEBUGGING
  [stdio] -Dcc=g++
  [stdio] -Dcc=g++ -Dusequadmath DEBUGGING
  [stdio] -Dcc=g++ -Duse64bitall DEBUGGING
~~ ../cpan/Text-Balanced/t/04_extdel.t ......................... FAILED Non-zero exit status: 255 Bad plan.  You planned 45 tests but ran 0.
  [stdio] -Dcc=g++ -Duse64bitall
  [stdio] -Dcc=g++ -Dusequadmath
  [stdio] -Dcc=g++ DEBUGGING
  [stdio] -Dcc=g++
  [stdio] -Dcc=g++ -Dusequadmath DEBUGGING
  [stdio] -Dcc=g++ -Duse64bitall DEBUGGING
~~ ../t/porting/podcheck.t ..................................... FAILED 299
  [stdio] -Dcc=g++ -Duse64bitall
  [stdio] -Dcc=g++ -Dusequadmath
  [stdio] -Dcc=g++ DEBUGGING
  [stdio] -Dcc=g++
  [stdio] -Dcc=g++ -Dusequadmath DEBUGGING
  [stdio] -Dcc=g++ -Duse64bitall DEBUGGING
~~ ../dist/Storable/t/recurse.t ................................ FAILED Non-zero exit status: 255 Bad plan.  You planned 39 tests but ran 0.
  [stdio] -Dcc=g++ -Duse64bitall
  [stdio] -Dcc=g++ -Dusequadmath
  [stdio] -Dcc=g++ DEBUGGING
  [stdio] -Dcc=g++
  [stdio] -Dcc=g++ -Dusequadmath DEBUGGING
  [stdio] -Dcc=g++ -Duse64bitall DEBUGGING
~~ ../t/porting/cmp_version.t .................................. FAILED 1-68 162-175 200
  [stdio] -Dcc=g++ -Duse64bitall
  [stdio] -Dcc=g++ -Dusequadmath
  [stdio] -Dcc=g++ DEBUGGING
  [stdio] -Dcc=g++
  [stdio] -Dcc=g++ -Dusequadmath DEBUGGING
  [stdio] -Dcc=g++ -Duse64bitall DEBUGGING
~~ ../cpan/Compress-Raw-Bzip2/t/01bzip2.t ...................... FAILED Non-zero exit status: 2 Bad plan.  You planned 173 tests but ran 1.
  [stdio] -Dcc=g++ -Duse64bitall
  [stdio] -Dcc=g++ -Dusequadmath
  [stdio] -Dcc=g++ DEBUGGING
  [stdio] -Dcc=g++
  [stdio] -Dcc=g++ -Dusequadmath DEBUGGING
  [stdio] -Dcc=g++ -Duse64bitall DEBUGGING
~~ ../dist/threads/t/no_threads.t .............................. FAILED 1
  [stdio] -Dcc=g++ -Duse64bitall
  [stdio] -Dcc=g++ -Dusequadmath
  [stdio] -Dcc=g++ DEBUGGING
  [stdio] -Dcc=g++
  [stdio] -Dcc=g++ -Dusequadmath DEBUGGING
  [stdio] -Dcc=g++ -Duse64bitall DEBUGGING
~~ ../dist/Devel-PPPort/t/warn.t ............................... FAILED 4
  [stdio] -Dcc=g++ -Duse64bitall
  [stdio] -Dcc=g++ -Dusequadmath
  [stdio] -Dcc=g++ DEBUGGING
  [stdio] -Dcc=g++
  [stdio] -Dcc=g++ -Dusequadmath DEBUGGING
  [stdio] -Dcc=g++ -Duse64bitall DEBUGGING
~~ ../cpan/Text-Balanced/t/09_gentag.t ......................... FAILED Non-zero exit status: 255 Bad plan.  You planned 37 tests but ran 0.
  [stdio] -Dcc=g++ -Duse64bitall
  [stdio] -Dcc=g++ -Dusequadmath
  [stdio] -Dcc=g++ DEBUGGING
  [stdio] -Dcc=g++
  [stdio] -Dcc=g++ -Dusequadmath DEBUGGING
  [stdio] -Dcc=g++ -Duse64bitall DEBUGGING
~~ ../ext/B/t/sv_stash.t ....................................... FAILED 1
  [stdio] -Dcc=g++ -Duse64bitall
  [stdio] -Dcc=g++ -Dusequadmath
  [stdio] -Dcc=g++ DEBUGGING
  [stdio] -Dcc=g++
  [stdio] -Dcc=g++ -Dusequadmath DEBUGGING
  [stdio] -Dcc=g++ -Duse64bitall DEBUGGING
~~ ../lib/B/Deparse-core.t ..................................... FAILED 3823-3840 Non-zero exit status: 18
  [stdio] -Dcc=g++ -Duse64bitall
  [stdio] -Dcc=g++ -Dusequadmath
  [stdio] -Dcc=g++ DEBUGGING
  [stdio] -Dcc=g++
  [stdio] -Dcc=g++ -Dusequadmath DEBUGGING
  [stdio] -Dcc=g++ -Duse64bitall DEBUGGING
~~ ../cpan/Test-Simple/t/Test2/modules/API.t ................... FAILED Non-zero exit status: 255 No plan found in TAP output
  [stdio] -Dcc=g++ -Duse64bitall
  [stdio] -Dcc=g++ -Dusequadmath
  [stdio] -Dcc=g++ DEBUGGING
  [stdio] -Dcc=g++
  [stdio] -Dcc=g++ -Dusequadmath DEBUGGING
  [stdio] -Dcc=g++ -Duse64bitall DEBUGGING
~~ ../dist/Storable/t/weak.t ................................... FAILED Non-zero exit status: 25
  [stdio] -Dcc=g++ -Duse64bitall
  [stdio] -Dcc=g++ -Dusequadmath
  [stdio] -Dcc=g++
~~ ../dist/Exporter/t/Exporter.t ............................... FAILED Non-zero exit status: 255 No plan found in TAP output
  [stdio] -Dcc=g++ -Duse64bitall
  [stdio] -Dcc=g++ -Dusequadmath
  [stdio] -Dcc=g++ DEBUGGING
  [stdio] -Dcc=g++
  [stdio] -Dcc=g++ -Dusequadmath DEBUGGING
  [stdio] -Dcc=g++ -Duse64bitall DEBUGGING
~~ ../dist/ExtUtils-CBuilder/t/03-cplusplus.t .................. FAILED Non-zero exit status: 255 No plan found in TAP output
  [stdio] -Dcc=g++ -Duse64bitall
  [stdio] -Dcc=g++ -Dusequadmath
  [stdio] -Dcc=g++ DEBUGGING
  [stdio] -Dcc=g++
  [stdio] -Dcc=g++ -Dusequadmath DEBUGGING
  [stdio] -Dcc=g++ -Duse64bitall DEBUGGING
~~ ../ext/B/t/optree_check.t ................................... FAILED Non-zero exit status: 255 No plan found in TAP output
  [stdio] -Dcc=g++ -Duse64bitall
  [stdio] -Dcc=g++ -Dusequadmath
  [stdio] -Dcc=g++ DEBUGGING
  [stdio] -Dcc=g++
  [stdio] -Dcc=g++ -Dusequadmath DEBUGGING
  [stdio] -Dcc=g++ -Duse64bitall DEBUGGING
~~ ../lib/utf8.t ............................................... FAILED 40 82
  [stdio] -Dcc=g++ -Duse64bitall
  [stdio] -Dcc=g++ -Dusequadmath
  [stdio] -Dcc=g++ DEBUGGING
  [stdio] -Dcc=g++
  [stdio] -Dcc=g++ -Dusequadmath DEBUGGING
  [stdio] -Dcc=g++ -Duse64bitall DEBUGGING
~~ ../cpan/Test-Simple/t/Legacy/harness_active.t ............... FAILED Non-zero exit status: 255 No plan found in TAP output
  [stdio] -Dcc=g++ -Duse64bitall
  [stdio] -Dcc=g++ -Dusequadmath
  [stdio] -Dcc=g++ DEBUGGING
  [stdio] -Dcc=g++
  [stdio] -Dcc=g++ -Dusequadmath DEBUGGING
  [stdio] -Dcc=g++ -Duse64bitall DEBUGGING
~~ ../ext/Fcntl/t/fcntl.t ...................................... FAILED Non-zero exit status: 2 No plan found in TAP output
  [stdio] -Dcc=g++ -Duse64bitall
  [stdio] -Dcc=g++ -Dusequadmath
  [stdio] -Dcc=g++ DEBUGGING
  [stdio] -Dcc=g++
  [stdio] -Dcc=g++ -Dusequadmath DEBUGGING
  [stdio] -Dcc=g++ -Duse64bitall DEBUGGING
~~ ../ext/Sys-Hostname/t/Hostname.t ............................ FAILED Non-zero exit status: 255 No plan found in TAP output
  [stdio] -Dcc=g++ -Duse64bitall
  [stdio] -Dcc=g++ -Dusequadmath
  [stdio] -Dcc=g++ DEBUGGING
  [stdio] -Dcc=g++
  [stdio] -Dcc=g++ -Dusequadmath DEBUGGING
  [stdio] -Dcc=g++ -Duse64bitall DEBUGGING
~~ ../lib/overload.t ........................................... FAILED Non-zero exit status: 255 Bad plan.  You planned 5363 tests but ran 137.
  [stdio] -Dcc=g++ -Duse64bitall
  [stdio] -Dcc=g++ -Dusequadmath
  [stdio] -Dcc=g++ DEBUGGING
  [stdio] -Dcc=g++
  [stdio] -Dcc=g++ -Dusequadmath DEBUGGING
  [stdio] -Dcc=g++ -Duse64bitall DEBUGGING
~~ ../cpan/Test-Simple/t/Legacy/subtest/predicate.t ............ FAILED Non-zero exit status: 255 Bad plan.  You planned 5 tests but ran 0.
  [stdio] -Dcc=g++ -Duse64bitall
  [stdio] -Dcc=g++ -Dusequadmath
  [stdio] -Dcc=g++ DEBUGGING
  [stdio] -Dcc=g++
  [stdio] -Dcc=g++ -Dusequadmath DEBUGGING
  [stdio] -Dcc=g++ -Duse64bitall DEBUGGING
~~ ../ext/Devel-Peek/t/Peek.t .................................. FAILED Non-zero exit status: 255 No plan found in TAP output
  [stdio] -Dcc=g++ -Duse64bitall
  [stdio] -Dcc=g++ -Dusequadmath
  [stdio] -Dcc=g++ DEBUGGING
  [stdio] -Dcc=g++
  [stdio] -Dcc=g++ -Dusequadmath DEBUGGING
  [stdio] -Dcc=g++ -Duse64bitall DEBUGGING
~~ ../ext/B/t/optree_sort.t .................................... FAILED Non-zero exit status: 255 No plan found in TAP output
  [stdio] -Dcc=g++ -Duse64bitall
  [stdio] -Dcc=g++ -Dusequadmath
  [stdio] -Dcc=g++ DEBUGGING
  [stdio] -Dcc=g++
  [stdio] -Dcc=g++ -Dusequadmath DEBUGGING
  [stdio] -Dcc=g++ -Duse64bitall DEBUGGING
~~ ../dist/Storable/t/downgrade.t .............................. FAILED 13 66-67 114-115 Non-zero exit status: 30
  [stdio] -Dcc=g++ -Dusequadmath
~~ ../dist/Storable/t/restrict.t ............................... FAILED 1 79 115 131 147 163 179 195 211 227 243 259 275 291 Non-zero exit status: 176
  [stdio] -Dcc=g++ -Duse64bitall
  [stdio] -Dcc=g++ -Dusequadmath
  [stdio] -Dcc=g++ DEBUGGING
  [stdio] -Dcc=g++
  [stdio] -Dcc=g++ -Dusequadmath DEBUGGING
  [stdio] -Dcc=g++ -Duse64bitall DEBUGGING
~~ ../cpan/version/t/03require.t ............................... FAILED Non-zero exit status: 255
  [stdio] -Dcc=g++ -Duse64bitall
  [stdio] -Dcc=g++ -Dusequadmath
  [stdio] -Dcc=g++ DEBUGGING
  [stdio] -Dcc=g++
  [stdio] -Dcc=g++ -Dusequadmath DEBUGGING
  [stdio] -Dcc=g++ -Duse64bitall DEBUGGING
~~ ../ext/File-Glob/t/threads.t ................................ FAILED Non-zero exit status: 2 No plan found in TAP output
  [stdio] -Dcc=g++ -Duse64bitall
  [stdio] -Dcc=g++ -Dusequadmath
  [stdio] -Dcc=g++ DEBUGGING
  [stdio] -Dcc=g++
  [stdio] -Dcc=g++ -Dusequadmath DEBUGGING
  [stdio] -Dcc=g++ -Duse64bitall DEBUGGING
~~ ../cpan/Text-Balanced/t/05_extmul.t ......................... FAILED Non-zero exit status: 255 Bad plan.  You planned 86 tests but ran 0.
  [stdio] -Dcc=g++ -Duse64bitall
  [stdio] -Dcc=g++ -Dusequadmath
  [stdio] -Dcc=g++ DEBUGGING
  [stdio] -Dcc=g++
  [stdio] -Dcc=g++ -Dusequadmath DEBUGGING
  [stdio] -Dcc=g++ -Duse64bitall DEBUGGING
~~ ../ext/B/t/optree_varinit.t ................................. FAILED 3 30
  [stdio] -Dcc=g++ -Duse64bitall
  [stdio] -Dcc=g++ -Dusequadmath
  [stdio] -Dcc=g++ DEBUGGING
  [stdio] -Dcc=g++
  [stdio] -Dcc=g++ -Dusequadmath DEBUGGING
  [stdio] -Dcc=g++ -Duse64bitall DEBUGGING
~~ ../cpan/Test-Simple/t/Test2/legacy/TAP.t .................... FAILED Non-zero exit status: 255 No plan found in TAP output
  [stdio] -Dcc=g++ -Duse64bitall
  [stdio] -Dcc=g++ -Dusequadmath
  [stdio] -Dcc=g++ DEBUGGING
  [stdio] -Dcc=g++
  [stdio] -Dcc=g++ -Dusequadmath DEBUGGING
  [stdio] -Dcc=g++ -Duse64bitall DEBUGGING
~~ ../cpan/Test-Simple/t/Test2/modules/IPC/Driver/Files.t ...... FAILED Non-zero exit status: 255 No plan found in TAP output
  [stdio] -Dcc=g++ -Duse64bitall
  [stdio] -Dcc=g++ -Dusequadmath
  [stdio] -Dcc=g++ DEBUGGING
  [stdio] -Dcc=g++
  [stdio] -Dcc=g++ -Dusequadmath DEBUGGING
  [stdio] -Dcc=g++ -Duse64bitall DEBUGGING
~~ ../ext/File-Glob/t/basic.t .................................. FAILED Non-zero exit status: 2 No plan found in TAP output
  [stdio] -Dcc=g++ -Duse64bitall
  [stdio] -Dcc=g++ -Dusequadmath
  [stdio] -Dcc=g++ DEBUGGING
  [stdio] -Dcc=g++
  [stdio] -Dcc=g++ -Dusequadmath DEBUGGING
  [stdio] -Dcc=g++ -Duse64bitall DEBUGGING
~~ ../ext/File-Glob/t/global.t ................................. FAILED Non-zero exit status: 2 No plan found in TAP output
  [stdio] -Dcc=g++ -Duse64bitall
  [stdio] -Dcc=g++ -Dusequadmath
  [stdio] -Dcc=g++ DEBUGGING
  [stdio] -Dcc=g++
  [stdio] -Dcc=g++ -Dusequadmath DEBUGGING
  [stdio] -Dcc=g++ -Duse64bitall DEBUGGING
~~ ../cpan/Text-Balanced/t/07_exttag.t ......................... FAILED Non-zero exit status: 255 Bad plan.  You planned 53 tests but ran 0.
  [stdio] -Dcc=g++ -Duse64bitall
  [stdio] -Dcc=g++ -Dusequadmath
  [stdio] -Dcc=g++ DEBUGGING
  [stdio] -Dcc=g++
  [stdio] -Dcc=g++ -Dusequadmath DEBUGGING
  [stdio] -Dcc=g++ -Duse64bitall DEBUGGING
~~ ../dist/Storable/t/regexp.t ................................. FAILED Bad plan.  You planned 64 tests but ran 4.
  [stdio] -Dcc=g++ DEBUGGING
  [stdio] -Dcc=g++ -Dusequadmath DEBUGGING
  [stdio] -Dcc=g++ -Duse64bitall DEBUGGING
~~ ../dist/autouse/t/autouse.t ................................. FAILED Non-zero exit status: 255 Bad plan.  You planned 15 tests but ran 0.
  [stdio] -Dcc=g++ -Duse64bitall
  [stdio] -Dcc=g++ -Dusequadmath
  [stdio] -Dcc=g++ DEBUGGING
  [stdio] -Dcc=g++
  [stdio] -Dcc=g++ -Dusequadmath DEBUGGING
  [stdio] -Dcc=g++ -Duse64bitall DEBUGGING
~~ ../dist/Attribute-Handlers/t/multi.t ........................ FAILED Non-zero exit status: 255 No plan found in TAP output
  [stdio] -Dcc=g++ -Duse64bitall
  [stdio] -Dcc=g++ -Dusequadmath
  [stdio] -Dcc=g++ DEBUGGING
  [stdio] -Dcc=g++
  [stdio] -Dcc=g++ -Dusequadmath DEBUGGING
  [stdio] -Dcc=g++ -Duse64bitall DEBUGGING
~~ ../cpan/Compress-Raw-Zlib/t/02zlib.t ........................ FAILED Non-zero exit status: 255 No plan found in TAP output
  [stdio] -Dcc=g++ -Duse64bitall
  [stdio] -Dcc=g++ -Dusequadmath
  [stdio] -Dcc=g++ DEBUGGING
  [stdio] -Dcc=g++
  [stdio] -Dcc=g++ -Dusequadmath DEBUGGING
  [stdio] -Dcc=g++ -Duse64bitall DEBUGGING
~~ ../lib/feature.t ............................................ FAILED 7-8 58-65
  [stdio] -Dcc=g++ -Duse64bitall
  [stdio] -Dcc=g++ -Dusequadmath
  [stdio] -Dcc=g++ DEBUGGING
  [stdio] -Dcc=g++
  [stdio] -Dcc=g++ -Dusequadmath DEBUGGING
  [stdio] -Dcc=g++ -Duse64bitall DEBUGGING
~~ ../cpan/ExtUtils-MakeMaker/t/split_command.t ................ FAILED Non-zero exit status: 255 Bad plan.  You planned 7 tests but ran 0.
  [stdio] -Dcc=g++ -Duse64bitall
  [stdio] -Dcc=g++ -Dusequadmath
  [stdio] -Dcc=g++ DEBUGGING
  [stdio] -Dcc=g++
  [stdio] -Dcc=g++ -Dusequadmath DEBUGGING
  [stdio] -Dcc=g++ -Duse64bitall DEBUGGING
~~ ../t/uni/variables.t ........................................ FAILED 44
  [stdio] -Dcc=g++ -Duse64bitall
  [stdio] -Dcc=g++ -Dusequadmath
  [stdio] -Dcc=g++ DEBUGGING
  [stdio] -Dcc=g++
  [stdio] -Dcc=g++ -Dusequadmath DEBUGGING
  [stdio] -Dcc=g++ -Duse64bitall DEBUGGING
~~ ../lib/perl7db.t ............................................ FAILED 1-2 74 116-120
  [stdio] -Dcc=g++ -Duse64bitall
  [stdio] -Dcc=g++ -Dusequadmath
  [stdio] -Dcc=g++ DEBUGGING
  [stdio] -Dcc=g++
  [stdio] -Dcc=g++ -Dusequadmath DEBUGGING
  [stdio] -Dcc=g++ -Duse64bitall DEBUGGING
~~ ../cpan/NEXT/t/next.t ....................................... FAILED Bad plan.  You planned 27 tests but ran 26.
  [stdio] -Dcc=g++ -Duse64bitall
  [stdio] -Dcc=g++ -Dusequadmath
  [stdio] -Dcc=g++ DEBUGGING
  [stdio] -Dcc=g++
  [stdio] -Dcc=g++ -Dusequadmath DEBUGGING
  [stdio] -Dcc=g++ -Duse64bitall DEBUGGING
~~ ../cpan/Scalar-List-Utils/t/dualvar.t ....................... FAILED Non-zero exit status: 255 Bad plan.  You planned 41 tests but ran 0.
  [stdio] -Dcc=g++ -Duse64bitall
  [stdio] -Dcc=g++ -Dusequadmath
  [stdio] -Dcc=g++ DEBUGGING
  [stdio] -Dcc=g++
  [stdio] -Dcc=g++ -Dusequadmath DEBUGGING
  [stdio] -Dcc=g++ -Duse64bitall DEBUGGING
~~ ../cpan/version/t/02derived.t ............................... FAILED Non-zero exit status: 255
  [stdio] -Dcc=g++ -Duse64bitall
  [stdio] -Dcc=g++ -Dusequadmath
  [stdio] -Dcc=g++ DEBUGGING
  [stdio] -Dcc=g++
  [stdio] -Dcc=g++ -Dusequadmath DEBUGGING
  [stdio] -Dcc=g++ -Duse64bitall DEBUGGING
~~ ../ext/Hash-Util/t/Util.t ................................... FAILED Non-zero exit status: 255 No plan found in TAP output
  [stdio] -Dcc=g++ -Duse64bitall
  [stdio] -Dcc=g++ -Dusequadmath
  [stdio] -Dcc=g++ DEBUGGING
  [stdio] -Dcc=g++
  [stdio] -Dcc=g++ -Dusequadmath DEBUGGING
  [stdio] -Dcc=g++ -Duse64bitall DEBUGGING
~~ ../cpan/Test-Simple/t/Test2/acceptance/try_it_no_plan.t ..... FAILED Non-zero exit status: 255 No plan found in TAP output
  [stdio] -Dcc=g++ -Duse64bitall
  [stdio] -Dcc=g++ -Dusequadmath
  [stdio] -Dcc=g++ DEBUGGING
  [stdio] -Dcc=g++
  [stdio] -Dcc=g++ -Dusequadmath DEBUGGING
  [stdio] -Dcc=g++ -Duse64bitall DEBUGGING
~~ ../ext/File-DosGlob/t/DosGlob.t ............................. FAILED Non-zero exit status: 255 Bad plan.  You planned 21 tests but ran 0.
  [stdio] -Dcc=g++ -Duse64bitall
  [stdio] -Dcc=g++ -Dusequadmath
  [stdio] -Dcc=g++ DEBUGGING
  [stdio] -Dcc=g++
  [stdio] -Dcc=g++ -Dusequadmath DEBUGGING
  [stdio] -Dcc=g++ -Duse64bitall DEBUGGING

Test todo-passed:
~~ ../t/run/runenv.t ........................................... PASSED 65
  [stdio] -Dcc=g++ -Duse64bitall
  [stdio] -Dcc=g++ -Dusequadmath
  [stdio] -Dcc=g++ DEBUGGING
  [stdio] -Dcc=g++ -Dusequadmath DEBUGGING
  [stdio] -Dcc=g++ -Duse64bitall DEBUGGING
~~ ../t/perf/optree.t .......................................... PASSED 51-2285
  [stdio] -Dcc=g++ -Duse64bitall
  [stdio] -Dcc=g++ -Dusequadmath
  [stdio] -Dcc=g++ DEBUGGING
  [stdio] -Dcc=g++
  [stdio] -Dcc=g++ -Dusequadmath DEBUGGING
  [stdio] -Dcc=g++ -Duse64bitall DEBUGGING
~~ ../dist/Safe/t/safesort.t ................................... PASSED 10
  [stdio] -Dcc=g++ -Duse64bitall
  [stdio] -Dcc=g++ -Dusequadmath
  [stdio] -Dcc=g++ DEBUGGING
  [stdio] -Dcc=g++
  [stdio] -Dcc=g++ -Dusequadmath DEBUGGING
  [stdio] -Dcc=g++ -Duse64bitall DEBUGGING

MANIFEST messages:
  MANIFEST did not declare '.mailmap'

Compiler messages:
  awk: cmd. line:1: warning: regexp escape sequence `\=' is not a known regexp operator
  mg.c: In function 'int Perl_magic_set(SV*, MAGIC*)':
  mg.c:2818:50: warning: type qualifiers ignored on cast result type [-Wignored-qualifiers]
  regexp.h:528:43: note: in definition of macro 'RXp_ENGINE'
  regexp.h:529:53: note: in expansion of macro 'ReANY'
  perl.h:250:5: note: in expansion of macro 'RX_ENGINE'
  mg.c:2818:13: note: in expansion of macro 'CALLREG_NUMBUF_STORE'
  perl.h:250:47: note: in definition of macro 'CALLREG_NUMBUF_STORE'
  inflate.c: In function 'int inflate(z_streamp, int)':
  inflate.c:724:25: warning: this statement may fall through [-Wimplicit-fallthrough=]
  inflate.c:725:9: note: here
  inflate.c:732:25: warning: this statement may fall through [-Wimplicit-fallthrough=]
  inflate.c:733:9: note: here
  inflate.c:947:25: warning: this statement may fall through [-Wimplicit-fallthrough=]
  inflate.c:948:9: note: here
  inflate.c:968:25: warning: this statement may fall through [-Wimplicit-fallthrough=]
  inflate.c:969:9: note: here
  MD5.xs: In function 'MD5_CTX* get_md5_ctx(SV*)':
  MD5.xs:470:50: warning: type qualifiers ignored on cast result type [-Wignored-qualifiers]
  MD5.xs: In function 'SV* new_md5_ctx(MD5_CTX*, const char*)':
  MD5.xs:492:63: warning: type qualifiers ignored on cast result type [-Wignored-qualifiers]
  ../../embed.h:610:63: note: in definition of macro 'sv_magicext'
  ./const-xs.inc:131:13: warning: AI_IDN_ALLOW_UNASSIGNED is deprecated
  ./const-xs.inc:134:13: warning: AI_IDN_USE_STD3_ASCII_RULES is deprecated
  ./const-xs.inc:386:13: warning: NI_IDN_ALLOW_UNASSIGNED is deprecated
  ./const-xs.inc:389:13: warning: NI_IDN_USE_STD3_ASCII_RULES is deprecated
  HiRes.xs: In function 'void XS_Time__HiRes_setitimer(CV*)':
  ../../perl.h:532:30: warning: option '-Wc++-compat' is valid for C/ObjC but not for C++ [-Wpragmas]
  ../../perl.h:535:30: note: in expansion of macro 'GCC_DIAG_PRAGMA'
  ../../perl.h:543:33: note: in expansion of macro 'GCC_DIAG_IGNORE'
  HiRes.xs:1436:9: note: in expansion of macro 'GCC_DIAG_IGNORE_STMT'
  HiRes.xs: In function 'void XS_Time__HiRes_getitimer(CV*)':
  HiRes.xs:1456:9: note: in expansion of macro 'GCC_DIAG_IGNORE_STMT'
  ../../embed.h: In function 'void XS_List__Util_reduce(CV*)':
  ../../embed.h:59:35: warning: 'retvals' may be used uninitialized in this function [-Wmaybe-uninitialized]
  ListUtil.xs:534:9: note: 'retvals' was declared here
  Storable.xs: In function 'int store_scalar(stcxt_t*, SV*)':
  Storable.xs:2585:22: warning: format '%f' expects argument of type 'double', but argument 2 has type 'NV_bytes' [-Wformat=]
  Storable.xs:131:30: note: in definition of macro 'TRACEME'
  mg.c: In function 'int Perl_magic_set(PerlInterpreter*, SV*, MAGIC*)':
  MD5.xs: In function 'MD5_CTX* get_md5_ctx(PerlInterpreter*, SV*)':
  MD5.xs: In function 'SV* new_md5_ctx(PerlInterpreter*, MD5_CTX*, const char*)':
  Opcode.xs: In function 'void opmask_addlocal(PerlInterpreter*, SV*, char*)':
  Opcode.xs:240:33: warning: cast between incompatible function types from 'void (*)(PerlInterpreter*, const char*, ...)' {aka 'void (*)(interpreter*, const char*, ...)'} to 'void (*)(void*)' [-Wcast-function-type]
  ../../embed.h:496:57: note: in definition of macro 'save_destructor'
  Opcode.xs:240:2: note: in expansion of macro 'SAVEDESTRUCTOR'
  Storable.xs: In function 'int store_hash(PerlInterpreter*, stcxt_t*, HV*)':
  ../../thread.h:314:57: error: invalid conversion from 'void*' to 'PerlInterpreter*' {aka 'interpreter*'} [-fpermissive]
  ../../thread.h:318:28: note: in expansion of macro 'PTHREAD_GETSPECIFIC'
  Storable.xs:1363:38: note: in expansion of macro 'PERL_GET_CONTEXT'
  Storable.xs:2921:9: note: in expansion of macro 'STORE_HASH_SORT'
  ../../embed.h: In function 'void XS_List__Util_reduce(PerlInterpreter*, CV*)':
  Storable.xs: In function 'int store_scalar(PerlInterpreter*, stcxt_t*, SV*)':

About this smoke:
    smoking-perl: 5.26.1
  smoker-version: 1.71/0.046
       timestamp: 2020-07-12 10:42:41+00
          tester: core

-- 
Report generated by Test::Smoke::Gateway v0.09_01