Show logfile
Automated smoke report for branch smoke-me/jkeenan/sugar-magnolia 7.0.0 patch 39568decb91df7e01426bdd32a20f626e3953186 v5.32.0-586-g39568decb9
cjg-netbsd9: Intel 686-class (amd64/1 cpus)
    on        netbsd 9.0
    using     g++ version 7.4.0 (*1)
    smoketime 4 hours 6 minutes (average 20 minutes 32 seconds)

Summary: FAIL(FM)

O = OK  F = Failure(s), extended report at the bottom
X = Failure(s) under TEST but not under harness
? = still running or test results not (yet) available
Build failures during:       - = unknown or N/A
c = Configure, m = make, M = make (after miniperl), t = make test-prep

v5.32.0-586-g39568decb9
---------------------- ----------------------------------------------------
-  F  -  F              -Dcc=g++ (*1)
-  F  -  F              -Dcc=g++ -Duse64bitall (*1)
-  F  -  F              -Dcc=g++ -Duselongdouble (*1)
M  -  M  -              -Dcc=g++ -Duseithreads (*1)
M  -  M  -              -Dcc=g++ -Duseithreads -Duse64bitall (*1)
M  -  M  -              -Dcc=g++ -Duseithreads -Duselongdouble (*1)
|  |  |  |
|  |  |  +------------  stdio DEBUGGING
|  |  +---------------  minitest DEBUGGING
|  +------------------  stdio
+---------------------  minitest

Applied patches:
  SMOKE39568decb91df7e01426bdd32a20f626e3953186

Skipped tests:
      # One test name on a line

Test failures:
~~ ../t/op/exists_sub.t ........................................ FAILED Non-zero exit status: 2 No plan found in TAP output
  [stdio] -Dcc=g++ -Duse64bitall
  [stdio] -Dcc=g++ -Duselongdouble DEBUGGING
  [stdio] -Dcc=g++ DEBUGGING
  [stdio] -Dcc=g++
  [stdio] -Dcc=g++ -Duselongdouble
  [stdio] -Dcc=g++ -Duse64bitall DEBUGGING
~~ ../t/porting/args_assert.t .................................. FAILED Non-zero exit status: 2 No plan found in TAP output
  [stdio] -Dcc=g++ -Duse64bitall
  [stdio] -Dcc=g++ -Duselongdouble DEBUGGING
  [stdio] -Dcc=g++ DEBUGGING
  [stdio] -Dcc=g++
  [stdio] -Dcc=g++ -Duselongdouble
  [stdio] -Dcc=g++ -Duse64bitall DEBUGGING
~~ ../cpan/Tie-RefHash/t/storable.t ............................ FAILED Non-zero exit status: 255 No plan found in TAP output
  [stdio] -Dcc=g++ -Duse64bitall
  [stdio] -Dcc=g++ -Duselongdouble DEBUGGING
  [stdio] -Dcc=g++ DEBUGGING
  [stdio] -Dcc=g++
  [stdio] -Dcc=g++ -Duselongdouble
  [stdio] -Dcc=g++ -Duse64bitall DEBUGGING
~~ ../t/uni/labels.t ........................................... FAILED Non-zero exit status: 2 No plan found in TAP output
  [stdio] -Dcc=g++ -Duse64bitall
  [stdio] -Dcc=g++ -Duselongdouble DEBUGGING
  [stdio] -Dcc=g++ DEBUGGING
  [stdio] -Dcc=g++
  [stdio] -Dcc=g++ -Duselongdouble
  [stdio] -Dcc=g++ -Duse64bitall DEBUGGING
~~ ../t/io/errno.t ............................................. FAILED Non-zero exit status: 2 No plan found in TAP output
  [stdio] -Dcc=g++ -Duse64bitall
  [stdio] -Dcc=g++ -Duselongdouble DEBUGGING
  [stdio] -Dcc=g++ DEBUGGING
  [stdio] -Dcc=g++
  [stdio] -Dcc=g++ -Duselongdouble
  [stdio] -Dcc=g++ -Duse64bitall DEBUGGING
~~ ../t/op/cproto.t ............................................ FAILED Non-zero exit status: 2 No plan found in TAP output
  [stdio] -Dcc=g++ -Duse64bitall
  [stdio] -Dcc=g++ -Duselongdouble DEBUGGING
  [stdio] -Dcc=g++ DEBUGGING
  [stdio] -Dcc=g++
  [stdio] -Dcc=g++ -Duselongdouble
  [stdio] -Dcc=g++ -Duse64bitall DEBUGGING
~~ ../t/op/dbm.t ............................................... FAILED Non-zero exit status: 2 No plan found in TAP output
  [stdio] -Dcc=g++ -Duse64bitall
  [stdio] -Dcc=g++ -Duselongdouble DEBUGGING
  [stdio] -Dcc=g++ DEBUGGING
  [stdio] -Dcc=g++
  [stdio] -Dcc=g++ -Duselongdouble
  [stdio] -Dcc=g++ -Duse64bitall DEBUGGING
~~ ../t/re/user_prop_race_thr.t ................................ FAILED Non-zero exit status: 2 No plan found in TAP output
  [stdio] -Dcc=g++ -Duse64bitall
  [stdio] -Dcc=g++ -Duselongdouble DEBUGGING
  [stdio] -Dcc=g++ DEBUGGING
  [stdio] -Dcc=g++
  [stdio] -Dcc=g++ -Duselongdouble
  [stdio] -Dcc=g++ -Duse64bitall DEBUGGING
~~ ../t/uni/tie.t .............................................. FAILED Non-zero exit status: 2 No plan found in TAP output
  [stdio] -Dcc=g++ -Duse64bitall
  [stdio] -Dcc=g++ -Duselongdouble DEBUGGING
  [stdio] -Dcc=g++ DEBUGGING
  [stdio] -Dcc=g++
  [stdio] -Dcc=g++ -Duselongdouble
  [stdio] -Dcc=g++ -Duse64bitall DEBUGGING
~~ ../ext/POSIX/t/posix.t ...................................... FAILED Non-zero exit status: 255 No plan found in TAP output
  [stdio] -Dcc=g++ -Duse64bitall
  [stdio] -Dcc=g++ -Duselongdouble DEBUGGING
  [stdio] -Dcc=g++ DEBUGGING
  [stdio] -Dcc=g++
  [stdio] -Dcc=g++ -Duselongdouble
  [stdio] -Dcc=g++ -Duse64bitall DEBUGGING
~~ ../cpan/ExtUtils-MakeMaker/t/min_perl_version.t ............. FAILED 16 Non-zero exit status: 1
  [stdio] -Dcc=g++ -Duse64bitall
  [stdio] -Dcc=g++ -Duselongdouble DEBUGGING
  [stdio] -Dcc=g++ DEBUGGING
  [stdio] -Dcc=g++
  [stdio] -Dcc=g++ -Duselongdouble
  [stdio] -Dcc=g++ -Duse64bitall DEBUGGING
~~ ../t/op/lex_assign.t ........................................ FAILED Non-zero exit status: 2 No plan found in TAP output
  [stdio] -Dcc=g++ -Duse64bitall
  [stdio] -Dcc=g++ -Duselongdouble DEBUGGING
  [stdio] -Dcc=g++ DEBUGGING
  [stdio] -Dcc=g++
  [stdio] -Dcc=g++ -Duselongdouble
  [stdio] -Dcc=g++ -Duse64bitall DEBUGGING
~~ ../t/op/tiehandle.t ......................................... FAILED Non-zero exit status: 2 No plan found in TAP output
  [stdio] -Dcc=g++ -Duse64bitall
  [stdio] -Dcc=g++ -Duselongdouble DEBUGGING
  [stdio] -Dcc=g++ DEBUGGING
  [stdio] -Dcc=g++
  [stdio] -Dcc=g++ -Duselongdouble
  [stdio] -Dcc=g++ -Duse64bitall DEBUGGING
~~ ../t/op/loopctl.t ........................................... FAILED Non-zero exit status: 2 No plan found in TAP output
  [stdio] -Dcc=g++ -Duse64bitall
  [stdio] -Dcc=g++ -Duselongdouble DEBUGGING
  [stdio] -Dcc=g++ DEBUGGING
  [stdio] -Dcc=g++
  [stdio] -Dcc=g++ -Duselongdouble
  [stdio] -Dcc=g++ -Duse64bitall DEBUGGING
~~ ../t/op/time_loop.t ......................................... FAILED Non-zero exit status: 2 No plan found in TAP output
  [stdio] -Dcc=g++ -Duse64bitall
  [stdio] -Dcc=g++ -Duselongdouble DEBUGGING
  [stdio] -Dcc=g++ DEBUGGING
  [stdio] -Dcc=g++
  [stdio] -Dcc=g++ -Duselongdouble
  [stdio] -Dcc=g++ -Duse64bitall DEBUGGING
~~ ../t/re/regexp_qr_embed_thr.t ............................... FAILED Non-zero exit status: 2 No plan found in TAP output
  [stdio] -Dcc=g++ -Duse64bitall
  [stdio] -Dcc=g++ -Duselongdouble DEBUGGING
  [stdio] -Dcc=g++ DEBUGGING
  [stdio] -Dcc=g++
  [stdio] -Dcc=g++ -Duselongdouble
  [stdio] -Dcc=g++ -Duse64bitall DEBUGGING
~~ ../t/op/fork.t .............................................. FAILED Non-zero exit status: 2 No plan found in TAP output
  [stdio] -Dcc=g++ -Duse64bitall
  [stdio] -Dcc=g++ -Duselongdouble DEBUGGING
  [stdio] -Dcc=g++ DEBUGGING
  [stdio] -Dcc=g++
  [stdio] -Dcc=g++ -Duselongdouble
  [stdio] -Dcc=g++ -Duse64bitall DEBUGGING
~~ ../t/op/sigsystem.t ......................................... FAILED Non-zero exit status: 2 No plan found in TAP output
  [stdio] -Dcc=g++ -Duse64bitall
  [stdio] -Dcc=g++ -Duselongdouble DEBUGGING
  [stdio] -Dcc=g++ DEBUGGING
  [stdio] -Dcc=g++
  [stdio] -Dcc=g++ -Duselongdouble
  [stdio] -Dcc=g++ -Duse64bitall DEBUGGING
~~ ../ext/IPC-Open3/t/fd.t ..................................... FAILED Non-zero exit status: 2 No plan found in TAP output
  [stdio] -Dcc=g++ -Duse64bitall
  [stdio] -Dcc=g++ -Duselongdouble DEBUGGING
  [stdio] -Dcc=g++ DEBUGGING
  [stdio] -Dcc=g++
  [stdio] -Dcc=g++ -Duselongdouble
  [stdio] -Dcc=g++ -Duse64bitall DEBUGGING
~~ ../t/uni/title.t ............................................ FAILED Non-zero exit status: 2 No plan found in TAP output
  [stdio] -Dcc=g++ -Duse64bitall
  [stdio] -Dcc=g++ -Duselongdouble DEBUGGING
  [stdio] -Dcc=g++ DEBUGGING
  [stdio] -Dcc=g++
  [stdio] -Dcc=g++ -Duselongdouble
  [stdio] -Dcc=g++ -Duse64bitall DEBUGGING
~~ ../t/op/readline.t .......................................... FAILED Non-zero exit status: 2 No plan found in TAP output
  [stdio] -Dcc=g++ -Duse64bitall
  [stdio] -Dcc=g++ -Duselongdouble DEBUGGING
  [stdio] -Dcc=g++ DEBUGGING
  [stdio] -Dcc=g++
  [stdio] -Dcc=g++ -Duselongdouble
  [stdio] -Dcc=g++ -Duse64bitall DEBUGGING
~~ ../t/op/tr.t ................................................ FAILED Non-zero exit status: 2 No plan found in TAP output
  [stdio] -Dcc=g++ -Duse64bitall
  [stdio] -Dcc=g++ -Duselongdouble DEBUGGING
  [stdio] -Dcc=g++ DEBUGGING
  [stdio] -Dcc=g++
  [stdio] -Dcc=g++ -Duselongdouble
  [stdio] -Dcc=g++ -Duse64bitall DEBUGGING
~~ ../t/op/kill0.t ............................................. FAILED Non-zero exit status: 2 No plan found in TAP output
  [stdio] -Dcc=g++ -Duse64bitall
  [stdio] -Dcc=g++ -Duselongdouble DEBUGGING
  [stdio] -Dcc=g++ DEBUGGING
  [stdio] -Dcc=g++
  [stdio] -Dcc=g++ -Duselongdouble
  [stdio] -Dcc=g++ -Duse64bitall DEBUGGING
~~ ../ext/B/t/optree_samples.t ................................. FAILED Non-zero exit status: 2 No plan found in TAP output
  [stdio] -Dcc=g++ -Duse64bitall
  [stdio] -Dcc=g++ -Duselongdouble DEBUGGING
  [stdio] -Dcc=g++ DEBUGGING
  [stdio] -Dcc=g++
  [stdio] -Dcc=g++ -Duselongdouble
  [stdio] -Dcc=g++ -Duse64bitall DEBUGGING
~~ ../cpan/Compress-Raw-Bzip2/t/19nonpv.t ...................... FAILED Non-zero exit status: 255 No plan found in TAP output
  [stdio] -Dcc=g++ -Duse64bitall
  [stdio] -Dcc=g++ -Duselongdouble DEBUGGING
  [stdio] -Dcc=g++ DEBUGGING
  [stdio] -Dcc=g++
  [stdio] -Dcc=g++ -Duselongdouble
  [stdio] -Dcc=g++ -Duse64bitall DEBUGGING
~~ ../t/mro/isa_aliases_utf8.t ................................. FAILED Non-zero exit status: 2 No plan found in TAP output
  [stdio] -Dcc=g++ -Duse64bitall
  [stdio] -Dcc=g++ -Duselongdouble DEBUGGING
  [stdio] -Dcc=g++ DEBUGGING
  [stdio] -Dcc=g++
  [stdio] -Dcc=g++ -Duselongdouble
  [stdio] -Dcc=g++ -Duse64bitall DEBUGGING
~~ ../t/uni/greek.t ............................................ FAILED Non-zero exit status: 2 No plan found in TAP output
  [stdio] -Dcc=g++ -Duse64bitall
  [stdio] -Dcc=g++ -Duselongdouble DEBUGGING
  [stdio] -Dcc=g++ DEBUGGING
  [stdio] -Dcc=g++
  [stdio] -Dcc=g++ -Duselongdouble
  [stdio] -Dcc=g++ -Duse64bitall DEBUGGING
~~ ../t/io/read.t .............................................. FAILED Non-zero exit status: 2 No plan found in TAP output
  [stdio] -Dcc=g++ -Duse64bitall
  [stdio] -Dcc=g++ -Duselongdouble DEBUGGING
  [stdio] -Dcc=g++ DEBUGGING
  [stdio] -Dcc=g++
  [stdio] -Dcc=g++ -Duselongdouble
  [stdio] -Dcc=g++ -Duse64bitall DEBUGGING
~~ ../dist/threads/t/thread.t .................................. FAILED Non-zero exit status: 2 No plan found in TAP output
  [stdio] -Dcc=g++ -Duse64bitall
  [stdio] -Dcc=g++ -Duselongdouble DEBUGGING
  [stdio] -Dcc=g++ DEBUGGING
  [stdio] -Dcc=g++
  [stdio] -Dcc=g++ -Duselongdouble
  [stdio] -Dcc=g++ -Duse64bitall DEBUGGING
~~ ../t/op/array.t ............................................. FAILED Non-zero exit status: 2 No plan found in TAP output
  [stdio] -Dcc=g++ -Duse64bitall
  [stdio] -Dcc=g++ -Duselongdouble DEBUGGING
  [stdio] -Dcc=g++ DEBUGGING
  [stdio] -Dcc=g++
  [stdio] -Dcc=g++ -Duselongdouble
  [stdio] -Dcc=g++ -Duse64bitall DEBUGGING
~~ ../lib/Config.t ............................................. FAILED Non-zero exit status: 2 No plan found in TAP output
  [stdio] -Dcc=g++ -Duse64bitall
  [stdio] -Dcc=g++ -Duselongdouble DEBUGGING
  [stdio] -Dcc=g++ DEBUGGING
  [stdio] -Dcc=g++
  [stdio] -Dcc=g++ -Duselongdouble
  [stdio] -Dcc=g++ -Duse64bitall DEBUGGING
~~ ../dist/Devel-PPPort/t/ppphtest.t ........................... FAILED 5-13 50-53 83-84 118-132 152-161 202-204 Bad plan.  You planned 238 tests but ran 209.
  [stdio] -Dcc=g++ -Duse64bitall
  [stdio] -Dcc=g++ -Duselongdouble DEBUGGING
  [stdio] -Dcc=g++ DEBUGGING
  [stdio] -Dcc=g++
  [stdio] -Dcc=g++ -Duselongdouble
  [stdio] -Dcc=g++ -Duse64bitall DEBUGGING
~~ ../ext/File-Glob/t/case.t ................................... FAILED Non-zero exit status: 2 No plan found in TAP output
  [stdio] -Dcc=g++ -Duse64bitall
  [stdio] -Dcc=g++ -Duselongdouble DEBUGGING
  [stdio] -Dcc=g++ DEBUGGING
  [stdio] -Dcc=g++
  [stdio] -Dcc=g++ -Duselongdouble
  [stdio] -Dcc=g++ -Duse64bitall DEBUGGING
~~ ../t/op/flip.t .............................................. FAILED Non-zero exit status: 2 No plan found in TAP output
  [stdio] -Dcc=g++ -Duse64bitall
  [stdio] -Dcc=g++ -Duselongdouble DEBUGGING
  [stdio] -Dcc=g++ DEBUGGING
  [stdio] -Dcc=g++
  [stdio] -Dcc=g++ -Duselongdouble
  [stdio] -Dcc=g++ -Duse64bitall DEBUGGING
~~ ../ext/B/t/showlex.t ........................................ FAILED Non-zero exit status: 2 No plan found in TAP output
  [stdio] -Dcc=g++ -Duse64bitall
  [stdio] -Dcc=g++ -Duselongdouble DEBUGGING
  [stdio] -Dcc=g++ DEBUGGING
  [stdio] -Dcc=g++
  [stdio] -Dcc=g++ -Duselongdouble
  [stdio] -Dcc=g++ -Duse64bitall DEBUGGING
~~ ../t/op/inccode.t ........................................... FAILED Non-zero exit status: 2 No plan found in TAP output
  [stdio] -Dcc=g++ -Duse64bitall
  [stdio] -Dcc=g++ -Duselongdouble DEBUGGING
  [stdio] -Dcc=g++ DEBUGGING
  [stdio] -Dcc=g++
  [stdio] -Dcc=g++ -Duselongdouble
  [stdio] -Dcc=g++ -Duse64bitall DEBUGGING
~~ ../t/op/stash.t ............................................. FAILED Non-zero exit status: 2 No plan found in TAP output
  [stdio] -Dcc=g++ -Duse64bitall
  [stdio] -Dcc=g++ -Duselongdouble DEBUGGING
  [stdio] -Dcc=g++ DEBUGGING
  [stdio] -Dcc=g++
  [stdio] -Dcc=g++ -Duselongdouble
  [stdio] -Dcc=g++ -Duse64bitall DEBUGGING
~~ ../t/mro/isa_c3.t ........................................... FAILED Non-zero exit status: 2 No plan found in TAP output
  [stdio] -Dcc=g++ -Duse64bitall
  [stdio] -Dcc=g++ -Duselongdouble DEBUGGING
  [stdio] -Dcc=g++ DEBUGGING
  [stdio] -Dcc=g++
  [stdio] -Dcc=g++ -Duselongdouble
  [stdio] -Dcc=g++ -Duse64bitall DEBUGGING
~~ ../t/run/switchd-78586.t .................................... FAILED Non-zero exit status: 2 No plan found in TAP output
  [stdio] -Dcc=g++ -Duse64bitall
  [stdio] -Dcc=g++ -Duselongdouble DEBUGGING
  [stdio] -Dcc=g++ DEBUGGING
  [stdio] -Dcc=g++
  [stdio] -Dcc=g++ -Duselongdouble
  [stdio] -Dcc=g++ -Duse64bitall DEBUGGING
~~ ../t/uni/latin2.t ........................................... FAILED Non-zero exit status: 2 No plan found in TAP output
  [stdio] -Dcc=g++ -Duse64bitall
  [stdio] -Dcc=g++ -Duselongdouble DEBUGGING
  [stdio] -Dcc=g++ DEBUGGING
  [stdio] -Dcc=g++
  [stdio] -Dcc=g++ -Duselongdouble
  [stdio] -Dcc=g++ -Duse64bitall DEBUGGING
~~ ../ext/XS-APItest/t/xs_special_subs_require.t ............... FAILED 71-73 Non-zero exit status: 3
  [stdio] -Dcc=g++ -Duse64bitall
  [stdio] -Dcc=g++ -Duselongdouble DEBUGGING
  [stdio] -Dcc=g++ DEBUGGING
  [stdio] -Dcc=g++
  [stdio] -Dcc=g++ -Duselongdouble
  [stdio] -Dcc=g++ -Duse64bitall DEBUGGING
~~ ../t/porting/corelist.t ..................................... FAILED Non-zero exit status: 2 No plan found in TAP output
  [stdio] -Dcc=g++ -Duse64bitall
  [stdio] -Dcc=g++ -Duselongdouble DEBUGGING
  [stdio] -Dcc=g++ DEBUGGING
  [stdio] -Dcc=g++
  [stdio] -Dcc=g++ -Duselongdouble
  [stdio] -Dcc=g++ -Duse64bitall DEBUGGING
~~ ../dist/threads/t/free2.t ................................... FAILED Non-zero exit status: 2 No plan found in TAP output
  [stdio] -Dcc=g++ -Duse64bitall
  [stdio] -Dcc=g++ -Duselongdouble DEBUGGING
  [stdio] -Dcc=g++ DEBUGGING
  [stdio] -Dcc=g++
  [stdio] -Dcc=g++ -Duselongdouble
  [stdio] -Dcc=g++ -Duse64bitall DEBUGGING
~~ ../lib/Symbol.t ............................................. FAILED Non-zero exit status: 255 Bad plan.  You planned 26 tests but ran 0.
  [stdio] -Dcc=g++ -Duse64bitall
  [stdio] -Dcc=g++ -Duselongdouble DEBUGGING
  [stdio] -Dcc=g++ DEBUGGING
  [stdio] -Dcc=g++
  [stdio] -Dcc=g++ -Duselongdouble
  [stdio] -Dcc=g++ -Duse64bitall DEBUGGING
~~ ../t/op/stat.t .............................................. FAILED Non-zero exit status: 2 No plan found in TAP output
  [stdio] -Dcc=g++ -Duse64bitall
  [stdio] -Dcc=g++ -Duselongdouble DEBUGGING
  [stdio] -Dcc=g++ DEBUGGING
  [stdio] -Dcc=g++
  [stdio] -Dcc=g++ -Duselongdouble
  [stdio] -Dcc=g++ -Duse64bitall DEBUGGING
~~ ../t/op/magic-27839.t ....................................... FAILED Non-zero exit status: 2 No plan found in TAP output
  [stdio] -Dcc=g++ -Duse64bitall
  [stdio] -Dcc=g++ -Duselongdouble DEBUGGING
  [stdio] -Dcc=g++ DEBUGGING
  [stdio] -Dcc=g++
  [stdio] -Dcc=g++ -Duselongdouble
  [stdio] -Dcc=g++ -Duse64bitall DEBUGGING
~~ ../ext/File-Find/t/find.t ................................... FAILED Non-zero exit status: 2 No plan found in TAP output
  [stdio] -Dcc=g++ -Duse64bitall
  [stdio] -Dcc=g++ -Duselongdouble DEBUGGING
  [stdio] -Dcc=g++ DEBUGGING
  [stdio] -Dcc=g++
  [stdio] -Dcc=g++ -Duselongdouble
  [stdio] -Dcc=g++ -Duse64bitall DEBUGGING
~~ ../dist/Storable/t/downgrade.t .............................. FAILED 13-14 61 114-115 Non-zero exit status: 31
  [stdio] -Dcc=g++ -Duse64bitall
~~ ../t/op/method.t ............................................ FAILED Non-zero exit status: 2 No plan found in TAP output
  [stdio] -Dcc=g++ -Duse64bitall
  [stdio] -Dcc=g++ -Duselongdouble DEBUGGING
  [stdio] -Dcc=g++ DEBUGGING
  [stdio] -Dcc=g++
  [stdio] -Dcc=g++ -Duselongdouble
  [stdio] -Dcc=g++ -Duse64bitall DEBUGGING
~~ ../t/op/getppid.t ........................................... FAILED Non-zero exit status: 2 No plan found in TAP output
  [stdio] -Dcc=g++ -Duse64bitall
  [stdio] -Dcc=g++ -Duselongdouble DEBUGGING
  [stdio] -Dcc=g++ DEBUGGING
  [stdio] -Dcc=g++
  [stdio] -Dcc=g++ -Duselongdouble
  [stdio] -Dcc=g++ -Duse64bitall DEBUGGING
~~ ../lib/sigtrap.t ............................................ FAILED Non-zero exit status: 2 No plan found in TAP output
  [stdio] -Dcc=g++ -Duse64bitall
  [stdio] -Dcc=g++ -Duselongdouble DEBUGGING
  [stdio] -Dcc=g++ DEBUGGING
  [stdio] -Dcc=g++
  [stdio] -Dcc=g++ -Duselongdouble
  [stdio] -Dcc=g++ -Duse64bitall DEBUGGING
~~ ../t/op/unshift.t ........................................... FAILED Non-zero exit status: 2 No plan found in TAP output
  [stdio] -Dcc=g++ -Duse64bitall
  [stdio] -Dcc=g++ -Duselongdouble DEBUGGING
  [stdio] -Dcc=g++ DEBUGGING
  [stdio] -Dcc=g++
  [stdio] -Dcc=g++ -Duselongdouble
  [stdio] -Dcc=g++ -Duse64bitall DEBUGGING
~~ ../t/uni/fold.t ............................................. FAILED Non-zero exit status: 2 No plan found in TAP output
  [stdio] -Dcc=g++ -Duse64bitall
  [stdio] -Dcc=g++ -Duselongdouble DEBUGGING
  [stdio] -Dcc=g++ DEBUGGING
  [stdio] -Dcc=g++
  [stdio] -Dcc=g++ -Duselongdouble
  [stdio] -Dcc=g++ -Duse64bitall DEBUGGING
~~ ../t/re/fold_grind_u.t ...................................... FAILED Non-zero exit status: 2 No plan found in TAP output
  [stdio] -Dcc=g++ -Duse64bitall
  [stdio] -Dcc=g++ -Duselongdouble DEBUGGING
  [stdio] -Dcc=g++ DEBUGGING
  [stdio] -Dcc=g++
  [stdio] -Dcc=g++ -Duselongdouble
  [stdio] -Dcc=g++ -Duse64bitall DEBUGGING
~~ ../t/io/socketpair.t ........................................ FAILED Non-zero exit status: 2 No plan found in TAP output
  [stdio] -Dcc=g++ -Duse64bitall
  [stdio] -Dcc=g++ -Duselongdouble DEBUGGING
  [stdio] -Dcc=g++ DEBUGGING
  [stdio] -Dcc=g++
  [stdio] -Dcc=g++ -Duselongdouble
  [stdio] -Dcc=g++ -Duse64bitall DEBUGGING
~~ ../dist/Data-Dumper/t/dumper.t .............................. FAILED 1 Non-zero exit status: 2 Bad plan.  You planned 468 tests but ran 36.
  [stdio] -Dcc=g++ -Duse64bitall
  [stdio] -Dcc=g++ -Duselongdouble DEBUGGING
  [stdio] -Dcc=g++ DEBUGGING
  [stdio] -Dcc=g++
  [stdio] -Dcc=g++ -Duselongdouble
  [stdio] -Dcc=g++ -Duse64bitall DEBUGGING
~~ ../t/op/incfilter.t ......................................... FAILED Non-zero exit status: 2 No plan found in TAP output
  [stdio] -Dcc=g++ -Duse64bitall
  [stdio] -Dcc=g++ -Duselongdouble DEBUGGING
  [stdio] -Dcc=g++ DEBUGGING
  [stdio] -Dcc=g++
  [stdio] -Dcc=g++ -Duselongdouble
  [stdio] -Dcc=g++ -Duse64bitall DEBUGGING
~~ ../t/porting/regen.t ........................................ FAILED 20-21
  [stdio] -Dcc=g++ -Duse64bitall
  [stdio] -Dcc=g++ -Duselongdouble DEBUGGING
  [stdio] -Dcc=g++ DEBUGGING
  [stdio] -Dcc=g++
  [stdio] -Dcc=g++ -Duselongdouble
  [stdio] -Dcc=g++ -Duse64bitall DEBUGGING
~~ ../t/perf/taint.t ........................................... FAILED Non-zero exit status: 2 No plan found in TAP output
  [stdio] -Dcc=g++ -Duse64bitall
  [stdio] -Dcc=g++ -Duselongdouble DEBUGGING
  [stdio] -Dcc=g++ DEBUGGING
  [stdio] -Dcc=g++
  [stdio] -Dcc=g++ -Duselongdouble
  [stdio] -Dcc=g++ -Duse64bitall DEBUGGING
~~ ../t/op/write.t ............................................. FAILED Non-zero exit status: 2 No plan found in TAP output
  [stdio] -Dcc=g++ -Duse64bitall
  [stdio] -Dcc=g++ -Duselongdouble DEBUGGING
  [stdio] -Dcc=g++ DEBUGGING
  [stdio] -Dcc=g++
  [stdio] -Dcc=g++ -Duselongdouble
  [stdio] -Dcc=g++ -Duse64bitall DEBUGGING
~~ ../cpan/Time-Piece/t/07arith.t .............................. FAILED Non-zero exit status: 255 Bad plan.  You planned 43 tests but ran 2.
  [stdio] -Dcc=g++ -Duse64bitall
  [stdio] -Dcc=g++ -Duselongdouble DEBUGGING
  [stdio] -Dcc=g++ DEBUGGING
  [stdio] -Dcc=g++
  [stdio] -Dcc=g++ -Duselongdouble
  [stdio] -Dcc=g++ -Duse64bitall DEBUGGING
~~ ../t/op/sigdispatch.t ....................................... FAILED Non-zero exit status: 2 No plan found in TAP output
  [stdio] -Dcc=g++ -Duse64bitall
  [stdio] -Dcc=g++ -Duselongdouble DEBUGGING
  [stdio] -Dcc=g++ DEBUGGING
  [stdio] -Dcc=g++
  [stdio] -Dcc=g++ -Duselongdouble
  [stdio] -Dcc=g++ -Duse64bitall DEBUGGING
~~ ../t/op/exp.t ............................................... FAILED Non-zero exit status: 2 No plan found in TAP output
  [stdio] -Dcc=g++ -Duse64bitall
  [stdio] -Dcc=g++ -Duselongdouble DEBUGGING
  [stdio] -Dcc=g++ DEBUGGING
  [stdio] -Dcc=g++
  [stdio] -Dcc=g++ -Duselongdouble
  [stdio] -Dcc=g++ -Duse64bitall DEBUGGING
~~ ../t/uni/select.t ........................................... FAILED Non-zero exit status: 2 No plan found in TAP output
  [stdio] -Dcc=g++ -Duse64bitall
  [stdio] -Dcc=g++ -Duselongdouble DEBUGGING
  [stdio] -Dcc=g++ DEBUGGING
  [stdio] -Dcc=g++
  [stdio] -Dcc=g++ -Duselongdouble
  [stdio] -Dcc=g++ -Duse64bitall DEBUGGING
~~ ../t/io/say.t ............................................... FAILED Non-zero exit status: 2 No plan found in TAP output
  [stdio] -Dcc=g++ -Duse64bitall
  [stdio] -Dcc=g++ -Duselongdouble DEBUGGING
  [stdio] -Dcc=g++ DEBUGGING
  [stdio] -Dcc=g++
  [stdio] -Dcc=g++ -Duselongdouble
  [stdio] -Dcc=g++ -Duse64bitall DEBUGGING
~~ ../ext/B/t/pragma.t ......................................... FAILED Non-zero exit status: 255 Bad plan.  You planned 12 tests but ran 0.
  [stdio] -Dcc=g++ -Duse64bitall
  [stdio] -Dcc=g++ -Duselongdouble DEBUGGING
  [stdio] -Dcc=g++ DEBUGGING
  [stdio] -Dcc=g++
  [stdio] -Dcc=g++ -Duselongdouble
  [stdio] -Dcc=g++ -Duse64bitall DEBUGGING
~~ ../t/run/switchn.t .......................................... FAILED Non-zero exit status: 2 No plan found in TAP output
  [stdio] -Dcc=g++ -Duse64bitall
  [stdio] -Dcc=g++ -Duselongdouble DEBUGGING
  [stdio] -Dcc=g++ DEBUGGING
  [stdio] -Dcc=g++
  [stdio] -Dcc=g++ -Duselongdouble
  [stdio] -Dcc=g++ -Duse64bitall DEBUGGING
~~ ../t/op/chdir.t ............................................. FAILED Non-zero exit status: 2 No plan found in TAP output
  [stdio] -Dcc=g++ -Duse64bitall
  [stdio] -Dcc=g++ -Duselongdouble DEBUGGING
  [stdio] -Dcc=g++ DEBUGGING
  [stdio] -Dcc=g++
  [stdio] -Dcc=g++ -Duselongdouble
  [stdio] -Dcc=g++ -Duse64bitall DEBUGGING
~~ ../ext/IPC-Open3/t/IPC-Open3.t .............................. FAILED Non-zero exit status: 255 No plan found in TAP output
  [stdio] -Dcc=g++ -Duse64bitall
  [stdio] -Dcc=g++ -Duselongdouble DEBUGGING
  [stdio] -Dcc=g++ DEBUGGING
  [stdio] -Dcc=g++
  [stdio] -Dcc=g++ -Duselongdouble
  [stdio] -Dcc=g++ -Duse64bitall DEBUGGING
~~ ../t/mro/isa_dfs.t .......................................... FAILED Non-zero exit status: 2 No plan found in TAP output
  [stdio] -Dcc=g++ -Duse64bitall
  [stdio] -Dcc=g++ -Duselongdouble DEBUGGING
  [stdio] -Dcc=g++ DEBUGGING
  [stdio] -Dcc=g++
  [stdio] -Dcc=g++ -Duselongdouble
  [stdio] -Dcc=g++ -Duse64bitall DEBUGGING
~~ ../t/io/sem.t ............................................... FAILED Non-zero exit status: 2 No plan found in TAP output
  [stdio] -Dcc=g++ -Duse64bitall
  [stdio] -Dcc=g++ -Duselongdouble DEBUGGING
  [stdio] -Dcc=g++ DEBUGGING
  [stdio] -Dcc=g++
  [stdio] -Dcc=g++ -Duselongdouble
  [stdio] -Dcc=g++ -Duse64bitall DEBUGGING
~~ ../t/op/wantarray.t ......................................... FAILED Non-zero exit status: 2 No plan found in TAP output
  [stdio] -Dcc=g++ -Duse64bitall
  [stdio] -Dcc=g++ -Duselongdouble DEBUGGING
  [stdio] -Dcc=g++ DEBUGGING
  [stdio] -Dcc=g++
  [stdio] -Dcc=g++ -Duselongdouble
  [stdio] -Dcc=g++ -Duse64bitall DEBUGGING
~~ ../cpan/Test-Simple/t/Legacy/Tester/tbt_05faildiag.t ........ FAILED Non-zero exit status: 255 Bad plan.  You planned 5 tests but ran 0.
  [stdio] -Dcc=g++ -Duse64bitall
  [stdio] -Dcc=g++ -Duselongdouble DEBUGGING
  [stdio] -Dcc=g++ DEBUGGING
  [stdio] -Dcc=g++
  [stdio] -Dcc=g++ -Duselongdouble
  [stdio] -Dcc=g++ -Duse64bitall DEBUGGING
~~ ../t/run/cloexec.t .......................................... FAILED Non-zero exit status: 2 No plan found in TAP output
  [stdio] -Dcc=g++ -Duse64bitall
  [stdio] -Dcc=g++ -Duselongdouble DEBUGGING
  [stdio] -Dcc=g++ DEBUGGING
  [stdio] -Dcc=g++
  [stdio] -Dcc=g++ -Duselongdouble
  [stdio] -Dcc=g++ -Duse64bitall DEBUGGING
~~ ../cpan/Pod-Checker/t/pod/podchkenc.t ....................... FAILED Non-zero exit status: 255 No plan found in TAP output
  [stdio] -Dcc=g++ -Duse64bitall
  [stdio] -Dcc=g++ -Duselongdouble DEBUGGING
  [stdio] -Dcc=g++ DEBUGGING
  [stdio] -Dcc=g++
  [stdio] -Dcc=g++ -Duselongdouble
  [stdio] -Dcc=g++ -Duse64bitall DEBUGGING
~~ ../t/op/64bitint.t .......................................... FAILED Non-zero exit status: 2 No plan found in TAP output
  [stdio] -Dcc=g++ -Duse64bitall
  [stdio] -Dcc=g++ -Duselongdouble DEBUGGING
  [stdio] -Dcc=g++ DEBUGGING
  [stdio] -Dcc=g++
  [stdio] -Dcc=g++ -Duselongdouble
  [stdio] -Dcc=g++ -Duse64bitall DEBUGGING
~~ ../t/uni/variables.t ........................................ FAILED Non-zero exit status: 2 No plan found in TAP output
  [stdio] -Dcc=g++ -Duse64bitall
  [stdio] -Dcc=g++ -Duselongdouble DEBUGGING
  [stdio] -Dcc=g++ DEBUGGING
  [stdio] -Dcc=g++
  [stdio] -Dcc=g++ -Duselongdouble
  [stdio] -Dcc=g++ -Duse64bitall DEBUGGING
~~ ../cpan/Test-Simple/t/Test2/acceptance/try_it_plan.t ........ FAILED Non-zero exit status: 255 No plan found in TAP output
  [stdio] -Dcc=g++ -Duse64bitall
  [stdio] -Dcc=g++ -Duselongdouble DEBUGGING
  [stdio] -Dcc=g++ DEBUGGING
  [stdio] -Dcc=g++
  [stdio] -Dcc=g++ -Duselongdouble
  [stdio] -Dcc=g++ -Duse64bitall DEBUGGING
~~ ../cpan/Text-Balanced/t/08_extvar.t ......................... FAILED Non-zero exit status: 255 Bad plan.  You planned 183 tests but ran 0.
  [stdio] -Dcc=g++ -Duse64bitall
  [stdio] -Dcc=g++ -Duselongdouble DEBUGGING
  [stdio] -Dcc=g++ DEBUGGING
  [stdio] -Dcc=g++
  [stdio] -Dcc=g++ -Duselongdouble
  [stdio] -Dcc=g++ -Duse64bitall DEBUGGING
~~ ../t/op/sselect.t ........................................... FAILED Non-zero exit status: 2 No plan found in TAP output
  [stdio] -Dcc=g++ -Duse64bitall
  [stdio] -Dcc=g++ -Duselongdouble DEBUGGING
  [stdio] -Dcc=g++ DEBUGGING
  [stdio] -Dcc=g++
  [stdio] -Dcc=g++ -Duselongdouble
  [stdio] -Dcc=g++ -Duse64bitall DEBUGGING
~~ ../ext/XS-APItest/t/my_exit.t ............................... FAILED Non-zero exit status: 2 No plan found in TAP output
  [stdio] -Dcc=g++ -Duse64bitall
  [stdio] -Dcc=g++ -Duselongdouble DEBUGGING
  [stdio] -Dcc=g++ DEBUGGING
  [stdio] -Dcc=g++
  [stdio] -Dcc=g++ -Duselongdouble
  [stdio] -Dcc=g++ -Duse64bitall DEBUGGING
~~ ../t/op/isa.t ............................................... FAILED Non-zero exit status: 2 No plan found in TAP output
  [stdio] -Dcc=g++ -Duse64bitall
  [stdio] -Dcc=g++ -Duselongdouble DEBUGGING
  [stdio] -Dcc=g++ DEBUGGING
  [stdio] -Dcc=g++
  [stdio] -Dcc=g++ -Duselongdouble
  [stdio] -Dcc=g++ -Duse64bitall DEBUGGING
~~ ../cpan/Test-Simple/t/Legacy/exit.t ......................... FAILED 1-256
  [stdio] -Dcc=g++ -Duse64bitall
  [stdio] -Dcc=g++
  [stdio] -Dcc=g++ -Duselongdouble
~~ ../t/io/crlf_through.t ...................................... FAILED Non-zero exit status: 2 No plan found in TAP output
  [stdio] -Dcc=g++ -Duse64bitall
  [stdio] -Dcc=g++ -Duselongdouble DEBUGGING
  [stdio] -Dcc=g++ DEBUGGING
  [stdio] -Dcc=g++
  [stdio] -Dcc=g++ -Duselongdouble
  [stdio] -Dcc=g++ -Duse64bitall DEBUGGING
~~ ../t/re/overload.t .......................................... FAILED Non-zero exit status: 2 No plan found in TAP output
  [stdio] -Dcc=g++ -Duse64bitall
  [stdio] -Dcc=g++ -Duselongdouble DEBUGGING
  [stdio] -Dcc=g++ DEBUGGING
  [stdio] -Dcc=g++
  [stdio] -Dcc=g++ -Duselongdouble
  [stdio] -Dcc=g++ -Duse64bitall DEBUGGING
~~ ../ext/FileCache/t/07noimport.t ............................. FAILED Non-zero exit status: 25 Bad plan.  You planned 1 tests but ran 0.
  [stdio] -Dcc=g++ -Duse64bitall
  [stdio] -Dcc=g++ -Duselongdouble DEBUGGING
  [stdio] -Dcc=g++ DEBUGGING
  [stdio] -Dcc=g++
  [stdio] -Dcc=g++ -Duselongdouble
  [stdio] -Dcc=g++ -Duse64bitall DEBUGGING
~~ ../dist/ExtUtils-CBuilder/t/02-link.t ....................... FAILED Non-zero exit status: 255 No plan found in TAP output
  [stdio] -Dcc=g++ -Duse64bitall
  [stdio] -Dcc=g++ -Duselongdouble DEBUGGING
  [stdio] -Dcc=g++ DEBUGGING
  [stdio] -Dcc=g++
  [stdio] -Dcc=g++ -Duselongdouble
  [stdio] -Dcc=g++ -Duse64bitall DEBUGGING
~~ ../dist/threads/t/free.t .................................... FAILED Non-zero exit status: 2 No plan found in TAP output
  [stdio] -Dcc=g++ -Duse64bitall
  [stdio] -Dcc=g++ -Duselongdouble DEBUGGING
  [stdio] -Dcc=g++ DEBUGGING
  [stdio] -Dcc=g++
  [stdio] -Dcc=g++ -Duselongdouble
  [stdio] -Dcc=g++ -Duse64bitall DEBUGGING
~~ ../t/re/reg_email_thr.t ..................................... FAILED Non-zero exit status: 2 No plan found in TAP output
  [stdio] -Dcc=g++ -Duse64bitall
  [stdio] -Dcc=g++ -Duselongdouble DEBUGGING
  [stdio] -Dcc=g++ DEBUGGING
  [stdio] -Dcc=g++
  [stdio] -Dcc=g++ -Duselongdouble
  [stdio] -Dcc=g++ -Duse64bitall DEBUGGING
~~ ../dist/ExtUtils-CBuilder/t/01-basic.t ...................... FAILED Non-zero exit status: 255 No plan found in TAP output
  [stdio] -Dcc=g++ -Duse64bitall
  [stdio] -Dcc=g++ -Duselongdouble DEBUGGING
  [stdio] -Dcc=g++ DEBUGGING
  [stdio] -Dcc=g++
  [stdio] -Dcc=g++ -Duselongdouble
  [stdio] -Dcc=g++ -Duse64bitall DEBUGGING
~~ ../ext/B/t/concise.t ........................................ FAILED Non-zero exit status: 2 No plan found in TAP output
  [stdio] -Dcc=g++ -Duse64bitall
  [stdio] -Dcc=g++ -Duselongdouble DEBUGGING
  [stdio] -Dcc=g++ DEBUGGING
  [stdio] -Dcc=g++
  [stdio] -Dcc=g++ -Duselongdouble
  [stdio] -Dcc=g++ -Duse64bitall DEBUGGING
~~ ../t/mro/overload_c3_utf8.t ................................. FAILED Non-zero exit status: 2 No plan found in TAP output
  [stdio] -Dcc=g++ -Duse64bitall
  [stdio] -Dcc=g++ -Duselongdouble DEBUGGING
  [stdio] -Dcc=g++ DEBUGGING
  [stdio] -Dcc=g++
  [stdio] -Dcc=g++ -Duselongdouble
  [stdio] -Dcc=g++ -Duse64bitall DEBUGGING
~~ ../dist/Storable/t/downgrade.t .............................. FAILED 13 66-67 114-115 Non-zero exit status: 34
  [stdio] -Dcc=g++ DEBUGGING
~~ ../t/op/anonsub.t ........................................... FAILED Non-zero exit status: 2 No plan found in TAP output
  [stdio] -Dcc=g++ -Duse64bitall
  [stdio] -Dcc=g++ -Duselongdouble DEBUGGING
  [stdio] -Dcc=g++ DEBUGGING
  [stdio] -Dcc=g++
  [stdio] -Dcc=g++ -Duselongdouble
  [stdio] -Dcc=g++ -Duse64bitall DEBUGGING
~~ ../t/io/getcwd.t ............................................ FAILED Non-zero exit status: 2 No plan found in TAP output
  [stdio] -Dcc=g++ -Duse64bitall
  [stdio] -Dcc=g++ -Duselongdouble DEBUGGING
  [stdio] -Dcc=g++ DEBUGGING
  [stdio] -Dcc=g++
  [stdio] -Dcc=g++ -Duselongdouble
  [stdio] -Dcc=g++ -Duse64bitall DEBUGGING
~~ ../t/op/signame_canonical.t ................................. FAILED Non-zero exit status: 2 No plan found in TAP output
  [stdio] -Dcc=g++ -Duse64bitall
  [stdio] -Dcc=g++ -Duselongdouble DEBUGGING
  [stdio] -Dcc=g++ DEBUGGING
  [stdio] -Dcc=g++
  [stdio] -Dcc=g++ -Duselongdouble
  [stdio] -Dcc=g++ -Duse64bitall DEBUGGING
~~ ../t/op/die_except.t ........................................ FAILED Non-zero exit status: 2 No plan found in TAP output
  [stdio] -Dcc=g++ -Duse64bitall
  [stdio] -Dcc=g++ -Duselongdouble DEBUGGING
  [stdio] -Dcc=g++ DEBUGGING
  [stdio] -Dcc=g++
  [stdio] -Dcc=g++ -Duselongdouble
  [stdio] -Dcc=g++ -Duse64bitall DEBUGGING
~~ ../ext/XS-APItest/t/svpv.t .................................. FAILED Non-zero exit status: 2 No plan found in TAP output
  [stdio] -Dcc=g++ -Duse64bitall
  [stdio] -Dcc=g++ -Duselongdouble DEBUGGING
  [stdio] -Dcc=g++ DEBUGGING
  [stdio] -Dcc=g++
  [stdio] -Dcc=g++ -Duselongdouble
  [stdio] -Dcc=g++ -Duse64bitall DEBUGGING
~~ ../t/io/perlio_leaks.t ...................................... FAILED Non-zero exit status: 2 No plan found in TAP output
  [stdio] -Dcc=g++ -Duse64bitall
  [stdio] -Dcc=g++ -Duselongdouble DEBUGGING
  [stdio] -Dcc=g++ DEBUGGING
  [stdio] -Dcc=g++
  [stdio] -Dcc=g++ -Duselongdouble
  [stdio] -Dcc=g++ -Duse64bitall DEBUGGING
~~ ../t/op/tie_fetch_count.t ................................... FAILED Non-zero exit status: 2 No plan found in TAP output
  [stdio] -Dcc=g++ -Duse64bitall
  [stdio] -Dcc=g++ -Duselongdouble DEBUGGING
  [stdio] -Dcc=g++ DEBUGGING
  [stdio] -Dcc=g++
  [stdio] -Dcc=g++ -Duselongdouble
  [stdio] -Dcc=g++ -Duse64bitall DEBUGGING
~~ ../t/op/require_37033.t ..................................... FAILED Non-zero exit status: 2 No plan found in TAP output
  [stdio] -Dcc=g++ -Duse64bitall
  [stdio] -Dcc=g++ -Duselongdouble DEBUGGING
  [stdio] -Dcc=g++ DEBUGGING
  [stdio] -Dcc=g++
  [stdio] -Dcc=g++ -Duselongdouble
  [stdio] -Dcc=g++ -Duse64bitall DEBUGGING
~~ ../t/run/dtrace.t ........................................... FAILED Non-zero exit status: 2 No plan found in TAP output
  [stdio] -Dcc=g++ -Duse64bitall
  [stdio] -Dcc=g++ -Duselongdouble DEBUGGING
  [stdio] -Dcc=g++ DEBUGGING
  [stdio] -Dcc=g++
  [stdio] -Dcc=g++ -Duselongdouble
  [stdio] -Dcc=g++ -Duse64bitall DEBUGGING
~~ ../t/op/lfs.t ............................................... FAILED Non-zero exit status: 2 No plan found in TAP output
  [stdio] -Dcc=g++ -Duse64bitall
  [stdio] -Dcc=g++ -Duselongdouble DEBUGGING
  [stdio] -Dcc=g++ DEBUGGING
  [stdio] -Dcc=g++
  [stdio] -Dcc=g++ -Duselongdouble
  [stdio] -Dcc=g++ -Duse64bitall DEBUGGING
~~ ../t/uni/package.t .......................................... FAILED Non-zero exit status: 2 No plan found in TAP output
  [stdio] -Dcc=g++ -Duse64bitall
  [stdio] -Dcc=g++ -Duselongdouble DEBUGGING
  [stdio] -Dcc=g++ DEBUGGING
  [stdio] -Dcc=g++
  [stdio] -Dcc=g++ -Duselongdouble
  [stdio] -Dcc=g++ -Duse64bitall DEBUGGING
~~ ../t/mro/recursion_c3_utf8.t ................................ FAILED Non-zero exit status: 2 No plan found in TAP output
  [stdio] -Dcc=g++ -Duse64bitall
  [stdio] -Dcc=g++ -Duselongdouble DEBUGGING
  [stdio] -Dcc=g++ DEBUGGING
  [stdio] -Dcc=g++
  [stdio] -Dcc=g++ -Duselongdouble
  [stdio] -Dcc=g++ -Duse64bitall DEBUGGING
~~ ../t/re/reg_eval.t .......................................... FAILED Non-zero exit status: 2 No plan found in TAP output
  [stdio] -Dcc=g++ -Duse64bitall
  [stdio] -Dcc=g++ -Duselongdouble DEBUGGING
  [stdio] -Dcc=g++ DEBUGGING
  [stdio] -Dcc=g++
  [stdio] -Dcc=g++ -Duselongdouble
  [stdio] -Dcc=g++ -Duse64bitall DEBUGGING
~~ ../ext/Opcode/t/Opcode.t .................................... FAILED Non-zero exit status: 255 No plan found in TAP output
  [stdio] -Dcc=g++ -Duse64bitall
  [stdio] -Dcc=g++ -Duselongdouble DEBUGGING
  [stdio] -Dcc=g++ DEBUGGING
  [stdio] -Dcc=g++
  [stdio] -Dcc=g++ -Duselongdouble
  [stdio] -Dcc=g++ -Duse64bitall DEBUGGING
~~ ../dist/IO/t/io_file.t ...................................... FAILED Non-zero exit status: 2 No plan found in TAP output
  [stdio] -Dcc=g++ -Duse64bitall
  [stdio] -Dcc=g++ -Duselongdouble DEBUGGING
  [stdio] -Dcc=g++ DEBUGGING
  [stdio] -Dcc=g++
  [stdio] -Dcc=g++ -Duselongdouble
  [stdio] -Dcc=g++ -Duse64bitall DEBUGGING
~~ ../t/op/lex.t ............................................... FAILED Non-zero exit status: 2 No plan found in TAP output
  [stdio] -Dcc=g++ -Duse64bitall
  [stdio] -Dcc=g++ -Duselongdouble DEBUGGING
  [stdio] -Dcc=g++ DEBUGGING
  [stdio] -Dcc=g++
  [stdio] -Dcc=g++ -Duselongdouble
  [stdio] -Dcc=g++ -Duse64bitall DEBUGGING
~~ ../t/re/rxcode.t ............................................ FAILED Non-zero exit status: 2 No plan found in TAP output
  [stdio] -Dcc=g++ -Duse64bitall
  [stdio] -Dcc=g++ -Duselongdouble DEBUGGING
  [stdio] -Dcc=g++ DEBUGGING
  [stdio] -Dcc=g++
  [stdio] -Dcc=g++ -Duselongdouble
  [stdio] -Dcc=g++ -Duse64bitall DEBUGGING
~~ ../t/op/studytied.t ......................................... FAILED Non-zero exit status: 2 No plan found in TAP output
  [stdio] -Dcc=g++ -Duse64bitall
  [stdio] -Dcc=g++ -Duselongdouble DEBUGGING
  [stdio] -Dcc=g++ DEBUGGING
  [stdio] -Dcc=g++
  [stdio] -Dcc=g++ -Duselongdouble
  [stdio] -Dcc=g++ -Duse64bitall DEBUGGING
~~ ../t/op/stash_parse_gv.t .................................... FAILED Non-zero exit status: 2 No plan found in TAP output
  [stdio] -Dcc=g++ -Duse64bitall
  [stdio] -Dcc=g++ -Duselongdouble DEBUGGING
  [stdio] -Dcc=g++ DEBUGGING
  [stdio] -Dcc=g++
  [stdio] -Dcc=g++ -Duselongdouble
  [stdio] -Dcc=g++ -Duse64bitall DEBUGGING
~~ ../t/op/pwent.t ............................................. FAILED Non-zero exit status: 2 No plan found in TAP output
  [stdio] -Dcc=g++ -Duse64bitall
  [stdio] -Dcc=g++ -Duselongdouble DEBUGGING
  [stdio] -Dcc=g++ DEBUGGING
  [stdio] -Dcc=g++
  [stdio] -Dcc=g++ -Duselongdouble
  [stdio] -Dcc=g++ -Duse64bitall DEBUGGING
~~ ../cpan/Text-Balanced/t/02_extbrk.t ......................... FAILED Non-zero exit status: 255 Bad plan.  You planned 19 tests but ran 0.
  [stdio] -Dcc=g++ -Duse64bitall
  [stdio] -Dcc=g++ -Duselongdouble DEBUGGING
  [stdio] -Dcc=g++ DEBUGGING
  [stdio] -Dcc=g++
  [stdio] -Dcc=g++ -Duselongdouble
  [stdio] -Dcc=g++ -Duse64bitall DEBUGGING
~~ ../t/op/each_array.t ........................................ FAILED Non-zero exit status: 2 No plan found in TAP output
  [stdio] -Dcc=g++ -Duse64bitall
  [stdio] -Dcc=g++ -Duselongdouble DEBUGGING
  [stdio] -Dcc=g++ DEBUGGING
  [stdio] -Dcc=g++
  [stdio] -Dcc=g++ -Duselongdouble
  [stdio] -Dcc=g++ -Duse64bitall DEBUGGING
~~ ../cpan/Text-Balanced/t/04_extdel.t ......................... FAILED Non-zero exit status: 255 Bad plan.  You planned 45 tests but ran 0.
  [stdio] -Dcc=g++ -Duse64bitall
  [stdio] -Dcc=g++ -Duselongdouble DEBUGGING
  [stdio] -Dcc=g++ DEBUGGING
  [stdio] -Dcc=g++
  [stdio] -Dcc=g++ -Duselongdouble
  [stdio] -Dcc=g++ -Duse64bitall DEBUGGING
~~ ../t/mro/method_caching_utf8.t .............................. FAILED Non-zero exit status: 2 No plan found in TAP output
  [stdio] -Dcc=g++ -Duse64bitall
  [stdio] -Dcc=g++ -Duselongdouble DEBUGGING
  [stdio] -Dcc=g++ DEBUGGING
  [stdio] -Dcc=g++
  [stdio] -Dcc=g++ -Duselongdouble
  [stdio] -Dcc=g++ -Duse64bitall DEBUGGING
~~ ../dist/Storable/t/recurse.t ................................ FAILED Non-zero exit status: 255 Bad plan.  You planned 39 tests but ran 0.
  [stdio] -Dcc=g++ -Duse64bitall
  [stdio] -Dcc=g++ -Duselongdouble DEBUGGING
  [stdio] -Dcc=g++ DEBUGGING
  [stdio] -Dcc=g++
  [stdio] -Dcc=g++ -Duselongdouble
  [stdio] -Dcc=g++ -Duse64bitall DEBUGGING
~~ ../t/op/die_exit.t .......................................... FAILED Non-zero exit status: 2 No plan found in TAP output
  [stdio] -Dcc=g++ -Duse64bitall
  [stdio] -Dcc=g++ -Duselongdouble DEBUGGING
  [stdio] -Dcc=g++ DEBUGGING
  [stdio] -Dcc=g++
  [stdio] -Dcc=g++ -Duselongdouble
  [stdio] -Dcc=g++ -Duse64bitall DEBUGGING
~~ ../t/io/perlio_open.t ....................................... FAILED Non-zero exit status: 2 No plan found in TAP output
  [stdio] -Dcc=g++ -Duse64bitall
  [stdio] -Dcc=g++ -Duselongdouble DEBUGGING
  [stdio] -Dcc=g++ DEBUGGING
  [stdio] -Dcc=g++
  [stdio] -Dcc=g++ -Duselongdouble
  [stdio] -Dcc=g++ -Duse64bitall DEBUGGING
~~ ../t/io/crlf.t .............................................. FAILED Non-zero exit status: 2 No plan found in TAP output
  [stdio] -Dcc=g++ -Duse64bitall
  [stdio] -Dcc=g++ -Duselongdouble DEBUGGING
  [stdio] -Dcc=g++ DEBUGGING
  [stdio] -Dcc=g++
  [stdio] -Dcc=g++ -Duselongdouble
  [stdio] -Dcc=g++ -Duse64bitall DEBUGGING
~~ ../t/op/postfixderef.t ...................................... FAILED Non-zero exit status: 2 No plan found in TAP output
  [stdio] -Dcc=g++ -Duse64bitall
  [stdio] -Dcc=g++ -Duselongdouble DEBUGGING
  [stdio] -Dcc=g++ DEBUGGING
  [stdio] -Dcc=g++
  [stdio] -Dcc=g++ -Duselongdouble
  [stdio] -Dcc=g++ -Duse64bitall DEBUGGING
~~ ../lib/overload_nomethod.t .................................. FAILED Non-zero exit status: 2 No plan found in TAP output
  [stdio] -Dcc=g++ -Duse64bitall
  [stdio] -Dcc=g++ -Duselongdouble DEBUGGING
  [stdio] -Dcc=g++ DEBUGGING
  [stdio] -Dcc=g++
  [stdio] -Dcc=g++ -Duselongdouble
  [stdio] -Dcc=g++ -Duse64bitall DEBUGGING
~~ ../t/run/switcht.t .......................................... FAILED Non-zero exit status: 2 No plan found in TAP output
  [stdio] -Dcc=g++ -Duse64bitall
  [stdio] -Dcc=g++ -Duselongdouble DEBUGGING
  [stdio] -Dcc=g++ DEBUGGING
  [stdio] -Dcc=g++
  [stdio] -Dcc=g++ -Duselongdouble
  [stdio] -Dcc=g++ -Duse64bitall DEBUGGING
~~ ../t/op/bless.t ............................................. FAILED Non-zero exit status: 2 No plan found in TAP output
  [stdio] -Dcc=g++ -Duse64bitall
  [stdio] -Dcc=g++ -Duselongdouble DEBUGGING
  [stdio] -Dcc=g++ DEBUGGING
  [stdio] -Dcc=g++
  [stdio] -Dcc=g++ -Duselongdouble
  [stdio] -Dcc=g++ -Duse64bitall DEBUGGING
~~ ../lib/h2ph.t ............................................... FAILED Non-zero exit status: 2 No plan found in TAP output
  [stdio] -Dcc=g++ -Duse64bitall
  [stdio] -Dcc=g++ -Duselongdouble DEBUGGING
  [stdio] -Dcc=g++ DEBUGGING
  [stdio] -Dcc=g++
  [stdio] -Dcc=g++ -Duselongdouble
  [stdio] -Dcc=g++ -Duse64bitall DEBUGGING
~~ ../lib/croak.t .............................................. FAILED Non-zero exit status: 2 No plan found in TAP output
  [stdio] -Dcc=g++ -Duse64bitall
  [stdio] -Dcc=g++ -Duselongdouble DEBUGGING
  [stdio] -Dcc=g++ DEBUGGING
  [stdio] -Dcc=g++
  [stdio] -Dcc=g++ -Duselongdouble
  [stdio] -Dcc=g++ -Duse64bitall DEBUGGING
~~ ../lib/mypragma.t ........................................... FAILED Non-zero exit status: 2 No plan found in TAP output
  [stdio] -Dcc=g++ -Duse64bitall
  [stdio] -Dcc=g++ -Duselongdouble DEBUGGING
  [stdio] -Dcc=g++ DEBUGGING
  [stdio] -Dcc=g++
  [stdio] -Dcc=g++ -Duselongdouble
  [stdio] -Dcc=g++ -Duse64bitall DEBUGGING
~~ ../t/op/length.t ............................................ FAILED Non-zero exit status: 2 No plan found in TAP output
  [stdio] -Dcc=g++ -Duse64bitall
  [stdio] -Dcc=g++ -Duselongdouble DEBUGGING
  [stdio] -Dcc=g++ DEBUGGING
  [stdio] -Dcc=g++
  [stdio] -Dcc=g++ -Duselongdouble
  [stdio] -Dcc=g++ -Duse64bitall DEBUGGING
~~ ../ext/Devel-Peek/t/Peek.t .................................. FAILED Non-zero exit status: 255 No plan found in TAP output
  [stdio] -Dcc=g++ -Duse64bitall
  [stdio] -Dcc=g++ -Duselongdouble DEBUGGING
  [stdio] -Dcc=g++ DEBUGGING
  [stdio] -Dcc=g++
  [stdio] -Dcc=g++ -Duselongdouble
  [stdio] -Dcc=g++ -Duse64bitall DEBUGGING
~~ ../t/re/reg_fold.t .......................................... FAILED Non-zero exit status: 2 No plan found in TAP output
  [stdio] -Dcc=g++ -Duse64bitall
  [stdio] -Dcc=g++ -Duselongdouble DEBUGGING
  [stdio] -Dcc=g++ DEBUGGING
  [stdio] -Dcc=g++
  [stdio] -Dcc=g++ -Duselongdouble
  [stdio] -Dcc=g++ -Duse64bitall DEBUGGING
~~ ../lib/utf8.t ............................................... FAILED Non-zero exit status: 2 No plan found in TAP output
  [stdio] -Dcc=g++ -Duse64bitall
  [stdio] -Dcc=g++ -Duselongdouble DEBUGGING
  [stdio] -Dcc=g++ DEBUGGING
  [stdio] -Dcc=g++
  [stdio] -Dcc=g++ -Duselongdouble
  [stdio] -Dcc=g++ -Duse64bitall DEBUGGING
~~ ../t/io/argv.t .............................................. FAILED Non-zero exit status: 2 No plan found in TAP output
  [stdio] -Dcc=g++ -Duse64bitall
  [stdio] -Dcc=g++ -Duselongdouble DEBUGGING
  [stdio] -Dcc=g++ DEBUGGING
  [stdio] -Dcc=g++
  [stdio] -Dcc=g++ -Duselongdouble
  [stdio] -Dcc=g++ -Duse64bitall DEBUGGING
~~ ../cpan/version/t/03require.t ............................... FAILED Non-zero exit status: 255
  [stdio] -Dcc=g++ -Duse64bitall
  [stdio] -Dcc=g++ -Duselongdouble DEBUGGING
  [stdio] -Dcc=g++ DEBUGGING
  [stdio] -Dcc=g++
  [stdio] -Dcc=g++ -Duselongdouble
  [stdio] -Dcc=g++ -Duse64bitall DEBUGGING
~~ ../t/io/paragraph_mode.t .................................... FAILED Non-zero exit status: 2 No plan found in TAP output
  [stdio] -Dcc=g++ -Duse64bitall
  [stdio] -Dcc=g++ -Duselongdouble DEBUGGING
  [stdio] -Dcc=g++ DEBUGGING
  [stdio] -Dcc=g++
  [stdio] -Dcc=g++ -Duselongdouble
  [stdio] -Dcc=g++ -Duse64bitall DEBUGGING
~~ ../cpan/Text-Balanced/t/05_extmul.t ......................... FAILED Non-zero exit status: 255 Bad plan.  You planned 86 tests but ran 0.
  [stdio] -Dcc=g++ -Duse64bitall
  [stdio] -Dcc=g++ -Duselongdouble DEBUGGING
  [stdio] -Dcc=g++ DEBUGGING
  [stdio] -Dcc=g++
  [stdio] -Dcc=g++ -Duselongdouble
  [stdio] -Dcc=g++ -Duse64bitall DEBUGGING
~~ ../t/run/switch0.t .......................................... FAILED Non-zero exit status: 2 No plan found in TAP output
  [stdio] -Dcc=g++ -Duse64bitall
  [stdio] -Dcc=g++ -Duselongdouble DEBUGGING
  [stdio] -Dcc=g++ DEBUGGING
  [stdio] -Dcc=g++
  [stdio] -Dcc=g++ -Duselongdouble
  [stdio] -Dcc=g++ -Duse64bitall DEBUGGING
~~ ../cpan/Test-Simple/t/Test2/modules/IPC/Driver/Files.t ...... FAILED Non-zero exit status: 255 No plan found in TAP output
  [stdio] -Dcc=g++ -Duse64bitall
  [stdio] -Dcc=g++ -Duselongdouble DEBUGGING
  [stdio] -Dcc=g++ DEBUGGING
  [stdio] -Dcc=g++
  [stdio] -Dcc=g++ -Duselongdouble
  [stdio] -Dcc=g++ -Duse64bitall DEBUGGING
~~ ../lib/bytes.t .............................................. FAILED Non-zero exit status: 2 No plan found in TAP output
  [stdio] -Dcc=g++ -Duse64bitall
  [stdio] -Dcc=g++ -Duselongdouble DEBUGGING
  [stdio] -Dcc=g++ DEBUGGING
  [stdio] -Dcc=g++
  [stdio] -Dcc=g++ -Duselongdouble
  [stdio] -Dcc=g++ -Duse64bitall DEBUGGING
~~ ../t/porting/globvar.t ...................................... FAILED Non-zero exit status: 2 No plan found in TAP output
  [stdio] -Dcc=g++ -Duse64bitall
  [stdio] -Dcc=g++ -Duselongdouble DEBUGGING
  [stdio] -Dcc=g++ DEBUGGING
  [stdio] -Dcc=g++
  [stdio] -Dcc=g++ -Duselongdouble
  [stdio] -Dcc=g++ -Duse64bitall DEBUGGING
~~ ../lib/deprecate.t .......................................... FAILED Non-zero exit status: 2 No plan found in TAP output
  [stdio] -Dcc=g++ -Duse64bitall
  [stdio] -Dcc=g++ -Duselongdouble DEBUGGING
  [stdio] -Dcc=g++ DEBUGGING
  [stdio] -Dcc=g++
  [stdio] -Dcc=g++ -Duselongdouble
  [stdio] -Dcc=g++ -Duse64bitall DEBUGGING
~~ ../t/op/each.t .............................................. FAILED Non-zero exit status: 2 No plan found in TAP output
  [stdio] -Dcc=g++ -Duse64bitall
  [stdio] -Dcc=g++ -Duselongdouble DEBUGGING
  [stdio] -Dcc=g++ DEBUGGING
  [stdio] -Dcc=g++
  [stdio] -Dcc=g++ -Duselongdouble
  [stdio] -Dcc=g++ -Duse64bitall DEBUGGING
~~ ../cpan/Compress-Raw-Zlib/t/02zlib.t ........................ FAILED Non-zero exit status: 255 No plan found in TAP output
  [stdio] -Dcc=g++ -Duse64bitall
  [stdio] -Dcc=g++ -Duselongdouble DEBUGGING
  [stdio] -Dcc=g++ DEBUGGING
  [stdio] -Dcc=g++
  [stdio] -Dcc=g++ -Duselongdouble
  [stdio] -Dcc=g++ -Duse64bitall DEBUGGING
~~ ../t/op/caller.t ............................................ FAILED Non-zero exit status: 2 No plan found in TAP output
  [stdio] -Dcc=g++ -Duse64bitall
  [stdio] -Dcc=g++ -Duselongdouble DEBUGGING
  [stdio] -Dcc=g++ DEBUGGING
  [stdio] -Dcc=g++
  [stdio] -Dcc=g++ -Duselongdouble
  [stdio] -Dcc=g++ -Duse64bitall DEBUGGING
~~ ../dist/threads/t/libc.t .................................... FAILED Non-zero exit status: 2 No plan found in TAP output
  [stdio] -Dcc=g++ -Duse64bitall
  [stdio] -Dcc=g++ -Duselongdouble DEBUGGING
  [stdio] -Dcc=g++ DEBUGGING
  [stdio] -Dcc=g++
  [stdio] -Dcc=g++ -Duselongdouble
  [stdio] -Dcc=g++ -Duse64bitall DEBUGGING
~~ ../t/op/crypt.t ............................................. FAILED Non-zero exit status: 2 No plan found in TAP output
  [stdio] -Dcc=g++ -Duse64bitall
  [stdio] -Dcc=g++ -Duselongdouble DEBUGGING
  [stdio] -Dcc=g++ DEBUGGING
  [stdio] -Dcc=g++
  [stdio] -Dcc=g++ -Duselongdouble
  [stdio] -Dcc=g++ -Duse64bitall DEBUGGING
~~ ../t/porting/bench.t ........................................ FAILED Non-zero exit status: 2 No plan found in TAP output
  [stdio] -Dcc=g++ -Duse64bitall
  [stdio] -Dcc=g++ -Duselongdouble DEBUGGING
  [stdio] -Dcc=g++ DEBUGGING
  [stdio] -Dcc=g++
  [stdio] -Dcc=g++ -Duselongdouble
  [stdio] -Dcc=g++ -Duse64bitall DEBUGGING
~~ ../t/porting/libperl.t ...................................... FAILED Non-zero exit status: 2 No plan found in TAP output
  [stdio] -Dcc=g++ -Duse64bitall
  [stdio] -Dcc=g++ -Duselongdouble DEBUGGING
  [stdio] -Dcc=g++ DEBUGGING
  [stdio] -Dcc=g++
  [stdio] -Dcc=g++ -Duselongdouble
  [stdio] -Dcc=g++ -Duse64bitall DEBUGGING
~~ ../t/op/runlevel.t .......................................... FAILED Non-zero exit status: 2 No plan found in TAP output
  [stdio] -Dcc=g++ -Duse64bitall
  [stdio] -Dcc=g++ -Duselongdouble DEBUGGING
  [stdio] -Dcc=g++ DEBUGGING
  [stdio] -Dcc=g++
  [stdio] -Dcc=g++ -Duselongdouble
  [stdio] -Dcc=g++ -Duse64bitall DEBUGGING
~~ ../t/re/charset.t ........................................... FAILED Non-zero exit status: 2 No plan found in TAP output
  [stdio] -Dcc=g++ -Duse64bitall
  [stdio] -Dcc=g++ -Duselongdouble DEBUGGING
  [stdio] -Dcc=g++ DEBUGGING
  [stdio] -Dcc=g++
  [stdio] -Dcc=g++ -Duselongdouble
  [stdio] -Dcc=g++ -Duse64bitall DEBUGGING
~~ ../t/op/repeat.t ............................................ FAILED Non-zero exit status: 2 No plan found in TAP output
  [stdio] -Dcc=g++ -Duse64bitall
  [stdio] -Dcc=g++ -Duselongdouble DEBUGGING
  [stdio] -Dcc=g++ DEBUGGING
  [stdio] -Dcc=g++
  [stdio] -Dcc=g++ -Duselongdouble
  [stdio] -Dcc=g++ -Duse64bitall DEBUGGING
~~ ../cpan/NEXT/t/next.t ....................................... FAILED Bad plan.  You planned 27 tests but ran 26.
  [stdio] -Dcc=g++ -Duse64bitall
  [stdio] -Dcc=g++ -Duselongdouble DEBUGGING
  [stdio] -Dcc=g++ DEBUGGING
  [stdio] -Dcc=g++
  [stdio] -Dcc=g++ -Duselongdouble
  [stdio] -Dcc=g++ -Duse64bitall DEBUGGING
~~ ../t/mro/overload_dfs.t ..................................... FAILED Non-zero exit status: 2 No plan found in TAP output
  [stdio] -Dcc=g++ -Duse64bitall
  [stdio] -Dcc=g++ -Duselongdouble DEBUGGING
  [stdio] -Dcc=g++ DEBUGGING
  [stdio] -Dcc=g++
  [stdio] -Dcc=g++ -Duselongdouble
  [stdio] -Dcc=g++ -Duse64bitall DEBUGGING
~~ ../t/op/upgrade.t ........................................... FAILED Non-zero exit status: 2 No plan found in TAP output
  [stdio] -Dcc=g++ -Duse64bitall
  [stdio] -Dcc=g++ -Duselongdouble DEBUGGING
  [stdio] -Dcc=g++ DEBUGGING
  [stdio] -Dcc=g++
  [stdio] -Dcc=g++ -Duselongdouble
  [stdio] -Dcc=g++ -Duse64bitall DEBUGGING
~~ ../t/op/hash-rt85026.t ...................................... FAILED Non-zero exit status: 2 No plan found in TAP output
  [stdio] -Dcc=g++ -Duse64bitall
  [stdio] -Dcc=g++ -Duselongdouble DEBUGGING
  [stdio] -Dcc=g++ DEBUGGING
  [stdio] -Dcc=g++
  [stdio] -Dcc=g++ -Duselongdouble
  [stdio] -Dcc=g++ -Duse64bitall DEBUGGING
~~ ../cpan/Scalar-List-Utils/t/dualvar.t ....................... FAILED Non-zero exit status: 255 Bad plan.  You planned 41 tests but ran 0.
  [stdio] -Dcc=g++ -Duse64bitall
  [stdio] -Dcc=g++ -Duselongdouble DEBUGGING
  [stdio] -Dcc=g++ DEBUGGING
  [stdio] -Dcc=g++
  [stdio] -Dcc=g++ -Duselongdouble
  [stdio] -Dcc=g++ -Duse64bitall DEBUGGING
~~ ../t/op/signatures.t ........................................ FAILED Non-zero exit status: 2 No plan found in TAP output
  [stdio] -Dcc=g++ -Duse64bitall
  [stdio] -Dcc=g++ -Duselongdouble DEBUGGING
  [stdio] -Dcc=g++ DEBUGGING
  [stdio] -Dcc=g++
  [stdio] -Dcc=g++ -Duselongdouble
  [stdio] -Dcc=g++ -Duse64bitall DEBUGGING
~~ ../t/op/do.t ................................................ FAILED Non-zero exit status: 2 No plan found in TAP output
  [stdio] -Dcc=g++ -Duse64bitall
  [stdio] -Dcc=g++ -Duselongdouble DEBUGGING
  [stdio] -Dcc=g++ DEBUGGING
  [stdio] -Dcc=g++
  [stdio] -Dcc=g++ -Duselongdouble
  [stdio] -Dcc=g++ -Duse64bitall DEBUGGING
~~ ../t/re/reg_60508.t ......................................... FAILED Non-zero exit status: 2 No plan found in TAP output
  [stdio] -Dcc=g++ -Duse64bitall
  [stdio] -Dcc=g++ -Duselongdouble DEBUGGING
  [stdio] -Dcc=g++ DEBUGGING
  [stdio] -Dcc=g++
  [stdio] -Dcc=g++ -Duselongdouble
  [stdio] -Dcc=g++ -Duse64bitall DEBUGGING
~~ ../t/uni/attrs.t ............................................ FAILED Non-zero exit status: 2 No plan found in TAP output
  [stdio] -Dcc=g++ -Duse64bitall
  [stdio] -Dcc=g++ -Duselongdouble DEBUGGING
  [stdio] -Dcc=g++ DEBUGGING
  [stdio] -Dcc=g++
  [stdio] -Dcc=g++ -Duselongdouble
  [stdio] -Dcc=g++ -Duse64bitall DEBUGGING
~~ ../t/porting/test_bootstrap.t ............................... FAILED Non-zero exit status: 2 No plan found in TAP output
  [stdio] -Dcc=g++ -Duse64bitall
  [stdio] -Dcc=g++ -Duselongdouble DEBUGGING
  [stdio] -Dcc=g++ DEBUGGING
  [stdio] -Dcc=g++
  [stdio] -Dcc=g++ -Duselongdouble
  [stdio] -Dcc=g++ -Duse64bitall DEBUGGING
~~ ../t/op/grep.t .............................................. FAILED Non-zero exit status: 2 No plan found in TAP output
  [stdio] -Dcc=g++ -Duse64bitall
  [stdio] -Dcc=g++ -Duselongdouble DEBUGGING
  [stdio] -Dcc=g++ DEBUGGING
  [stdio] -Dcc=g++
  [stdio] -Dcc=g++ -Duselongdouble
  [stdio] -Dcc=g++ -Duse64bitall DEBUGGING
~~ ../t/op/die_unwind.t ........................................ FAILED Non-zero exit status: 2 No plan found in TAP output
  [stdio] -Dcc=g++ -Duse64bitall
  [stdio] -Dcc=g++ -Duselongdouble DEBUGGING
  [stdio] -Dcc=g++ DEBUGGING
  [stdio] -Dcc=g++
  [stdio] -Dcc=g++ -Duselongdouble
  [stdio] -Dcc=g++ -Duse64bitall DEBUGGING
~~ ../t/op/chars.t ............................................. FAILED Non-zero exit status: 2 No plan found in TAP output
  [stdio] -Dcc=g++ -Duse64bitall
  [stdio] -Dcc=g++ -Duselongdouble DEBUGGING
  [stdio] -Dcc=g++ DEBUGGING
  [stdio] -Dcc=g++
  [stdio] -Dcc=g++ -Duselongdouble
  [stdio] -Dcc=g++ -Duse64bitall DEBUGGING
~~ ../t/op/utfhash.t ........................................... FAILED Non-zero exit status: 2 No plan found in TAP output
  [stdio] -Dcc=g++ -Duse64bitall
  [stdio] -Dcc=g++ -Duselongdouble DEBUGGING
  [stdio] -Dcc=g++ DEBUGGING
  [stdio] -Dcc=g++
  [stdio] -Dcc=g++ -Duselongdouble
  [stdio] -Dcc=g++ -Duse64bitall DEBUGGING
~~ ../t/op/my.t ................................................ FAILED Non-zero exit status: 2 No plan found in TAP output
  [stdio] -Dcc=g++ -Duse64bitall
  [stdio] -Dcc=g++ -Duselongdouble DEBUGGING
  [stdio] -Dcc=g++ DEBUGGING
  [stdio] -Dcc=g++
  [stdio] -Dcc=g++ -Duselongdouble
  [stdio] -Dcc=g++ -Duse64bitall DEBUGGING
~~ ../t/uni/chomp.t ............................................ FAILED Non-zero exit status: 2 No plan found in TAP output
  [stdio] -Dcc=g++ -Duse64bitall
  [stdio] -Dcc=g++ -Duselongdouble DEBUGGING
  [stdio] -Dcc=g++ DEBUGGING
  [stdio] -Dcc=g++
  [stdio] -Dcc=g++ -Duselongdouble
  [stdio] -Dcc=g++ -Duse64bitall DEBUGGING
~~ ../t/mro/isa_c3_utf8.t ...................................... FAILED Non-zero exit status: 2 No plan found in TAP output
  [stdio] -Dcc=g++ -Duse64bitall
  [stdio] -Dcc=g++ -Duselongdouble DEBUGGING
  [stdio] -Dcc=g++ DEBUGGING
  [stdio] -Dcc=g++
  [stdio] -Dcc=g++ -Duselongdouble
  [stdio] -Dcc=g++ -Duse64bitall DEBUGGING
~~ ../t/io/iofile.t ............................................ FAILED Non-zero exit status: 2 No plan found in TAP output
  [stdio] -Dcc=g++ -Duse64bitall
  [stdio] -Dcc=g++ -Duselongdouble DEBUGGING
  [stdio] -Dcc=g++ DEBUGGING
  [stdio] -Dcc=g++
  [stdio] -Dcc=g++ -Duselongdouble
  [stdio] -Dcc=g++ -Duse64bitall DEBUGGING
~~ ../t/re/reg_mesg.t .......................................... FAILED Non-zero exit status: 2 No plan found in TAP output
  [stdio] -Dcc=g++ -Duse64bitall
  [stdio] -Dcc=g++ -Duselongdouble DEBUGGING
  [stdio] -Dcc=g++ DEBUGGING
  [stdio] -Dcc=g++
  [stdio] -Dcc=g++ -Duselongdouble
  [stdio] -Dcc=g++ -Duse64bitall DEBUGGING
~~ ../t/uni/write.t ............................................ FAILED Non-zero exit status: 2 No plan found in TAP output
  [stdio] -Dcc=g++ -Duse64bitall
  [stdio] -Dcc=g++ -Duselongdouble DEBUGGING
  [stdio] -Dcc=g++ DEBUGGING
  [stdio] -Dcc=g++
  [stdio] -Dcc=g++ -Duselongdouble
  [stdio] -Dcc=g++ -Duse64bitall DEBUGGING
~~ ../cpan/version/t/07locale.t ................................ FAILED Non-zero exit status: 255 Bad plan.  You planned 8 tests but ran 1.
  [stdio] -Dcc=g++ -Duse64bitall
  [stdio] -Dcc=g++ -Duselongdouble DEBUGGING
  [stdio] -Dcc=g++ DEBUGGING
  [stdio] -Dcc=g++
  [stdio] -Dcc=g++ -Duselongdouble
  [stdio] -Dcc=g++ -Duse64bitall DEBUGGING
~~ ../t/op/cond.t .............................................. FAILED Non-zero exit status: 2 No plan found in TAP output
  [stdio] -Dcc=g++ -Duse64bitall
  [stdio] -Dcc=g++ -Duselongdouble DEBUGGING
  [stdio] -Dcc=g++ DEBUGGING
  [stdio] -Dcc=g++
  [stdio] -Dcc=g++ -Duselongdouble
  [stdio] -Dcc=g++ -Duse64bitall DEBUGGING
~~ ../ext/B/t/optree_concise.t ................................. FAILED Non-zero exit status: 255 No plan found in TAP output
  [stdio] -Dcc=g++ -Duse64bitall
  [stdio] -Dcc=g++ -Duselongdouble DEBUGGING
  [stdio] -Dcc=g++ DEBUGGING
  [stdio] -Dcc=g++
  [stdio] -Dcc=g++ -Duselongdouble
  [stdio] -Dcc=g++ -Duse64bitall DEBUGGING
~~ ../t/op/lvref.t ............................................. FAILED Non-zero exit status: 2 No plan found in TAP output
  [stdio] -Dcc=g++ -Duse64bitall
  [stdio] -Dcc=g++ -Duselongdouble DEBUGGING
  [stdio] -Dcc=g++ DEBUGGING
  [stdio] -Dcc=g++
  [stdio] -Dcc=g++ -Duselongdouble
  [stdio] -Dcc=g++ -Duse64bitall DEBUGGING
~~ ../t/op/sprintf.t ........................................... FAILED Non-zero exit status: 2 No plan found in TAP output
  [stdio] -Dcc=g++ -Duse64bitall
  [stdio] -Dcc=g++ -Duselongdouble DEBUGGING
  [stdio] -Dcc=g++ DEBUGGING
  [stdio] -Dcc=g++
  [stdio] -Dcc=g++ -Duselongdouble
  [stdio] -Dcc=g++ -Duse64bitall DEBUGGING
~~ ../t/op/ord.t ............................................... FAILED Non-zero exit status: 2 No plan found in TAP output
  [stdio] -Dcc=g++ -Duse64bitall
  [stdio] -Dcc=g++ -Duselongdouble DEBUGGING
  [stdio] -Dcc=g++ DEBUGGING
  [stdio] -Dcc=g++
  [stdio] -Dcc=g++ -Duselongdouble
  [stdio] -Dcc=g++ -Duse64bitall DEBUGGING
~~ ../ext/XS-APItest/t/keyword_plugin_threads.t ................ FAILED Non-zero exit status: 2 No plan found in TAP output
  [stdio] -Dcc=g++ -Duse64bitall
  [stdio] -Dcc=g++ -Duselongdouble DEBUGGING
  [stdio] -Dcc=g++ DEBUGGING
  [stdio] -Dcc=g++
  [stdio] -Dcc=g++ -Duselongdouble
  [stdio] -Dcc=g++ -Duse64bitall DEBUGGING
~~ ../cpan/ExtUtils-MakeMaker/t/eu_command.t ................... FAILED Non-zero exit status: 255 No plan found in TAP output
  [stdio] -Dcc=g++ -Duse64bitall
  [stdio] -Dcc=g++ -Duselongdouble DEBUGGING
  [stdio] -Dcc=g++ DEBUGGING
  [stdio] -Dcc=g++
  [stdio] -Dcc=g++ -Duselongdouble
  [stdio] -Dcc=g++ -Duse64bitall DEBUGGING
~~ ../t/op/dor.t ............................................... FAILED Non-zero exit status: 2 No plan found in TAP output
  [stdio] -Dcc=g++ -Duse64bitall
  [stdio] -Dcc=g++ -Duselongdouble DEBUGGING
  [stdio] -Dcc=g++ DEBUGGING
  [stdio] -Dcc=g++
  [stdio] -Dcc=g++ -Duselongdouble
  [stdio] -Dcc=g++ -Duse64bitall DEBUGGING
~~ ../t/io/open.t .............................................. FAILED Non-zero exit status: 2 No plan found in TAP output
  [stdio] -Dcc=g++ -Duse64bitall
  [stdio] -Dcc=g++ -Duselongdouble DEBUGGING
  [stdio] -Dcc=g++ DEBUGGING
  [stdio] -Dcc=g++
  [stdio] -Dcc=g++ -Duselongdouble
  [stdio] -Dcc=g++ -Duse64bitall DEBUGGING
~~ ../t/op/srand.t ............................................. FAILED Non-zero exit status: 2 No plan found in TAP output
  [stdio] -Dcc=g++ -Duse64bitall
  [stdio] -Dcc=g++ -Duselongdouble DEBUGGING
  [stdio] -Dcc=g++ DEBUGGING
  [stdio] -Dcc=g++
  [stdio] -Dcc=g++ -Duselongdouble
  [stdio] -Dcc=g++ -Duse64bitall DEBUGGING
~~ ../dist/Storable/t/weak.t ................................... FAILED No plan found in TAP output
  [stdio] -Dcc=g++ -Duselongdouble DEBUGGING
  [stdio] -Dcc=g++ DEBUGGING
  [stdio] -Dcc=g++ -Duse64bitall DEBUGGING
~~ ../t/op/defins.t ............................................ FAILED Non-zero exit status: 2 No plan found in TAP output
  [stdio] -Dcc=g++ -Duse64bitall
  [stdio] -Dcc=g++ -Duselongdouble DEBUGGING
  [stdio] -Dcc=g++ DEBUGGING
  [stdio] -Dcc=g++
  [stdio] -Dcc=g++ -Duselongdouble
  [stdio] -Dcc=g++ -Duse64bitall DEBUGGING
~~ ../cpan/Text-Balanced/t/03_extcbk.t ......................... FAILED Non-zero exit status: 255 Bad plan.  You planned 41 tests but ran 0.
  [stdio] -Dcc=g++ -Duse64bitall
  [stdio] -Dcc=g++ -Duselongdouble DEBUGGING
  [stdio] -Dcc=g++ DEBUGGING
  [stdio] -Dcc=g++
  [stdio] -Dcc=g++ -Duselongdouble
  [stdio] -Dcc=g++ -Duse64bitall DEBUGGING
~~ ../t/op/ref.t ............................................... FAILED Non-zero exit status: 2 No plan found in TAP output
  [stdio] -Dcc=g++ -Duse64bitall
  [stdio] -Dcc=g++ -Duselongdouble DEBUGGING
  [stdio] -Dcc=g++ DEBUGGING
  [stdio] -Dcc=g++
  [stdio] -Dcc=g++ -Duselongdouble
  [stdio] -Dcc=g++ -Duse64bitall DEBUGGING
~~ ../t/op/kvaslice.t .......................................... FAILED Non-zero exit status: 2 No plan found in TAP output
  [stdio] -Dcc=g++ -Duse64bitall
  [stdio] -Dcc=g++ -Duselongdouble DEBUGGING
  [stdio] -Dcc=g++ DEBUGGING
  [stdio] -Dcc=g++
  [stdio] -Dcc=g++ -Duselongdouble
  [stdio] -Dcc=g++ -Duse64bitall DEBUGGING
~~ ../cpan/Test-Simple/t/Test2/acceptance/try_it_threads.t ..... FAILED Non-zero exit status: 255 No plan found in TAP output
  [stdio] -Dcc=g++ -Duse64bitall
  [stdio] -Dcc=g++ -Duselongdouble DEBUGGING
  [stdio] -Dcc=g++ DEBUGGING
  [stdio] -Dcc=g++
  [stdio] -Dcc=g++ -Duselongdouble
  [stdio] -Dcc=g++ -Duse64bitall DEBUGGING
~~ ../t/re/fold_grind_8.t ...................................... FAILED Non-zero exit status: 2 No plan found in TAP output
  [stdio] -Dcc=g++ -Duse64bitall
  [stdio] -Dcc=g++ -Duselongdouble DEBUGGING
  [stdio] -Dcc=g++ DEBUGGING
  [stdio] -Dcc=g++
  [stdio] -Dcc=g++ -Duselongdouble
  [stdio] -Dcc=g++ -Duse64bitall DEBUGGING
~~ ../t/op/recurse.t ........................................... FAILED Non-zero exit status: 2 No plan found in TAP output
  [stdio] -Dcc=g++ -Duse64bitall
  [stdio] -Dcc=g++ -Duselongdouble DEBUGGING
  [stdio] -Dcc=g++ DEBUGGING
  [stdio] -Dcc=g++
  [stdio] -Dcc=g++ -Duselongdouble
  [stdio] -Dcc=g++ -Duse64bitall DEBUGGING
~~ ../dist/threads/t/kill2.t ................................... FAILED Non-zero exit status: 2 No plan found in TAP output
  [stdio] -Dcc=g++ -Duse64bitall
  [stdio] -Dcc=g++ -Duselongdouble DEBUGGING
  [stdio] -Dcc=g++ DEBUGGING
  [stdio] -Dcc=g++
  [stdio] -Dcc=g++ -Duselongdouble
  [stdio] -Dcc=g++ -Duse64bitall DEBUGGING
~~ ../cpan/ExtUtils-MakeMaker/t/02-xsdynamic.t ................. FAILED 5 71 Non-zero exit status: 12
  [stdio] -Dcc=g++ -Duselongdouble DEBUGGING
  [stdio] -Dcc=g++ -Duselongdouble
~~ ../t/re/fold_grind_aa.t ..................................... FAILED Non-zero exit status: 2 No plan found in TAP output
  [stdio] -Dcc=g++ -Duse64bitall
  [stdio] -Dcc=g++ -Duselongdouble DEBUGGING
  [stdio] -Dcc=g++ DEBUGGING
  [stdio] -Dcc=g++
  [stdio] -Dcc=g++ -Duselongdouble
  [stdio] -Dcc=g++ -Duse64bitall DEBUGGING
~~ ../t/op/reset.t ............................................. FAILED Non-zero exit status: 2 No plan found in TAP output
  [stdio] -Dcc=g++ -Duse64bitall
  [stdio] -Dcc=g++ -Duselongdouble DEBUGGING
  [stdio] -Dcc=g++ DEBUGGING
  [stdio] -Dcc=g++
  [stdio] -Dcc=g++ -Duselongdouble
  [stdio] -Dcc=g++ -Duse64bitall DEBUGGING
~~ ../t/op/gmagic.t ............................................ FAILED Non-zero exit status: 2 No plan found in TAP output
  [stdio] -Dcc=g++ -Duse64bitall
  [stdio] -Dcc=g++ -Duselongdouble DEBUGGING
  [stdio] -Dcc=g++ DEBUGGING
  [stdio] -Dcc=g++
  [stdio] -Dcc=g++ -Duselongdouble
  [stdio] -Dcc=g++ -Duse64bitall DEBUGGING
~~ ../cpan/Test-Simple/t/regression/todo_and_facets.t .......... FAILED Non-zero exit status: 255 No plan found in TAP output
  [stdio] -Dcc=g++ -Duse64bitall
  [stdio] -Dcc=g++ -Duselongdouble DEBUGGING
  [stdio] -Dcc=g++ DEBUGGING
  [stdio] -Dcc=g++
  [stdio] -Dcc=g++ -Duselongdouble
  [stdio] -Dcc=g++ -Duse64bitall DEBUGGING
~~ ../t/op/waitpid.t ........................................... FAILED Non-zero exit status: 2 No plan found in TAP output
  [stdio] -Dcc=g++ -Duse64bitall
  [stdio] -Dcc=g++ -Duselongdouble DEBUGGING
  [stdio] -Dcc=g++ DEBUGGING
  [stdio] -Dcc=g++
  [stdio] -Dcc=g++ -Duselongdouble
  [stdio] -Dcc=g++ -Duse64bitall DEBUGGING
~~ ../t/op/study.t ............................................. FAILED Non-zero exit status: 2 No plan found in TAP output
  [stdio] -Dcc=g++ -Duse64bitall
  [stdio] -Dcc=g++ -Duselongdouble DEBUGGING
  [stdio] -Dcc=g++ DEBUGGING
  [stdio] -Dcc=g++
  [stdio] -Dcc=g++ -Duselongdouble
  [stdio] -Dcc=g++ -Duse64bitall DEBUGGING
~~ ../ext/re/t/regop.t ......................................... FAILED Non-zero exit status: 2 No plan found in TAP output
  [stdio] -Dcc=g++ -Duse64bitall
  [stdio] -Dcc=g++ -Duselongdouble DEBUGGING
  [stdio] -Dcc=g++ DEBUGGING
  [stdio] -Dcc=g++
  [stdio] -Dcc=g++ -Duselongdouble
  [stdio] -Dcc=g++ -Duse64bitall DEBUGGING
~~ ../t/porting/pod_rules.t .................................... FAILED Non-zero exit status: 2 No plan found in TAP output
  [stdio] -Dcc=g++ -Duse64bitall
  [stdio] -Dcc=g++ -Duselongdouble DEBUGGING
  [stdio] -Dcc=g++ DEBUGGING
  [stdio] -Dcc=g++
  [stdio] -Dcc=g++ -Duselongdouble
  [stdio] -Dcc=g++ -Duse64bitall DEBUGGING
~~ ../t/uni/overload.t ......................................... FAILED Non-zero exit status: 2 No plan found in TAP output
  [stdio] -Dcc=g++ -Duse64bitall
  [stdio] -Dcc=g++ -Duselongdouble DEBUGGING
  [stdio] -Dcc=g++ DEBUGGING
  [stdio] -Dcc=g++
  [stdio] -Dcc=g++ -Duselongdouble
  [stdio] -Dcc=g++ -Duse64bitall DEBUGGING
~~ ../t/op/exec.t .............................................. FAILED Non-zero exit status: 2 No plan found in TAP output
  [stdio] -Dcc=g++ -Duse64bitall
  [stdio] -Dcc=g++ -Duselongdouble DEBUGGING
  [stdio] -Dcc=g++ DEBUGGING
  [stdio] -Dcc=g++
  [stdio] -Dcc=g++ -Duselongdouble
  [stdio] -Dcc=g++ -Duse64bitall DEBUGGING
~~ ../t/re/subst.t ............................................. FAILED Non-zero exit status: 2 No plan found in TAP output
  [stdio] -Dcc=g++ -Duse64bitall
  [stdio] -Dcc=g++ -Duselongdouble DEBUGGING
  [stdio] -Dcc=g++ DEBUGGING
  [stdio] -Dcc=g++
  [stdio] -Dcc=g++ -Duselongdouble
  [stdio] -Dcc=g++ -Duse64bitall DEBUGGING
~~ ../t/re/fold_grind_a.t ...................................... FAILED Non-zero exit status: 2 No plan found in TAP output
  [stdio] -Dcc=g++ -Duse64bitall
  [stdio] -Dcc=g++ -Duselongdouble DEBUGGING
  [stdio] -Dcc=g++ DEBUGGING
  [stdio] -Dcc=g++
  [stdio] -Dcc=g++ -Duselongdouble
  [stdio] -Dcc=g++ -Duse64bitall DEBUGGING
~~ ../lib/overload_fallback.t .................................. FAILED Non-zero exit status: 2 No plan found in TAP output
  [stdio] -Dcc=g++ -Duse64bitall
  [stdio] -Dcc=g++ -Duselongdouble DEBUGGING
  [stdio] -Dcc=g++ DEBUGGING
  [stdio] -Dcc=g++
  [stdio] -Dcc=g++ -Duselongdouble
  [stdio] -Dcc=g++ -Duse64bitall DEBUGGING
~~ ../t/porting/exec-bit.t ..................................... FAILED Non-zero exit status: 2 No plan found in TAP output
  [stdio] -Dcc=g++ -Duse64bitall
  [stdio] -Dcc=g++ -Duselongdouble DEBUGGING
  [stdio] -Dcc=g++ DEBUGGING
  [stdio] -Dcc=g++
  [stdio] -Dcc=g++ -Duselongdouble
  [stdio] -Dcc=g++ -Duse64bitall DEBUGGING
~~ ../t/op/stat_errors.t ....................................... FAILED Non-zero exit status: 2 No plan found in TAP output
  [stdio] -Dcc=g++ -Duse64bitall
  [stdio] -Dcc=g++ -Duselongdouble DEBUGGING
  [stdio] -Dcc=g++ DEBUGGING
  [stdio] -Dcc=g++
  [stdio] -Dcc=g++ -Duselongdouble
  [stdio] -Dcc=g++ -Duse64bitall DEBUGGING
~~ ../t/op/svleak.t ............................................ FAILED Non-zero exit status: 2 No plan found in TAP output
  [stdio] -Dcc=g++ -Duse64bitall
  [stdio] -Dcc=g++ -Duselongdouble DEBUGGING
  [stdio] -Dcc=g++ DEBUGGING
  [stdio] -Dcc=g++
  [stdio] -Dcc=g++ -Duselongdouble
  [stdio] -Dcc=g++ -Duse64bitall DEBUGGING
~~ ../t/op/args.t .............................................. FAILED Non-zero exit status: 2 No plan found in TAP output
  [stdio] -Dcc=g++ -Duse64bitall
  [stdio] -Dcc=g++ -Duselongdouble DEBUGGING
  [stdio] -Dcc=g++ DEBUGGING
  [stdio] -Dcc=g++
  [stdio] -Dcc=g++ -Duselongdouble
  [stdio] -Dcc=g++ -Duse64bitall DEBUGGING
~~ ../t/run/switchM.t .......................................... FAILED Non-zero exit status: 2 No plan found in TAP output
  [stdio] -Dcc=g++ -Duse64bitall
  [stdio] -Dcc=g++ -Duselongdouble DEBUGGING
  [stdio] -Dcc=g++ DEBUGGING
  [stdio] -Dcc=g++
  [stdio] -Dcc=g++ -Duselongdouble
  [stdio] -Dcc=g++ -Duse64bitall DEBUGGING
~~ ../t/op/delete.t ............................................ FAILED Non-zero exit status: 2 No plan found in TAP output
  [stdio] -Dcc=g++ -Duse64bitall
  [stdio] -Dcc=g++ -Duselongdouble DEBUGGING
  [stdio] -Dcc=g++ DEBUGGING
  [stdio] -Dcc=g++
  [stdio] -Dcc=g++ -Duselongdouble
  [stdio] -Dcc=g++ -Duse64bitall DEBUGGING
~~ ../t/mro/isa_dfs_utf8.t ..................................... FAILED Non-zero exit status: 2 No plan found in TAP output
  [stdio] -Dcc=g++ -Duse64bitall
  [stdio] -Dcc=g++ -Duselongdouble DEBUGGING
  [stdio] -Dcc=g++ DEBUGGING
  [stdio] -Dcc=g++
  [stdio] -Dcc=g++ -Duselongdouble
  [stdio] -Dcc=g++ -Duse64bitall DEBUGGING
~~ ../ext/B/t/o.t .............................................. FAILED Non-zero exit status: 2 No plan found in TAP output
  [stdio] -Dcc=g++ -Duse64bitall
  [stdio] -Dcc=g++ -Duselongdouble DEBUGGING
  [stdio] -Dcc=g++ DEBUGGING
  [stdio] -Dcc=g++
  [stdio] -Dcc=g++ -Duselongdouble
  [stdio] -Dcc=g++ -Duse64bitall DEBUGGING
~~ ../cpan/Compress-Raw-Bzip2/t/09limitoutput.t ................ FAILED Non-zero exit status: 255 No plan found in TAP output
  [stdio] -Dcc=g++ -Duse64bitall
  [stdio] -Dcc=g++ -Duselongdouble DEBUGGING
  [stdio] -Dcc=g++ DEBUGGING
  [stdio] -Dcc=g++
  [stdio] -Dcc=g++ -Duselongdouble
  [stdio] -Dcc=g++ -Duse64bitall DEBUGGING
~~ ../t/run/runenv.t ........................................... FAILED Non-zero exit status: 2 No plan found in TAP output
  [stdio] -Dcc=g++ -Duse64bitall
  [stdio] -Dcc=g++ -Duselongdouble DEBUGGING
  [stdio] -Dcc=g++ DEBUGGING
  [stdio] -Dcc=g++
  [stdio] -Dcc=g++ -Duselongdouble
  [stdio] -Dcc=g++ -Duse64bitall DEBUGGING
~~ ../t/porting/bincompat.t .................................... FAILED Non-zero exit status: 2 No plan found in TAP output
  [stdio] -Dcc=g++ -Duse64bitall
  [stdio] -Dcc=g++ -Duselongdouble DEBUGGING
  [stdio] -Dcc=g++ DEBUGGING
  [stdio] -Dcc=g++
  [stdio] -Dcc=g++ -Duselongdouble
  [stdio] -Dcc=g++ -Duse64bitall DEBUGGING
~~ ../cpan/Test-Simple/t/Legacy/todo.t ......................... FAILED Non-zero exit status: 255 No plan found in TAP output
  [stdio] -Dcc=g++ -Duse64bitall
  [stdio] -Dcc=g++ -Duselongdouble DEBUGGING
  [stdio] -Dcc=g++ DEBUGGING
  [stdio] -Dcc=g++
  [stdio] -Dcc=g++ -Duselongdouble
  [stdio] -Dcc=g++ -Duse64bitall DEBUGGING
~~ ../ext/DynaLoader/t/DynaLoader.t ............................ FAILED Non-zero exit status: 2 No plan found in TAP output
  [stdio] -Dcc=g++ -Duse64bitall
  [stdio] -Dcc=g++ -Duselongdouble DEBUGGING
  [stdio] -Dcc=g++ DEBUGGING
  [stdio] -Dcc=g++
  [stdio] -Dcc=g++ -Duselongdouble
  [stdio] -Dcc=g++ -Duse64bitall DEBUGGING
~~ ../dist/threads/t/kill3.t ................................... FAILED Non-zero exit status: 2 No plan found in TAP output
  [stdio] -Dcc=g++ -Duse64bitall
  [stdio] -Dcc=g++ -Duselongdouble DEBUGGING
  [stdio] -Dcc=g++ DEBUGGING
  [stdio] -Dcc=g++
  [stdio] -Dcc=g++ -Duselongdouble
  [stdio] -Dcc=g++ -Duse64bitall DEBUGGING
~~ ../lib/B/Deparse-subclass.t ................................. FAILED Non-zero exit status: 255 Bad plan.  You planned 2 tests but ran 0.
  [stdio] -Dcc=g++ -Duse64bitall
  [stdio] -Dcc=g++ -Duselongdouble DEBUGGING
  [stdio] -Dcc=g++ DEBUGGING
  [stdio] -Dcc=g++
  [stdio] -Dcc=g++ -Duselongdouble
  [stdio] -Dcc=g++ -Duse64bitall DEBUGGING
~~ ../dist/threads/t/exit.t .................................... FAILED Non-zero exit status: 2 No plan found in TAP output
  [stdio] -Dcc=g++ -Duse64bitall
  [stdio] -Dcc=g++ -Duselongdouble DEBUGGING
  [stdio] -Dcc=g++ DEBUGGING
  [stdio] -Dcc=g++
  [stdio] -Dcc=g++ -Duselongdouble
  [stdio] -Dcc=g++ -Duse64bitall DEBUGGING
~~ ../cpan/Compress-Raw-Zlib/t/07bufsize.t ..................... FAILED Non-zero exit status: 255 No plan found in TAP output
  [stdio] -Dcc=g++ -Duse64bitall
  [stdio] -Dcc=g++ -Duselongdouble DEBUGGING
  [stdio] -Dcc=g++ DEBUGGING
  [stdio] -Dcc=g++
  [stdio] -Dcc=g++ -Duselongdouble
  [stdio] -Dcc=g++ -Duse64bitall DEBUGGING
~~ ../t/uni/tr_utf8.t .......................................... FAILED Non-zero exit status: 2 No plan found in TAP output
  [stdio] -Dcc=g++ -Duse64bitall
  [stdio] -Dcc=g++ -Duselongdouble DEBUGGING
  [stdio] -Dcc=g++ DEBUGGING
  [stdio] -Dcc=g++
  [stdio] -Dcc=g++ -Duselongdouble
  [stdio] -Dcc=g++ -Duse64bitall DEBUGGING
~~ ../cpan/IPC-SysV/t/msg.t .................................... FAILED Non-zero exit status: 255 No plan found in TAP output
  [stdio] -Dcc=g++ -Duse64bitall
  [stdio] -Dcc=g++ -Duselongdouble DEBUGGING
  [stdio] -Dcc=g++ DEBUGGING
  [stdio] -Dcc=g++
  [stdio] -Dcc=g++ -Duselongdouble
  [stdio] -Dcc=g++ -Duse64bitall DEBUGGING
~~ ../t/op/utf8decode.t ........................................ FAILED Non-zero exit status: 2 No plan found in TAP output
  [stdio] -Dcc=g++ -Duse64bitall
  [stdio] -Dcc=g++ -Duselongdouble DEBUGGING
  [stdio] -Dcc=g++ DEBUGGING
  [stdio] -Dcc=g++
  [stdio] -Dcc=g++ -Duselongdouble
  [stdio] -Dcc=g++ -Duse64bitall DEBUGGING
~~ ../cpan/Test-Simple/t/Legacy/fail-more.t .................... FAILED Non-zero exit status: 255 No plan found in TAP output
  [stdio] -Dcc=g++ -Duse64bitall
  [stdio] -Dcc=g++ -Duselongdouble DEBUGGING
  [stdio] -Dcc=g++ DEBUGGING
  [stdio] -Dcc=g++
  [stdio] -Dcc=g++ -Duselongdouble
  [stdio] -Dcc=g++ -Duse64bitall DEBUGGING
~~ ../t/uni/sprintf.t .......................................... FAILED Non-zero exit status: 2 No plan found in TAP output
  [stdio] -Dcc=g++ -Duse64bitall
  [stdio] -Dcc=g++ -Duselongdouble DEBUGGING
  [stdio] -Dcc=g++ DEBUGGING
  [stdio] -Dcc=g++
  [stdio] -Dcc=g++ -Duselongdouble
  [stdio] -Dcc=g++ -Duse64bitall DEBUGGING
~~ ../t/run/switcha.t .......................................... FAILED Non-zero exit status: 2 No plan found in TAP output
  [stdio] -Dcc=g++ -Duse64bitall
  [stdio] -Dcc=g++ -Duselongdouble DEBUGGING
  [stdio] -Dcc=g++ DEBUGGING
  [stdio] -Dcc=g++
  [stdio] -Dcc=g++ -Duselongdouble
  [stdio] -Dcc=g++ -Duse64bitall DEBUGGING
~~ ../t/porting/ss_dup.t ....................................... FAILED Non-zero exit status: 2 No plan found in TAP output
  [stdio] -Dcc=g++ -Duse64bitall
  [stdio] -Dcc=g++ -Duselongdouble DEBUGGING
  [stdio] -Dcc=g++ DEBUGGING
  [stdio] -Dcc=g++
  [stdio] -Dcc=g++ -Duselongdouble
  [stdio] -Dcc=g++ -Duse64bitall DEBUGGING
~~ ../t/mro/recursion_c3.t ..................................... FAILED Non-zero exit status: 2 No plan found in TAP output
  [stdio] -Dcc=g++ -Duse64bitall
  [stdio] -Dcc=g++ -Duselongdouble DEBUGGING
  [stdio] -Dcc=g++ DEBUGGING
  [stdio] -Dcc=g++
  [stdio] -Dcc=g++ -Duselongdouble
  [stdio] -Dcc=g++ -Duse64bitall DEBUGGING
~~ ../t/re/qr_gc.t ............................................. FAILED Non-zero exit status: 2 No plan found in TAP output
  [stdio] -Dcc=g++ -Duse64bitall
  [stdio] -Dcc=g++ -Duselongdouble DEBUGGING
  [stdio] -Dcc=g++ DEBUGGING
  [stdio] -Dcc=g++
  [stdio] -Dcc=g++ -Duselongdouble
  [stdio] -Dcc=g++ -Duse64bitall DEBUGGING
~~ ../t/uni/universal.t ........................................ FAILED Non-zero exit status: 2 No plan found in TAP output
  [stdio] -Dcc=g++ -Duse64bitall
  [stdio] -Dcc=g++ -Duselongdouble DEBUGGING
  [stdio] -Dcc=g++ DEBUGGING
  [stdio] -Dcc=g++
  [stdio] -Dcc=g++ -Duselongdouble
  [stdio] -Dcc=g++ -Duse64bitall DEBUGGING
~~ ../ext/XS-APItest/t/sym-hook.t .............................. FAILED Non-zero exit status: 255 Bad plan.  You planned 4 tests but ran 0.
  [stdio] -Dcc=g++ -Duse64bitall
  [stdio] -Dcc=g++ -Duselongdouble DEBUGGING
  [stdio] -Dcc=g++ DEBUGGING
  [stdio] -Dcc=g++
  [stdio] -Dcc=g++ -Duselongdouble
  [stdio] -Dcc=g++ -Duse64bitall DEBUGGING
~~ ../t/io/print.t ............................................. FAILED Non-zero exit status: 2 No plan found in TAP output
  [stdio] -Dcc=g++ -Duse64bitall
  [stdio] -Dcc=g++ -Duselongdouble DEBUGGING
  [stdio] -Dcc=g++ DEBUGGING
  [stdio] -Dcc=g++
  [stdio] -Dcc=g++ -Duselongdouble
  [stdio] -Dcc=g++ -Duse64bitall DEBUGGING
~~ ../t/op/attrs.t ............................................. FAILED Non-zero exit status: 2 No plan found in TAP output
  [stdio] -Dcc=g++ -Duse64bitall
  [stdio] -Dcc=g++ -Duselongdouble DEBUGGING
  [stdio] -Dcc=g++ DEBUGGING
  [stdio] -Dcc=g++
  [stdio] -Dcc=g++ -Duselongdouble
  [stdio] -Dcc=g++ -Duse64bitall DEBUGGING
~~ ../ext/XS-APItest/t/svpv_magic.t ............................ FAILED Non-zero exit status: 2 Bad plan.  You planned 10 tests but ran 1.
  [stdio] -Dcc=g++ -Duse64bitall
  [stdio] -Dcc=g++ -Duselongdouble DEBUGGING
  [stdio] -Dcc=g++ DEBUGGING
  [stdio] -Dcc=g++
  [stdio] -Dcc=g++ -Duselongdouble
  [stdio] -Dcc=g++ -Duse64bitall DEBUGGING
~~ ../cpan/Getopt-Long/t/gol-oo.t .............................. FAILED Non-zero exit status: 255 No plan found in TAP output
  [stdio] -Dcc=g++ -Duse64bitall
  [stdio] -Dcc=g++ -Duselongdouble DEBUGGING
  [stdio] -Dcc=g++ DEBUGGING
  [stdio] -Dcc=g++
  [stdio] -Dcc=g++ -Duselongdouble
  [stdio] -Dcc=g++ -Duse64bitall DEBUGGING
~~ ../cpan/Pod-Simple/t/verb_fmt.t ............................. FAILED Non-zero exit status: 255 Bad plan.  You planned 62 tests but ran 0.
  [stdio] -Dcc=g++ -Duse64bitall
  [stdio] -Dcc=g++ -Duselongdouble DEBUGGING
  [stdio] -Dcc=g++ DEBUGGING
  [stdio] -Dcc=g++
  [stdio] -Dcc=g++ -Duselongdouble
  [stdio] -Dcc=g++ -Duse64bitall DEBUGGING
~~ ../ext/FileCache/t/02maxopen.t .............................. FAILED Non-zero exit status: 25 Bad plan.  You planned 5 tests but ran 0.
  [stdio] -Dcc=g++ -Duse64bitall
  [stdio] -Dcc=g++ -Duselongdouble DEBUGGING
  [stdio] -Dcc=g++ DEBUGGING
  [stdio] -Dcc=g++
  [stdio] -Dcc=g++ -Duselongdouble
  [stdio] -Dcc=g++ -Duse64bitall DEBUGGING
~~ ../t/op/sub.t ............................................... FAILED Non-zero exit status: 2 No plan found in TAP output
  [stdio] -Dcc=g++ -Duse64bitall
  [stdio] -Dcc=g++ -Duselongdouble DEBUGGING
  [stdio] -Dcc=g++ DEBUGGING
  [stdio] -Dcc=g++
  [stdio] -Dcc=g++ -Duselongdouble
  [stdio] -Dcc=g++ -Duse64bitall DEBUGGING
~~ ../ext/Opcode/t/ops.t ....................................... FAILED Non-zero exit status: 255 No plan found in TAP output
  [stdio] -Dcc=g++ -Duse64bitall
  [stdio] -Dcc=g++ -Duselongdouble DEBUGGING
  [stdio] -Dcc=g++ DEBUGGING
  [stdio] -Dcc=g++
  [stdio] -Dcc=g++ -Duselongdouble
  [stdio] -Dcc=g++ -Duse64bitall DEBUGGING
~~ ../cpan/Test-Simple/t/Legacy/subtest/singleton.t ............ FAILED Non-zero exit status: 255 Bad plan.  You planned 3 tests but ran 0.
  [stdio] -Dcc=g++ -Duse64bitall
  [stdio] -Dcc=g++ -Duselongdouble DEBUGGING
  [stdio] -Dcc=g++ DEBUGGING
  [stdio] -Dcc=g++
  [stdio] -Dcc=g++ -Duselongdouble
  [stdio] -Dcc=g++ -Duse64bitall DEBUGGING
~~ ../t/re/keep_tabs.t ......................................... FAILED Non-zero exit status: 2 No plan found in TAP output
  [stdio] -Dcc=g++ -Duse64bitall
  [stdio] -Dcc=g++ -Duselongdouble DEBUGGING
  [stdio] -Dcc=g++ DEBUGGING
  [stdio] -Dcc=g++
  [stdio] -Dcc=g++ -Duselongdouble
  [stdio] -Dcc=g++ -Duse64bitall DEBUGGING
~~ ../t/porting/filenames.t .................................... FAILED Non-zero exit status: 2 No plan found in TAP output
  [stdio] -Dcc=g++ -Duse64bitall
  [stdio] -Dcc=g++ -Duselongdouble DEBUGGING
  [stdio] -Dcc=g++ DEBUGGING
  [stdio] -Dcc=g++
  [stdio] -Dcc=g++ -Duselongdouble
  [stdio] -Dcc=g++ -Duse64bitall DEBUGGING
~~ ../t/io/iprefix.t ........................................... FAILED Non-zero exit status: 2 No plan found in TAP output
  [stdio] -Dcc=g++ -Duse64bitall
  [stdio] -Dcc=g++ -Duselongdouble DEBUGGING
  [stdio] -Dcc=g++ DEBUGGING
  [stdio] -Dcc=g++
  [stdio] -Dcc=g++ -Duselongdouble
  [stdio] -Dcc=g++ -Duse64bitall DEBUGGING
~~ ../t/op/evalbytes.t ......................................... FAILED Non-zero exit status: 2 No plan found in TAP output
  [stdio] -Dcc=g++ -Duse64bitall
  [stdio] -Dcc=g++ -Duselongdouble DEBUGGING
  [stdio] -Dcc=g++ DEBUGGING
  [stdio] -Dcc=g++
  [stdio] -Dcc=g++ -Duselongdouble
  [stdio] -Dcc=g++ -Duse64bitall DEBUGGING
~~ ../t/mro/isarev.t ........................................... FAILED Non-zero exit status: 2 No plan found in TAP output
  [stdio] -Dcc=g++ -Duse64bitall
  [stdio] -Dcc=g++ -Duselongdouble DEBUGGING
  [stdio] -Dcc=g++ DEBUGGING
  [stdio] -Dcc=g++
  [stdio] -Dcc=g++ -Duselongdouble
  [stdio] -Dcc=g++ -Duse64bitall DEBUGGING
~~ ../t/op/ver.t ............................................... FAILED Non-zero exit status: 2 No plan found in TAP output
  [stdio] -Dcc=g++ -Duse64bitall
  [stdio] -Dcc=g++ -Duselongdouble DEBUGGING
  [stdio] -Dcc=g++ DEBUGGING
  [stdio] -Dcc=g++
  [stdio] -Dcc=g++ -Duselongdouble
  [stdio] -Dcc=g++ -Duse64bitall DEBUGGING
~~ ../t/re/no_utf8_pm.t ........................................ FAILED Non-zero exit status: 2 No plan found in TAP output
  [stdio] -Dcc=g++ -Duse64bitall
  [stdio] -Dcc=g++ -Duselongdouble DEBUGGING
  [stdio] -Dcc=g++ DEBUGGING
  [stdio] -Dcc=g++
  [stdio] -Dcc=g++ -Duselongdouble
  [stdio] -Dcc=g++ -Duse64bitall DEBUGGING
~~ ../cpan/Test-Simple/t/Test2/behavior/Taint.t ................ FAILED Non-zero exit status: 255 No plan found in TAP output
  [stdio] -Dcc=g++ -Duse64bitall
  [stdio] -Dcc=g++ -Duselongdouble DEBUGGING
  [stdio] -Dcc=g++ DEBUGGING
  [stdio] -Dcc=g++
  [stdio] -Dcc=g++ -Duselongdouble
  [stdio] -Dcc=g++ -Duse64bitall DEBUGGING
~~ ../t/porting/copyright.t .................................... FAILED Non-zero exit status: 2 No plan found in TAP output
  [stdio] -Dcc=g++ -Duse64bitall
  [stdio] -Dcc=g++ -Duselongdouble DEBUGGING
  [stdio] -Dcc=g++ DEBUGGING
  [stdio] -Dcc=g++
  [stdio] -Dcc=g++ -Duselongdouble
  [stdio] -Dcc=g++ -Duse64bitall DEBUGGING
~~ ../t/re/substT.t ............................................ FAILED No plan found in TAP output
  [stdio] -Dcc=g++ -Duse64bitall
  [stdio] -Dcc=g++ -Duselongdouble DEBUGGING
  [stdio] -Dcc=g++ DEBUGGING
  [stdio] -Dcc=g++
  [stdio] -Dcc=g++ -Duselongdouble
  [stdio] -Dcc=g++ -Duse64bitall DEBUGGING
~~ ../t/mro/inconsistent_c3.t .................................. FAILED Non-zero exit status: 2 No plan found in TAP output
  [stdio] -Dcc=g++ -Duse64bitall
  [stdio] -Dcc=g++ -Duselongdouble DEBUGGING
  [stdio] -Dcc=g++ DEBUGGING
  [stdio] -Dcc=g++
  [stdio] -Dcc=g++ -Duselongdouble
  [stdio] -Dcc=g++ -Duse64bitall DEBUGGING
~~ ../t/run/locale.t ........................................... FAILED Non-zero exit status: 2 No plan found in TAP output
  [stdio] -Dcc=g++ -Duse64bitall
  [stdio] -Dcc=g++ -Duselongdouble DEBUGGING
  [stdio] -Dcc=g++ DEBUGGING
  [stdio] -Dcc=g++
  [stdio] -Dcc=g++ -Duselongdouble
  [stdio] -Dcc=g++ -Duse64bitall DEBUGGING
~~ ../t/op/rt119311.t .......................................... FAILED Non-zero exit status: 2 No plan found in TAP output
  [stdio] -Dcc=g++ -Duse64bitall
  [stdio] -Dcc=g++ -Duselongdouble DEBUGGING
  [stdio] -Dcc=g++ DEBUGGING
  [stdio] -Dcc=g++
  [stdio] -Dcc=g++ -Duselongdouble
  [stdio] -Dcc=g++ -Duse64bitall DEBUGGING
~~ ../t/io/eintr.t ............................................. FAILED Non-zero exit status: 2 No plan found in TAP output
  [stdio] -Dcc=g++ -Duse64bitall
  [stdio] -Dcc=g++ -Duselongdouble DEBUGGING
  [stdio] -Dcc=g++ DEBUGGING
  [stdio] -Dcc=g++
  [stdio] -Dcc=g++ -Duselongdouble
  [stdio] -Dcc=g++ -Duse64bitall DEBUGGING
~~ ../t/op/protowarn.t ......................................... FAILED Non-zero exit status: 2 No plan found in TAP output
  [stdio] -Dcc=g++ -Duse64bitall
  [stdio] -Dcc=g++ -Duselongdouble DEBUGGING
  [stdio] -Dcc=g++ DEBUGGING
  [stdio] -Dcc=g++
  [stdio] -Dcc=g++ -Duselongdouble
  [stdio] -Dcc=g++ -Duse64bitall DEBUGGING
~~ ../t/op/pow.t ............................................... FAILED Non-zero exit status: 2 No plan found in TAP output
  [stdio] -Dcc=g++ -Duse64bitall
  [stdio] -Dcc=g++ -Duselongdouble DEBUGGING
  [stdio] -Dcc=g++ DEBUGGING
  [stdio] -Dcc=g++
  [stdio] -Dcc=g++ -Duselongdouble
  [stdio] -Dcc=g++ -Duse64bitall DEBUGGING
~~ ../lib/feature/unicode_strings.t ............................ FAILED Non-zero exit status: 2 No plan found in TAP output
  [stdio] -Dcc=g++ -Duse64bitall
  [stdio] -Dcc=g++ -Duselongdouble DEBUGGING
  [stdio] -Dcc=g++ DEBUGGING
  [stdio] -Dcc=g++
  [stdio] -Dcc=g++ -Duselongdouble
  [stdio] -Dcc=g++ -Duse64bitall DEBUGGING
~~ ../t/mro/isarev_utf8.t ...................................... FAILED Non-zero exit status: 2 No plan found in TAP output
  [stdio] -Dcc=g++ -Duse64bitall
  [stdio] -Dcc=g++ -Duselongdouble DEBUGGING
  [stdio] -Dcc=g++ DEBUGGING
  [stdio] -Dcc=g++
  [stdio] -Dcc=g++ -Duselongdouble
  [stdio] -Dcc=g++ -Duse64bitall DEBUGGING
~~ ../t/op/leaky-magic.t ....................................... FAILED Non-zero exit status: 2 No plan found in TAP output
  [stdio] -Dcc=g++ -Duse64bitall
  [stdio] -Dcc=g++ -Duselongdouble DEBUGGING
  [stdio] -Dcc=g++ DEBUGGING
  [stdio] -Dcc=g++
  [stdio] -Dcc=g++ -Duselongdouble
  [stdio] -Dcc=g++ -Duse64bitall DEBUGGING
~~ ../t/io/eintr_print.t ....................................... FAILED Non-zero exit status: 2 No plan found in TAP output
  [stdio] -Dcc=g++ -Duse64bitall
  [stdio] -Dcc=g++ -Duselongdouble DEBUGGING
  [stdio] -Dcc=g++ DEBUGGING
  [stdio] -Dcc=g++
  [stdio] -Dcc=g++ -Duselongdouble
  [stdio] -Dcc=g++ -Duse64bitall DEBUGGING
~~ ../t/re/fold_grind_d.t ...................................... FAILED Non-zero exit status: 2 No plan found in TAP output
  [stdio] -Dcc=g++ -Duse64bitall
  [stdio] -Dcc=g++ -Duselongdouble DEBUGGING
  [stdio] -Dcc=g++ DEBUGGING
  [stdio] -Dcc=g++
  [stdio] -Dcc=g++ -Duselongdouble
  [stdio] -Dcc=g++ -Duse64bitall DEBUGGING
~~ ../t/io/pipe.t .............................................. FAILED Non-zero exit status: 2 No plan found in TAP output
  [stdio] -Dcc=g++ -Duse64bitall
  [stdio] -Dcc=g++ -Duselongdouble DEBUGGING
  [stdio] -Dcc=g++ DEBUGGING
  [stdio] -Dcc=g++
  [stdio] -Dcc=g++ -Duselongdouble
  [stdio] -Dcc=g++ -Duse64bitall DEBUGGING
~~ ../ext/B/t/sv_stash.t ....................................... FAILED Non-zero exit status: 2 No plan found in TAP output
  [stdio] -Dcc=g++ -Duse64bitall
  [stdio] -Dcc=g++ -Duselongdouble DEBUGGING
  [stdio] -Dcc=g++ DEBUGGING
  [stdio] -Dcc=g++
  [stdio] -Dcc=g++ -Duselongdouble
  [stdio] -Dcc=g++ -Duse64bitall DEBUGGING
~~ ../t/uni/eval.t ............................................. FAILED Non-zero exit status: 2 No plan found in TAP output
  [stdio] -Dcc=g++ -Duse64bitall
  [stdio] -Dcc=g++ -Duselongdouble DEBUGGING
  [stdio] -Dcc=g++ DEBUGGING
  [stdio] -Dcc=g++
  [stdio] -Dcc=g++ -Duselongdouble
  [stdio] -Dcc=g++ -Duse64bitall DEBUGGING
~~ ../t/op/index.t ............................................. FAILED Non-zero exit status: 2 No plan found in TAP output
  [stdio] -Dcc=g++ -Duse64bitall
  [stdio] -Dcc=g++ -Duselongdouble DEBUGGING
  [stdio] -Dcc=g++ DEBUGGING
  [stdio] -Dcc=g++
  [stdio] -Dcc=g++ -Duselongdouble
  [stdio] -Dcc=g++ -Duse64bitall DEBUGGING
~~ ../t/op/die_keeperr.t ....................................... FAILED Non-zero exit status: 2 No plan found in TAP output
  [stdio] -Dcc=g++ -Duse64bitall
  [stdio] -Dcc=g++ -Duselongdouble DEBUGGING
  [stdio] -Dcc=g++ DEBUGGING
  [stdio] -Dcc=g++
  [stdio] -Dcc=g++ -Duselongdouble
  [stdio] -Dcc=g++ -Duse64bitall DEBUGGING
~~ ../ext/FileCache/t/03append.t ............................... FAILED Non-zero exit status: 25 Bad plan.  You planned 2 tests but ran 0.
  [stdio] -Dcc=g++ -Duse64bitall
  [stdio] -Dcc=g++ -Duselongdouble DEBUGGING
  [stdio] -Dcc=g++ DEBUGGING
  [stdio] -Dcc=g++
  [stdio] -Dcc=g++ -Duselongdouble
  [stdio] -Dcc=g++ -Duse64bitall DEBUGGING
~~ ../t/perf/benchmarks.t ...................................... FAILED Non-zero exit status: 2 No plan found in TAP output
  [stdio] -Dcc=g++ -Duse64bitall
  [stdio] -Dcc=g++ -Duselongdouble DEBUGGING
  [stdio] -Dcc=g++ DEBUGGING
  [stdio] -Dcc=g++
  [stdio] -Dcc=g++ -Duselongdouble
  [stdio] -Dcc=g++ -Duse64bitall DEBUGGING
~~ ../t/op/sub_lval.t .......................................... FAILED Non-zero exit status: 2 No plan found in TAP output
  [stdio] -Dcc=g++ -Duse64bitall
  [stdio] -Dcc=g++ -Duselongdouble DEBUGGING
  [stdio] -Dcc=g++ DEBUGGING
  [stdio] -Dcc=g++
  [stdio] -Dcc=g++ -Duselongdouble
  [stdio] -Dcc=g++ -Duse64bitall DEBUGGING
~~ ../t/op/grent.t ............................................. FAILED Non-zero exit status: 2 No plan found in TAP output
  [stdio] -Dcc=g++ -Duse64bitall
  [stdio] -Dcc=g++ -Duselongdouble DEBUGGING
  [stdio] -Dcc=g++ DEBUGGING
  [stdio] -Dcc=g++
  [stdio] -Dcc=g++ -Duselongdouble
  [stdio] -Dcc=g++ -Duse64bitall DEBUGGING
~~ ../t/mro/basic.t ............................................ FAILED Non-zero exit status: 2 No plan found in TAP output
  [stdio] -Dcc=g++ -Duse64bitall
  [stdio] -Dcc=g++ -Duselongdouble DEBUGGING
  [stdio] -Dcc=g++ DEBUGGING
  [stdio] -Dcc=g++
  [stdio] -Dcc=g++ -Duselongdouble
  [stdio] -Dcc=g++ -Duse64bitall DEBUGGING
~~ ../t/io/binmode.t ........................................... FAILED Non-zero exit status: 2 No plan found in TAP output
  [stdio] -Dcc=g++ -Duse64bitall
  [stdio] -Dcc=g++ -Duselongdouble DEBUGGING
  [stdio] -Dcc=g++ DEBUGGING
  [stdio] -Dcc=g++
  [stdio] -Dcc=g++ -Duselongdouble
  [stdio] -Dcc=g++ -Duse64bitall DEBUGGING
~~ ../dist/threads/t/no_threads.t .............................. FAILED 1
  [stdio] -Dcc=g++ -Duse64bitall
  [stdio] -Dcc=g++ -Duselongdouble DEBUGGING
  [stdio] -Dcc=g++ DEBUGGING
  [stdio] -Dcc=g++
  [stdio] -Dcc=g++ -Duselongdouble
  [stdio] -Dcc=g++ -Duse64bitall DEBUGGING
~~ ../t/run/switchC.t .......................................... FAILED Non-zero exit status: 2 No plan found in TAP output
  [stdio] -Dcc=g++ -Duse64bitall
  [stdio] -Dcc=g++ -Duselongdouble DEBUGGING
  [stdio] -Dcc=g++ DEBUGGING
  [stdio] -Dcc=g++
  [stdio] -Dcc=g++ -Duselongdouble
  [stdio] -Dcc=g++ -Duse64bitall DEBUGGING
~~ ../t/io/fs.t ................................................ FAILED Non-zero exit status: 2 No plan found in TAP output
  [stdio] -Dcc=g++ -Duse64bitall
  [stdio] -Dcc=g++ -Duselongdouble DEBUGGING
  [stdio] -Dcc=g++ DEBUGGING
  [stdio] -Dcc=g++
  [stdio] -Dcc=g++ -Duselongdouble
  [stdio] -Dcc=g++ -Duse64bitall DEBUGGING
~~ ../t/op/while.t ............................................. FAILED Non-zero exit status: 2 No plan found in TAP output
  [stdio] -Dcc=g++ -Duse64bitall
  [stdio] -Dcc=g++ -Duselongdouble DEBUGGING
  [stdio] -Dcc=g++ DEBUGGING
  [stdio] -Dcc=g++
  [stdio] -Dcc=g++ -Duselongdouble
  [stdio] -Dcc=g++ -Duse64bitall DEBUGGING
~~ ../t/io/perlio_fail.t ....................................... FAILED Non-zero exit status: 2 No plan found in TAP output
  [stdio] -Dcc=g++ -Duse64bitall
  [stdio] -Dcc=g++ -Duselongdouble DEBUGGING
  [stdio] -Dcc=g++ DEBUGGING
  [stdio] -Dcc=g++
  [stdio] -Dcc=g++ -Duselongdouble
  [stdio] -Dcc=g++ -Duse64bitall DEBUGGING
~~ ../t/uni/stash.t ............................................ FAILED Non-zero exit status: 2 No plan found in TAP output
  [stdio] -Dcc=g++ -Duse64bitall
  [stdio] -Dcc=g++ -Duselongdouble DEBUGGING
  [stdio] -Dcc=g++ DEBUGGING
  [stdio] -Dcc=g++
  [stdio] -Dcc=g++ -Duselongdouble
  [stdio] -Dcc=g++ -Duse64bitall DEBUGGING
~~ ../t/op/vec.t ............................................... FAILED Non-zero exit status: 2 No plan found in TAP output
  [stdio] -Dcc=g++ -Duse64bitall
  [stdio] -Dcc=g++ -Duselongdouble DEBUGGING
  [stdio] -Dcc=g++ DEBUGGING
  [stdio] -Dcc=g++
  [stdio] -Dcc=g++ -Duselongdouble
  [stdio] -Dcc=g++ -Duse64bitall DEBUGGING
~~ ../t/op/sort.t .............................................. FAILED Non-zero exit status: 2 No plan found in TAP output
  [stdio] -Dcc=g++ -Duse64bitall
  [stdio] -Dcc=g++ -Duselongdouble DEBUGGING
  [stdio] -Dcc=g++ DEBUGGING
  [stdio] -Dcc=g++
  [stdio] -Dcc=g++ -Duselongdouble
  [stdio] -Dcc=g++ -Duse64bitall DEBUGGING
~~ ../cpan/Test-Simple/t/Legacy/harness_active.t ............... FAILED Non-zero exit status: 255 No plan found in TAP output
  [stdio] -Dcc=g++ -Duse64bitall
  [stdio] -Dcc=g++ -Duselongdouble DEBUGGING
  [stdio] -Dcc=g++ DEBUGGING
  [stdio] -Dcc=g++
  [stdio] -Dcc=g++ -Duselongdouble
  [stdio] -Dcc=g++ -Duse64bitall DEBUGGING
~~ ../t/op/substr_thr.t ........................................ FAILED Non-zero exit status: 2 No plan found in TAP output
  [stdio] -Dcc=g++ -Duse64bitall
  [stdio] -Dcc=g++ -Duselongdouble DEBUGGING
  [stdio] -Dcc=g++ DEBUGGING
  [stdio] -Dcc=g++
  [stdio] -Dcc=g++ -Duselongdouble
  [stdio] -Dcc=g++ -Duse64bitall DEBUGGING
~~ ../t/op/dump.t .............................................. FAILED Non-zero exit status: 2 No plan found in TAP output
  [stdio] -Dcc=g++ -Duse64bitall
  [stdio] -Dcc=g++ -Duselongdouble DEBUGGING
  [stdio] -Dcc=g++ DEBUGGING
  [stdio] -Dcc=g++
  [stdio] -Dcc=g++ -Duselongdouble
  [stdio] -Dcc=g++ -Duse64bitall DEBUGGING
~~ ../t/op/taint.t ............................................. FAILED Non-zero exit status: 2 No plan found in TAP output
  [stdio] -Dcc=g++ -Duse64bitall
  [stdio] -Dcc=g++ -Duselongdouble DEBUGGING
  [stdio] -Dcc=g++ DEBUGGING
  [stdio] -Dcc=g++
  [stdio] -Dcc=g++ -Duselongdouble
  [stdio] -Dcc=g++ -Duse64bitall DEBUGGING
~~ ../t/op/utf8cache.t ......................................... FAILED Non-zero exit status: 2 No plan found in TAP output
  [stdio] -Dcc=g++ -Duse64bitall
  [stdio] -Dcc=g++ -Duselongdouble DEBUGGING
  [stdio] -Dcc=g++ DEBUGGING
  [stdio] -Dcc=g++
  [stdio] -Dcc=g++ -Duselongdouble
  [stdio] -Dcc=g++ -Duse64bitall DEBUGGING
~~ ../t/op/split_unicode.t ..................................... FAILED Non-zero exit status: 2 No plan found in TAP output
  [stdio] -Dcc=g++ -Duse64bitall
  [stdio] -Dcc=g++ -Duselongdouble DEBUGGING
  [stdio] -Dcc=g++ DEBUGGING
  [stdio] -Dcc=g++
  [stdio] -Dcc=g++ -Duselongdouble
  [stdio] -Dcc=g++ -Duse64bitall DEBUGGING
~~ ../ext/B/t/optree_sort.t .................................... FAILED Non-zero exit status: 255 No plan found in TAP output
  [stdio] -Dcc=g++ -Duse64bitall
  [stdio] -Dcc=g++ -Duselongdouble DEBUGGING
  [stdio] -Dcc=g++ DEBUGGING
  [stdio] -Dcc=g++
  [stdio] -Dcc=g++ -Duselongdouble
  [stdio] -Dcc=g++ -Duse64bitall DEBUGGING
~~ ../t/mro/method_caching.t ................................... FAILED Non-zero exit status: 2 No plan found in TAP output
  [stdio] -Dcc=g++ -Duse64bitall
  [stdio] -Dcc=g++ -Duselongdouble DEBUGGING
  [stdio] -Dcc=g++ DEBUGGING
  [stdio] -Dcc=g++
  [stdio] -Dcc=g++ -Duselongdouble
  [stdio] -Dcc=g++ -Duse64bitall DEBUGGING
~~ ../t/op/not.t ............................................... FAILED Non-zero exit status: 2 No plan found in TAP output
  [stdio] -Dcc=g++ -Duse64bitall
  [stdio] -Dcc=g++ -Duselongdouble DEBUGGING
  [stdio] -Dcc=g++ DEBUGGING
  [stdio] -Dcc=g++
  [stdio] -Dcc=g++ -Duselongdouble
  [stdio] -Dcc=g++ -Duse64bitall DEBUGGING
~~ ../t/op/auto.t .............................................. FAILED Non-zero exit status: 2 No plan found in TAP output
  [stdio] -Dcc=g++ -Duse64bitall
  [stdio] -Dcc=g++ -Duselongdouble DEBUGGING
  [stdio] -Dcc=g++ DEBUGGING
  [stdio] -Dcc=g++
  [stdio] -Dcc=g++ -Duselongdouble
  [stdio] -Dcc=g++ -Duse64bitall DEBUGGING
~~ ../t/re/pat_re_eval.t ....................................... FAILED Non-zero exit status: 2 No plan found in TAP output
  [stdio] -Dcc=g++ -Duse64bitall
  [stdio] -Dcc=g++ -Duselongdouble DEBUGGING
  [stdio] -Dcc=g++ DEBUGGING
  [stdio] -Dcc=g++
  [stdio] -Dcc=g++ -Duselongdouble
  [stdio] -Dcc=g++ -Duse64bitall DEBUGGING
~~ ../t/re/reg_nocapture.t ..................................... FAILED Non-zero exit status: 2 No plan found in TAP output
  [stdio] -Dcc=g++ -Duse64bitall
  [stdio] -Dcc=g++ -Duselongdouble DEBUGGING
  [stdio] -Dcc=g++ DEBUGGING
  [stdio] -Dcc=g++
  [stdio] -Dcc=g++ -Duselongdouble
  [stdio] -Dcc=g++ -Duse64bitall DEBUGGING
~~ ../ext/File-Glob/t/global.t ................................. FAILED Non-zero exit status: 2 No plan found in TAP output
  [stdio] -Dcc=g++ -Duse64bitall
  [stdio] -Dcc=g++ -Duselongdouble DEBUGGING
  [stdio] -Dcc=g++ DEBUGGING
  [stdio] -Dcc=g++
  [stdio] -Dcc=g++ -Duselongdouble
  [stdio] -Dcc=g++ -Duse64bitall DEBUGGING
~~ ../cpan/Text-Balanced/t/07_exttag.t ......................... FAILED Non-zero exit status: 255 Bad plan.  You planned 53 tests but ran 0.
  [stdio] -Dcc=g++ -Duse64bitall
  [stdio] -Dcc=g++ -Duselongdouble DEBUGGING
  [stdio] -Dcc=g++ DEBUGGING
  [stdio] -Dcc=g++
  [stdio] -Dcc=g++ -Duselongdouble
  [stdio] -Dcc=g++ -Duse64bitall DEBUGGING
~~ ../t/op/gv.t ................................................ FAILED Non-zero exit status: 2 No plan found in TAP output
  [stdio] -Dcc=g++ -Duse64bitall
  [stdio] -Dcc=g++ -Duselongdouble DEBUGGING
  [stdio] -Dcc=g++ DEBUGGING
  [stdio] -Dcc=g++
  [stdio] -Dcc=g++ -Duselongdouble
  [stdio] -Dcc=g++ -Duse64bitall DEBUGGING
~~ ../cpan/ExtUtils-MakeMaker/t/split_command.t ................ FAILED Non-zero exit status: 255 Bad plan.  You planned 7 tests but ran 0.
  [stdio] -Dcc=g++ -Duse64bitall
  [stdio] -Dcc=g++ -Duselongdouble DEBUGGING
  [stdio] -Dcc=g++ DEBUGGING
  [stdio] -Dcc=g++
  [stdio] -Dcc=g++ -Duselongdouble
  [stdio] -Dcc=g++ -Duse64bitall DEBUGGING
~~ ../lib/Tie/Array/splice.t ................................... FAILED Non-zero exit status: 2 No plan found in TAP output
  [stdio] -Dcc=g++ -Duse64bitall
  [stdio] -Dcc=g++ -Duselongdouble DEBUGGING
  [stdio] -Dcc=g++ DEBUGGING
  [stdio] -Dcc=g++
  [stdio] -Dcc=g++ -Duselongdouble
  [stdio] -Dcc=g++ -Duse64bitall DEBUGGING
~~ ../dist/IO/t/io_utf8argv.t .................................. FAILED Non-zero exit status: 2 No plan found in TAP output
  [stdio] -Dcc=g++ -Duse64bitall
  [stdio] -Dcc=g++ -Duselongdouble DEBUGGING
  [stdio] -Dcc=g++ DEBUGGING
  [stdio] -Dcc=g++
  [stdio] -Dcc=g++ -Duselongdouble
  [stdio] -Dcc=g++ -Duse64bitall DEBUGGING
~~ ../lib/perl7db.t ............................................ FAILED Non-zero exit status: 2 No plan found in TAP output
  [stdio] -Dcc=g++ -Duse64bitall
  [stdio] -Dcc=g++ -Duselongdouble DEBUGGING
  [stdio] -Dcc=g++ DEBUGGING
  [stdio] -Dcc=g++
  [stdio] -Dcc=g++ -Duselongdouble
  [stdio] -Dcc=g++ -Duse64bitall DEBUGGING
~~ ../dist/Storable/t/downgrade.t .............................. FAILED 13 66-67 125 Non-zero exit status: 27
  [stdio] -Dcc=g++ -Duselongdouble
~~ ../t/mro/overload_c3.t ...................................... FAILED Non-zero exit status: 2 No plan found in TAP output
  [stdio] -Dcc=g++ -Duse64bitall
  [stdio] -Dcc=g++ -Duselongdouble DEBUGGING
  [stdio] -Dcc=g++ DEBUGGING
  [stdio] -Dcc=g++
  [stdio] -Dcc=g++ -Duselongdouble
  [stdio] -Dcc=g++ -Duse64bitall DEBUGGING
~~ ../dist/Safe/t/safeops.t .................................... FAILED Non-zero exit status: 2 No plan found in TAP output
  [stdio] -Dcc=g++ -Duse64bitall
  [stdio] -Dcc=g++ -Duselongdouble DEBUGGING
  [stdio] -Dcc=g++ DEBUGGING
  [stdio] -Dcc=g++
  [stdio] -Dcc=g++ -Duselongdouble
  [stdio] -Dcc=g++ -Duse64bitall DEBUGGING
~~ ../t/io/utf8.t .............................................. FAILED Non-zero exit status: 2 No plan found in TAP output
  [stdio] -Dcc=g++ -Duse64bitall
  [stdio] -Dcc=g++ -Duselongdouble DEBUGGING
  [stdio] -Dcc=g++ DEBUGGING
  [stdio] -Dcc=g++
  [stdio] -Dcc=g++ -Duselongdouble
  [stdio] -Dcc=g++ -Duse64bitall DEBUGGING
~~ ../t/perf/optree.t .......................................... FAILED Non-zero exit status: 2 No plan found in TAP output
  [stdio] -Dcc=g++ -Duse64bitall
  [stdio] -Dcc=g++ -Duselongdouble DEBUGGING
  [stdio] -Dcc=g++ DEBUGGING
  [stdio] -Dcc=g++
  [stdio] -Dcc=g++ -Duselongdouble
  [stdio] -Dcc=g++ -Duse64bitall DEBUGGING
~~ ../t/op/list.t .............................................. FAILED Non-zero exit status: 2 No plan found in TAP output
  [stdio] -Dcc=g++ -Duse64bitall
  [stdio] -Dcc=g++ -Duselongdouble DEBUGGING
  [stdio] -Dcc=g++ DEBUGGING
  [stdio] -Dcc=g++
  [stdio] -Dcc=g++ -Duselongdouble
  [stdio] -Dcc=g++ -Duse64bitall DEBUGGING
~~ ../cpan/version/t/02derived.t ............................... FAILED Non-zero exit status: 255
  [stdio] -Dcc=g++ -Duse64bitall
  [stdio] -Dcc=g++ -Duselongdouble DEBUGGING
  [stdio] -Dcc=g++ DEBUGGING
  [stdio] -Dcc=g++
  [stdio] -Dcc=g++ -Duselongdouble
  [stdio] -Dcc=g++ -Duse64bitall DEBUGGING
~~ ../t/op/avhv.t .............................................. FAILED Non-zero exit status: 2 No plan found in TAP output
  [stdio] -Dcc=g++ -Duse64bitall
  [stdio] -Dcc=g++ -Duselongdouble DEBUGGING
  [stdio] -Dcc=g++ DEBUGGING
  [stdio] -Dcc=g++
  [stdio] -Dcc=g++ -Duselongdouble
  [stdio] -Dcc=g++ -Duse64bitall DEBUGGING
~~ ../t/uni/gv.t ............................................... FAILED Non-zero exit status: 2 No plan found in TAP output
  [stdio] -Dcc=g++ -Duse64bitall
  [stdio] -Dcc=g++ -Duselongdouble DEBUGGING
  [stdio] -Dcc=g++ DEBUGGING
  [stdio] -Dcc=g++
  [stdio] -Dcc=g++ -Duselongdouble
  [stdio] -Dcc=g++ -Duse64bitall DEBUGGING
~~ ../t/porting/extrefs.t ...................................... FAILED Non-zero exit status: 2 No plan found in TAP output
  [stdio] -Dcc=g++ -Duse64bitall
  [stdio] -Dcc=g++ -Duselongdouble DEBUGGING
  [stdio] -Dcc=g++ DEBUGGING
  [stdio] -Dcc=g++
  [stdio] -Dcc=g++ -Duselongdouble
  [stdio] -Dcc=g++ -Duse64bitall DEBUGGING
~~ ../cpan/Test-Simple/t/Legacy/Builder/current_test.t ......... FAILED Non-zero exit status: 255 No plan found in TAP output
  [stdio] -Dcc=g++ -Duse64bitall
  [stdio] -Dcc=g++ -Duselongdouble DEBUGGING
  [stdio] -Dcc=g++ DEBUGGING
  [stdio] -Dcc=g++
  [stdio] -Dcc=g++ -Duselongdouble
  [stdio] -Dcc=g++ -Duse64bitall DEBUGGING
~~ ../t/op/anonconst.t ......................................... FAILED Non-zero exit status: 2 No plan found in TAP output
  [stdio] -Dcc=g++ -Duse64bitall
  [stdio] -Dcc=g++ -Duselongdouble DEBUGGING
  [stdio] -Dcc=g++ DEBUGGING
  [stdio] -Dcc=g++
  [stdio] -Dcc=g++ -Duselongdouble
  [stdio] -Dcc=g++ -Duse64bitall DEBUGGING
~~ ../t/re/recompile.t ......................................... FAILED Non-zero exit status: 2 No plan found in TAP output
  [stdio] -Dcc=g++ -Duse64bitall
  [stdio] -Dcc=g++ -Duselongdouble DEBUGGING
  [stdio] -Dcc=g++ DEBUGGING
  [stdio] -Dcc=g++
  [stdio] -Dcc=g++ -Duselongdouble
  [stdio] -Dcc=g++ -Duse64bitall DEBUGGING
~~ ../t/op/select.t ............................................ FAILED Non-zero exit status: 2 No plan found in TAP output
  [stdio] -Dcc=g++ -Duse64bitall
  [stdio] -Dcc=g++ -Duselongdouble DEBUGGING
  [stdio] -Dcc=g++ DEBUGGING
  [stdio] -Dcc=g++
  [stdio] -Dcc=g++ -Duselongdouble
  [stdio] -Dcc=g++ -Duse64bitall DEBUGGING
~~ ../cpan/Test-Simple/t/Legacy/Regression/736_use_ok.t ........ FAILED Non-zero exit status: 255 No plan found in TAP output
  [stdio] -Dcc=g++ -Duse64bitall
  [stdio] -Dcc=g++ -Duselongdouble DEBUGGING
  [stdio] -Dcc=g++ DEBUGGING
  [stdio] -Dcc=g++
  [stdio] -Dcc=g++ -Duselongdouble
  [stdio] -Dcc=g++ -Duse64bitall DEBUGGING
~~ ../t/op/splice.t ............................................ FAILED Non-zero exit status: 2 No plan found in TAP output
  [stdio] -Dcc=g++ -Duse64bitall
  [stdio] -Dcc=g++ -Duselongdouble DEBUGGING
  [stdio] -Dcc=g++ DEBUGGING
  [stdio] -Dcc=g++
  [stdio] -Dcc=g++ -Duselongdouble
  [stdio] -Dcc=g++ -Duse64bitall DEBUGGING
~~ ../t/op/fh.t ................................................ FAILED Non-zero exit status: 2 No plan found in TAP output
  [stdio] -Dcc=g++ -Duse64bitall
  [stdio] -Dcc=g++ -Duselongdouble DEBUGGING
  [stdio] -Dcc=g++ DEBUGGING
  [stdio] -Dcc=g++
  [stdio] -Dcc=g++ -Duselongdouble
  [stdio] -Dcc=g++ -Duse64bitall DEBUGGING
~~ ../t/op/closure.t ........................................... FAILED Non-zero exit status: 2 No plan found in TAP output
  [stdio] -Dcc=g++ -Duse64bitall
  [stdio] -Dcc=g++ -Duselongdouble DEBUGGING
  [stdio] -Dcc=g++ DEBUGGING
  [stdio] -Dcc=g++
  [stdio] -Dcc=g++ -Duselongdouble
  [stdio] -Dcc=g++ -Duse64bitall DEBUGGING
~~ ../t/comp/hints.t ........................................... FAILED Non-zero exit status: 2 Bad plan.  You planned 31 tests but ran 30.
  [stdio] -Dcc=g++ -Duse64bitall
  [stdio] -Dcc=g++ -Duselongdouble DEBUGGING
  [stdio] -Dcc=g++ DEBUGGING
  [stdio] -Dcc=g++
  [stdio] -Dcc=g++ -Duselongdouble
  [stdio] -Dcc=g++ -Duse64bitall DEBUGGING
~~ ../t/op/hashwarn.t .......................................... FAILED Non-zero exit status: 2 No plan found in TAP output
  [stdio] -Dcc=g++ -Duse64bitall
  [stdio] -Dcc=g++ -Duselongdouble DEBUGGING
  [stdio] -Dcc=g++ DEBUGGING
  [stdio] -Dcc=g++
  [stdio] -Dcc=g++ -Duselongdouble
  [stdio] -Dcc=g++ -Duse64bitall DEBUGGING
~~ ../t/re/pos.t ............................................... FAILED Non-zero exit status: 2 No plan found in TAP output
  [stdio] -Dcc=g++ -Duse64bitall
  [stdio] -Dcc=g++ -Duselongdouble DEBUGGING
  [stdio] -Dcc=g++ DEBUGGING
  [stdio] -Dcc=g++
  [stdio] -Dcc=g++ -Duselongdouble
  [stdio] -Dcc=g++ -Duse64bitall DEBUGGING
~~ ../t/opbasic/arith.t ........................................ FAILED Non-zero exit status: 2 No plan found in TAP output
  [stdio] -Dcc=g++ -Duse64bitall
  [stdio] -Dcc=g++ -Duselongdouble DEBUGGING
  [stdio] -Dcc=g++ DEBUGGING
  [stdio] -Dcc=g++
  [stdio] -Dcc=g++ -Duselongdouble
  [stdio] -Dcc=g++ -Duse64bitall DEBUGGING
~~ ../cpan/Test-Simple/t/Legacy/is_deeply_fail.t ............... FAILED Non-zero exit status: 255 No plan found in TAP output
  [stdio] -Dcc=g++ -Duse64bitall
  [stdio] -Dcc=g++ -Duselongdouble DEBUGGING
  [stdio] -Dcc=g++ DEBUGGING
  [stdio] -Dcc=g++
  [stdio] -Dcc=g++ -Duselongdouble
  [stdio] -Dcc=g++ -Duse64bitall DEBUGGING
~~ ../cpan/ExtUtils-MakeMaker/t/basic.t ........................ FAILED 22-28 Non-zero exit status: 7
  [stdio] -Dcc=g++ -Duselongdouble DEBUGGING
  [stdio] -Dcc=g++ -Duselongdouble
~~ ../t/op/concat2.t ........................................... FAILED Non-zero exit status: 2 No plan found in TAP output
  [stdio] -Dcc=g++ -Duse64bitall
  [stdio] -Dcc=g++ -Duselongdouble DEBUGGING
  [stdio] -Dcc=g++ DEBUGGING
  [stdio] -Dcc=g++
  [stdio] -Dcc=g++ -Duselongdouble
  [stdio] -Dcc=g++ -Duse64bitall DEBUGGING
~~ ../t/perf/speed.t ........................................... FAILED Non-zero exit status: 2 No plan found in TAP output
  [stdio] -Dcc=g++ -Duse64bitall
  [stdio] -Dcc=g++ -Duselongdouble DEBUGGING
  [stdio] -Dcc=g++ DEBUGGING
  [stdio] -Dcc=g++
  [stdio] -Dcc=g++ -Duselongdouble
  [stdio] -Dcc=g++ -Duse64bitall DEBUGGING
~~ ../t/op/substr.t ............................................ FAILED Non-zero exit status: 2 No plan found in TAP output
  [stdio] -Dcc=g++ -Duse64bitall
  [stdio] -Dcc=g++ -Duselongdouble DEBUGGING
  [stdio] -Dcc=g++ DEBUGGING
  [stdio] -Dcc=g++
  [stdio] -Dcc=g++ -Duselongdouble
  [stdio] -Dcc=g++ -Duse64bitall DEBUGGING
~~ ../t/porting/utils.t ........................................ FAILED Non-zero exit status: 2 No plan found in TAP output
  [stdio] -Dcc=g++ -Duse64bitall
  [stdio] -Dcc=g++ -Duselongdouble DEBUGGING
  [stdio] -Dcc=g++ DEBUGGING
  [stdio] -Dcc=g++
  [stdio] -Dcc=g++ -Duselongdouble
  [stdio] -Dcc=g++ -Duse64bitall DEBUGGING
~~ ../t/mro/package_aliases_utf8.t ............................. FAILED Non-zero exit status: 2 No plan found in TAP output
  [stdio] -Dcc=g++ -Duse64bitall
  [stdio] -Dcc=g++ -Duselongdouble DEBUGGING
  [stdio] -Dcc=g++ DEBUGGING
  [stdio] -Dcc=g++
  [stdio] -Dcc=g++ -Duselongdouble
  [stdio] -Dcc=g++ -Duse64bitall DEBUGGING
~~ ../ext/B/t/optree_constants.t ............................... FAILED Non-zero exit status: 2 No plan found in TAP output
  [stdio] -Dcc=g++ -Duse64bitall
  [stdio] -Dcc=g++ -Duselongdouble DEBUGGING
  [stdio] -Dcc=g++ DEBUGGING
  [stdio] -Dcc=g++
  [stdio] -Dcc=g++ -Duselongdouble
  [stdio] -Dcc=g++ -Duse64bitall DEBUGGING
~~ ../t/mro/next_edgecases_utf8.t .............................. FAILED Non-zero exit status: 2 No plan found in TAP output
  [stdio] -Dcc=g++ -Duse64bitall
  [stdio] -Dcc=g++ -Duselongdouble DEBUGGING
  [stdio] -Dcc=g++ DEBUGGING
  [stdio] -Dcc=g++
  [stdio] -Dcc=g++ -Duselongdouble
  [stdio] -Dcc=g++ -Duse64bitall DEBUGGING
~~ ../t/re/bigfuzzy_not_utf8.t ................................. FAILED Non-zero exit status: 2 No plan found in TAP output
  [stdio] -Dcc=g++ -Duse64bitall
  [stdio] -Dcc=g++ -Duselongdouble DEBUGGING
  [stdio] -Dcc=g++ DEBUGGING
  [stdio] -Dcc=g++
  [stdio] -Dcc=g++ -Duselongdouble
  [stdio] -Dcc=g++ -Duse64bitall DEBUGGING
~~ ../cpan/Test-Simple/t/Test2/modules/API/Context.t ........... FAILED Non-zero exit status: 255 No plan found in TAP output
  [stdio] -Dcc=g++ -Duse64bitall
  [stdio] -Dcc=g++ -Duselongdouble DEBUGGING
  [stdio] -Dcc=g++ DEBUGGING
  [stdio] -Dcc=g++
  [stdio] -Dcc=g++ -Duselongdouble
  [stdio] -Dcc=g++ -Duse64bitall DEBUGGING
~~ ../t/op/switch.t ............................................ FAILED Non-zero exit status: 2 No plan found in TAP output
  [stdio] -Dcc=g++ -Duse64bitall
  [stdio] -Dcc=g++ -Duselongdouble DEBUGGING
  [stdio] -Dcc=g++ DEBUGGING
  [stdio] -Dcc=g++
  [stdio] -Dcc=g++ -Duselongdouble
  [stdio] -Dcc=g++ -Duse64bitall DEBUGGING
~~ ../ext/B/t/optree_misc.t .................................... FAILED Non-zero exit status: 255 No plan found in TAP output
  [stdio] -Dcc=g++ -Duse64bitall
  [stdio] -Dcc=g++ -Duselongdouble DEBUGGING
  [stdio] -Dcc=g++ DEBUGGING
  [stdio] -Dcc=g++
  [stdio] -Dcc=g++ -Duselongdouble
  [stdio] -Dcc=g++ -Duse64bitall DEBUGGING
~~ ../t/re/pat_advanced_thr.t .................................. FAILED Non-zero exit status: 2 No plan found in TAP output
  [stdio] -Dcc=g++ -Duse64bitall
  [stdio] -Dcc=g++ -Duselongdouble DEBUGGING
  [stdio] -Dcc=g++ DEBUGGING
  [stdio] -Dcc=g++
  [stdio] -Dcc=g++ -Duselongdouble
  [stdio] -Dcc=g++ -Duse64bitall DEBUGGING
~~ ../t/mro/next_edgecases.t ................................... FAILED Non-zero exit status: 2 No plan found in TAP output
  [stdio] -Dcc=g++ -Duse64bitall
  [stdio] -Dcc=g++ -Duselongdouble DEBUGGING
  [stdio] -Dcc=g++ DEBUGGING
  [stdio] -Dcc=g++
  [stdio] -Dcc=g++ -Duselongdouble
  [stdio] -Dcc=g++ -Duse64bitall DEBUGGING
~~ ../t/op/eval.t .............................................. FAILED Non-zero exit status: 2 No plan found in TAP output
  [stdio] -Dcc=g++ -Duse64bitall
  [stdio] -Dcc=g++ -Duselongdouble DEBUGGING
  [stdio] -Dcc=g++ DEBUGGING
  [stdio] -Dcc=g++
  [stdio] -Dcc=g++ -Duselongdouble
  [stdio] -Dcc=g++ -Duse64bitall DEBUGGING
~~ ../ext/Fcntl/t/mode.t ....................................... FAILED Non-zero exit status: 255 No plan found in TAP output
  [stdio] -Dcc=g++ -Duse64bitall
  [stdio] -Dcc=g++ -Duselongdouble DEBUGGING
  [stdio] -Dcc=g++ DEBUGGING
  [stdio] -Dcc=g++
  [stdio] -Dcc=g++ -Duselongdouble
  [stdio] -Dcc=g++ -Duse64bitall DEBUGGING
~~ ../dist/IO/t/io_utf8.t ...................................... FAILED Non-zero exit status: 2 No plan found in TAP output
  [stdio] -Dcc=g++ -Duse64bitall
  [stdio] -Dcc=g++ -Duselongdouble DEBUGGING
  [stdio] -Dcc=g++ DEBUGGING
  [stdio] -Dcc=g++
  [stdio] -Dcc=g++ -Duselongdouble
  [stdio] -Dcc=g++ -Duse64bitall DEBUGGING
~~ ../t/re/fold_grind_T.t ...................................... FAILED Non-zero exit status: 2 No plan found in TAP output
  [stdio] -Dcc=g++ -Duse64bitall
  [stdio] -Dcc=g++ -Duselongdouble DEBUGGING
  [stdio] -Dcc=g++ DEBUGGING
  [stdio] -Dcc=g++
  [stdio] -Dcc=g++ -Duselongdouble
  [stdio] -Dcc=g++ -Duse64bitall DEBUGGING
~~ ../t/re/qrstack.t ........................................... FAILED Non-zero exit status: 2 No plan found in TAP output
  [stdio] -Dcc=g++ -Duse64bitall
  [stdio] -Dcc=g++ -Duselongdouble DEBUGGING
  [stdio] -Dcc=g++ DEBUGGING
  [stdio] -Dcc=g++
  [stdio] -Dcc=g++ -Duselongdouble
  [stdio] -Dcc=g++ -Duse64bitall DEBUGGING
~~ ../dist/IO/t/io_udp.t ....................................... FAILED Non-zero exit status: 2 No plan found in TAP output
  [stdio] -Dcc=g++ -Duse64bitall
  [stdio] -Dcc=g++ -Duselongdouble DEBUGGING
  [stdio] -Dcc=g++ DEBUGGING
  [stdio] -Dcc=g++
  [stdio] -Dcc=g++ -Duselongdouble
  [stdio] -Dcc=g++ -Duse64bitall DEBUGGING
~~ ../cpan/Pod-Checker/t/pod/poderrs.t ......................... FAILED Non-zero exit status: 255 No plan found in TAP output
  [stdio] -Dcc=g++ -Duse64bitall
  [stdio] -Dcc=g++ -Duselongdouble DEBUGGING
  [stdio] -Dcc=g++ DEBUGGING
  [stdio] -Dcc=g++
  [stdio] -Dcc=g++ -Duselongdouble
  [stdio] -Dcc=g++ -Duse64bitall DEBUGGING
~~ ../t/re/rt122747.t .......................................... FAILED Non-zero exit status: 2 No plan found in TAP output
  [stdio] -Dcc=g++ -Duse64bitall
  [stdio] -Dcc=g++ -Duselongdouble DEBUGGING
  [stdio] -Dcc=g++ DEBUGGING
  [stdio] -Dcc=g++
  [stdio] -Dcc=g++ -Duselongdouble
  [stdio] -Dcc=g++ -Duse64bitall DEBUGGING
~~ ../t/op/my_stash.t .......................................... FAILED Non-zero exit status: 2 No plan found in TAP output
  [stdio] -Dcc=g++ -Duse64bitall
  [stdio] -Dcc=g++ -Duselongdouble DEBUGGING
  [stdio] -Dcc=g++ DEBUGGING
  [stdio] -Dcc=g++
  [stdio] -Dcc=g++ -Duselongdouble
  [stdio] -Dcc=g++ -Duse64bitall DEBUGGING
~~ ../t/op/lock.t .............................................. FAILED Non-zero exit status: 2 No plan found in TAP output
  [stdio] -Dcc=g++ -Duse64bitall
  [stdio] -Dcc=g++ -Duselongdouble DEBUGGING
  [stdio] -Dcc=g++ DEBUGGING
  [stdio] -Dcc=g++
  [stdio] -Dcc=g++ -Duselongdouble
  [stdio] -Dcc=g++ -Duse64bitall DEBUGGING
~~ ../dist/ExtUtils-CBuilder/t/00-have-compiler.t .............. FAILED Non-zero exit status: 255 No plan found in TAP output
  [stdio] -Dcc=g++ -Duse64bitall
  [stdio] -Dcc=g++ -Duselongdouble DEBUGGING
  [stdio] -Dcc=g++ DEBUGGING
  [stdio] -Dcc=g++
  [stdio] -Dcc=g++ -Duselongdouble
  [stdio] -Dcc=g++ -Duse64bitall DEBUGGING
~~ ../t/re/reg_nc_tie.t ........................................ FAILED Non-zero exit status: 2 No plan found in TAP output
  [stdio] -Dcc=g++ -Duse64bitall
  [stdio] -Dcc=g++ -Duselongdouble DEBUGGING
  [stdio] -Dcc=g++ DEBUGGING
  [stdio] -Dcc=g++
  [stdio] -Dcc=g++ -Duselongdouble
  [stdio] -Dcc=g++ -Duse64bitall DEBUGGING
~~ ../t/perf/opcount.t ......................................... FAILED Non-zero exit status: 2 No plan found in TAP output
  [stdio] -Dcc=g++ -Duse64bitall
  [stdio] -Dcc=g++ -Duselongdouble DEBUGGING
  [stdio] -Dcc=g++ DEBUGGING
  [stdio] -Dcc=g++
  [stdio] -Dcc=g++ -Duselongdouble
  [stdio] -Dcc=g++ -Duse64bitall DEBUGGING
~~ ../cpan/version/t/01base.t .................................. FAILED Non-zero exit status: 255
  [stdio] -Dcc=g++ -Duse64bitall
  [stdio] -Dcc=g++ -Duselongdouble DEBUGGING
  [stdio] -Dcc=g++ DEBUGGING
  [stdio] -Dcc=g++
  [stdio] -Dcc=g++ -Duselongdouble
  [stdio] -Dcc=g++ -Duse64bitall DEBUGGING
~~ ../t/porting/FindExt.t ...................................... FAILED Non-zero exit status: 2 No plan found in TAP output
  [stdio] -Dcc=g++ -Duse64bitall
  [stdio] -Dcc=g++ -Duselongdouble DEBUGGING
  [stdio] -Dcc=g++ DEBUGGING
  [stdio] -Dcc=g++
  [stdio] -Dcc=g++ -Duselongdouble
  [stdio] -Dcc=g++ -Duse64bitall DEBUGGING
~~ ../lib/diagnostics.t ........................................ FAILED Non-zero exit status: 2 No plan found in TAP output
  [stdio] -Dcc=g++ -Duse64bitall
  [stdio] -Dcc=g++ -Duselongdouble DEBUGGING
  [stdio] -Dcc=g++ DEBUGGING
  [stdio] -Dcc=g++
  [stdio] -Dcc=g++ -Duselongdouble
  [stdio] -Dcc=g++ -Duse64bitall DEBUGGING
~~ ../t/op/pack.t .............................................. FAILED Non-zero exit status: 2 No plan found in TAP output
  [stdio] -Dcc=g++ -Duse64bitall
  [stdio] -Dcc=g++ -Duselongdouble DEBUGGING
  [stdio] -Dcc=g++ DEBUGGING
  [stdio] -Dcc=g++
  [stdio] -Dcc=g++ -Duselongdouble
  [stdio] -Dcc=g++ -Duse64bitall DEBUGGING
~~ ../t/op/range.t ............................................. FAILED Non-zero exit status: 2 No plan found in TAP output
  [stdio] -Dcc=g++ -Duse64bitall
  [stdio] -Dcc=g++ -Duselongdouble DEBUGGING
  [stdio] -Dcc=g++ DEBUGGING
  [stdio] -Dcc=g++
  [stdio] -Dcc=g++ -Duselongdouble
  [stdio] -Dcc=g++ -Duse64bitall DEBUGGING
~~ ../lib/perlbug.t ............................................ FAILED Non-zero exit status: 2 No plan found in TAP output
  [stdio] -Dcc=g++ -Duse64bitall
  [stdio] -Dcc=g++ -Duselongdouble DEBUGGING
  [stdio] -Dcc=g++ DEBUGGING
  [stdio] -Dcc=g++
  [stdio] -Dcc=g++ -Duselongdouble
  [stdio] -Dcc=g++ -Duse64bitall DEBUGGING
~~ ../t/op/append.t ............................................ FAILED Non-zero exit status: 2 No plan found in TAP output
  [stdio] -Dcc=g++ -Duse64bitall
  [stdio] -Dcc=g++ -Duselongdouble DEBUGGING
  [stdio] -Dcc=g++ DEBUGGING
  [stdio] -Dcc=g++
  [stdio] -Dcc=g++ -Duselongdouble
  [stdio] -Dcc=g++ -Duse64bitall DEBUGGING
~~ ../t/op/unlink.t ............................................ FAILED Non-zero exit status: 2 No plan found in TAP output
  [stdio] -Dcc=g++ -Duse64bitall
  [stdio] -Dcc=g++ -Duselongdouble DEBUGGING
  [stdio] -Dcc=g++ DEBUGGING
  [stdio] -Dcc=g++
  [stdio] -Dcc=g++ -Duselongdouble
  [stdio] -Dcc=g++ -Duse64bitall DEBUGGING
~~ ../cpan/Test-Simple/t/Legacy/exit.t ......................... FAILED 1-261
  [stdio] -Dcc=g++ DEBUGGING
~~ ../t/re/qr-72922.t .......................................... FAILED Non-zero exit status: 2 No plan found in TAP output
  [stdio] -Dcc=g++ -Duse64bitall
  [stdio] -Dcc=g++ -Duselongdouble DEBUGGING
  [stdio] -Dcc=g++ DEBUGGING
  [stdio] -Dcc=g++
  [stdio] -Dcc=g++ -Duselongdouble
  [stdio] -Dcc=g++ -Duse64bitall DEBUGGING
~~ ../t/re/subst_wamp.t ........................................ FAILED No plan found in TAP output
  [stdio] -Dcc=g++ -Duse64bitall
  [stdio] -Dcc=g++ -Duselongdouble DEBUGGING
  [stdio] -Dcc=g++ DEBUGGING
  [stdio] -Dcc=g++
  [stdio] -Dcc=g++ -Duselongdouble
  [stdio] -Dcc=g++ -Duse64bitall DEBUGGING
~~ ../t/op/universal.t ......................................... FAILED Non-zero exit status: 2 No plan found in TAP output
  [stdio] -Dcc=g++ -Duse64bitall
  [stdio] -Dcc=g++ -Duselongdouble DEBUGGING
  [stdio] -Dcc=g++ DEBUGGING
  [stdio] -Dcc=g++
  [stdio] -Dcc=g++ -Duselongdouble
  [stdio] -Dcc=g++ -Duse64bitall DEBUGGING
~~ ../t/comp/parser_run.t ...................................... FAILED Non-zero exit status: 2 No plan found in TAP output
  [stdio] -Dcc=g++ -Duse64bitall
  [stdio] -Dcc=g++ -Duselongdouble DEBUGGING
  [stdio] -Dcc=g++ DEBUGGING
  [stdio] -Dcc=g++
  [stdio] -Dcc=g++ -Duselongdouble
  [stdio] -Dcc=g++ -Duse64bitall DEBUGGING
~~ ../t/op/groups.t ............................................ FAILED Non-zero exit status: 2 No plan found in TAP output
  [stdio] -Dcc=g++ -Duse64bitall
  [stdio] -Dcc=g++ -Duselongdouble DEBUGGING
  [stdio] -Dcc=g++ DEBUGGING
  [stdio] -Dcc=g++
  [stdio] -Dcc=g++ -Duselongdouble
  [stdio] -Dcc=g++ -Duse64bitall DEBUGGING
~~ ../cpan/Compress-Raw-Zlib/t/19nonpv.t ....................... FAILED Non-zero exit status: 255 No plan found in TAP output
  [stdio] -Dcc=g++ -Duse64bitall
  [stdio] -Dcc=g++ -Duselongdouble DEBUGGING
  [stdio] -Dcc=g++ DEBUGGING
  [stdio] -Dcc=g++
  [stdio] -Dcc=g++ -Duselongdouble
  [stdio] -Dcc=g++ -Duse64bitall DEBUGGING
~~ ../t/run/exit.t ............................................. FAILED Non-zero exit status: 2 No plan found in TAP output
  [stdio] -Dcc=g++ -Duse64bitall
  [stdio] -Dcc=g++ -Duselongdouble DEBUGGING
  [stdio] -Dcc=g++ DEBUGGING
  [stdio] -Dcc=g++
  [stdio] -Dcc=g++ -Duselongdouble
  [stdio] -Dcc=g++ -Duse64bitall DEBUGGING
~~ ../t/io/openpid.t ........................................... FAILED Non-zero exit status: 2 No plan found in TAP output
  [stdio] -Dcc=g++ -Duse64bitall
  [stdio] -Dcc=g++ -Duselongdouble DEBUGGING
  [stdio] -Dcc=g++ DEBUGGING
  [stdio] -Dcc=g++
  [stdio] -Dcc=g++ -Duselongdouble
  [stdio] -Dcc=g++ -Duse64bitall DEBUGGING
~~ ../cpan/ExtUtils-MakeMaker/t/MM_VMS.t ....................... FAILED Non-zero exit status: 255 No plan found in TAP output
  [stdio] -Dcc=g++ -Duse64bitall
  [stdio] -Dcc=g++ -Duselongdouble DEBUGGING
  [stdio] -Dcc=g++ DEBUGGING
  [stdio] -Dcc=g++
  [stdio] -Dcc=g++ -Duselongdouble
  [stdio] -Dcc=g++ -Duse64bitall DEBUGGING
~~ ../t/re/begin-once.t ........................................ FAILED Non-zero exit status: 2 No plan found in TAP output
  [stdio] -Dcc=g++ -Duse64bitall
  [stdio] -Dcc=g++ -Duselongdouble DEBUGGING
  [stdio] -Dcc=g++ DEBUGGING
  [stdio] -Dcc=g++
  [stdio] -Dcc=g++ -Duselongdouble
  [stdio] -Dcc=g++ -Duse64bitall DEBUGGING
~~ ../t/io/inplace.t ........................................... FAILED Non-zero exit status: 2 No plan found in TAP output
  [stdio] -Dcc=g++ -Duse64bitall
  [stdio] -Dcc=g++ -Duselongdouble DEBUGGING
  [stdio] -Dcc=g++ DEBUGGING
  [stdio] -Dcc=g++
  [stdio] -Dcc=g++ -Duselongdouble
  [stdio] -Dcc=g++ -Duse64bitall DEBUGGING
~~ ../t/op/split.t ............................................. FAILED Non-zero exit status: 2 No plan found in TAP output
  [stdio] -Dcc=g++ -Duse64bitall
  [stdio] -Dcc=g++ -Duselongdouble DEBUGGING
  [stdio] -Dcc=g++ DEBUGGING
  [stdio] -Dcc=g++
  [stdio] -Dcc=g++ -Duselongdouble
  [stdio] -Dcc=g++ -Duse64bitall DEBUGGING
~~ ../lib/cygwin.t ............................................. FAILED Non-zero exit status: 2 No plan found in TAP output
  [stdio] -Dcc=g++ -Duse64bitall
  [stdio] -Dcc=g++ -Duselongdouble DEBUGGING
  [stdio] -Dcc=g++ DEBUGGING
  [stdio] -Dcc=g++
  [stdio] -Dcc=g++ -Duselongdouble
  [stdio] -Dcc=g++ -Duse64bitall DEBUGGING
~~ ../ext/Fcntl/t/syslfs.t ..................................... FAILED Non-zero exit status: 255 No plan found in TAP output
  [stdio] -Dcc=g++ -Duse64bitall
  [stdio] -Dcc=g++ -Duselongdouble DEBUGGING
  [stdio] -Dcc=g++ DEBUGGING
  [stdio] -Dcc=g++
  [stdio] -Dcc=g++ -Duselongdouble
  [stdio] -Dcc=g++ -Duse64bitall DEBUGGING
~~ ../t/op/goto_xs.t ........................................... FAILED Non-zero exit status: 2 No plan found in TAP output
  [stdio] -Dcc=g++ -Duse64bitall
  [stdio] -Dcc=g++ -Duselongdouble DEBUGGING
  [stdio] -Dcc=g++ DEBUGGING
  [stdio] -Dcc=g++
  [stdio] -Dcc=g++ -Duselongdouble
  [stdio] -Dcc=g++ -Duse64bitall DEBUGGING
~~ ../ext/FileCache/t/01open.t ................................. FAILED Non-zero exit status: 25 Bad plan.  You planned 1 tests but ran 0.
  [stdio] -Dcc=g++ -Duse64bitall
  [stdio] -Dcc=g++ -Duselongdouble DEBUGGING
  [stdio] -Dcc=g++ DEBUGGING
  [stdio] -Dcc=g++
  [stdio] -Dcc=g++ -Duselongdouble
  [stdio] -Dcc=g++ -Duse64bitall DEBUGGING
~~ ../t/uni/upper.t ............................................ FAILED Non-zero exit status: 2 No plan found in TAP output
  [stdio] -Dcc=g++ -Duse64bitall
  [stdio] -Dcc=g++ -Duselongdouble DEBUGGING
  [stdio] -Dcc=g++ DEBUGGING
  [stdio] -Dcc=g++
  [stdio] -Dcc=g++ -Duselongdouble
  [stdio] -Dcc=g++ -Duse64bitall DEBUGGING
~~ ../t/op/undef.t ............................................. FAILED Non-zero exit status: 2 No plan found in TAP output
  [stdio] -Dcc=g++ -Duse64bitall
  [stdio] -Dcc=g++ -Duselongdouble DEBUGGING
  [stdio] -Dcc=g++ DEBUGGING
  [stdio] -Dcc=g++
  [stdio] -Dcc=g++ -Duselongdouble
  [stdio] -Dcc=g++ -Duse64bitall DEBUGGING
~~ ../cpan/ExtUtils-MakeMaker/t/03-xsstatic.t .................. FAILED 5 Non-zero exit status: 6
  [stdio] -Dcc=g++ -Duselongdouble DEBUGGING
  [stdio] -Dcc=g++ -Duselongdouble
~~ ../t/porting/customized.t ................................... FAILED Non-zero exit status: 2 No plan found in TAP output
  [stdio] -Dcc=g++ -Duse64bitall
  [stdio] -Dcc=g++ -Duselongdouble DEBUGGING
  [stdio] -Dcc=g++ DEBUGGING
  [stdio] -Dcc=g++
  [stdio] -Dcc=g++ -Duselongdouble
  [stdio] -Dcc=g++ -Duse64bitall DEBUGGING
~~ ../t/op/tie.t ............................................... FAILED Non-zero exit status: 2 No plan found in TAP output
  [stdio] -Dcc=g++ -Duse64bitall
  [stdio] -Dcc=g++ -Duselongdouble DEBUGGING
  [stdio] -Dcc=g++ DEBUGGING
  [stdio] -Dcc=g++
  [stdio] -Dcc=g++ -Duselongdouble
  [stdio] -Dcc=g++ -Duse64bitall DEBUGGING
~~ ../cpan/Digest-MD5/t/files.t ................................ FAILED 2
  [stdio] -Dcc=g++ -Duse64bitall
  [stdio] -Dcc=g++ -Duselongdouble DEBUGGING
  [stdio] -Dcc=g++ DEBUGGING
  [stdio] -Dcc=g++
  [stdio] -Dcc=g++ -Duselongdouble
  [stdio] -Dcc=g++ -Duse64bitall DEBUGGING
~~ ../dist/threads-shared/t/waithires.t ........................ FAILED Non-zero exit status: 2 No plan found in TAP output
  [stdio] -Dcc=g++ -Duse64bitall
  [stdio] -Dcc=g++ -Duselongdouble DEBUGGING
  [stdio] -Dcc=g++ DEBUGGING
  [stdio] -Dcc=g++
  [stdio] -Dcc=g++ -Duselongdouble
  [stdio] -Dcc=g++ -Duse64bitall DEBUGGING
~~ ../t/run/script.t ........................................... FAILED Non-zero exit status: 2 No plan found in TAP output
  [stdio] -Dcc=g++ -Duse64bitall
  [stdio] -Dcc=g++ -Duselongdouble DEBUGGING
  [stdio] -Dcc=g++ DEBUGGING
  [stdio] -Dcc=g++
  [stdio] -Dcc=g++ -Duselongdouble
  [stdio] -Dcc=g++ -Duse64bitall DEBUGGING
~~ ../t/io/socket.t ............................................ FAILED Non-zero exit status: 2 No plan found in TAP output
  [stdio] -Dcc=g++ -Duse64bitall
  [stdio] -Dcc=g++ -Duselongdouble DEBUGGING
  [stdio] -Dcc=g++ DEBUGGING
  [stdio] -Dcc=g++
  [stdio] -Dcc=g++ -Duselongdouble
  [stdio] -Dcc=g++ -Duse64bitall DEBUGGING
~~ ../lib/open.t ............................................... FAILED Non-zero exit status: 2 No plan found in TAP output
  [stdio] -Dcc=g++ -Duse64bitall
  [stdio] -Dcc=g++ -Duselongdouble DEBUGGING
  [stdio] -Dcc=g++ DEBUGGING
  [stdio] -Dcc=g++
  [stdio] -Dcc=g++ -Duselongdouble
  [stdio] -Dcc=g++ -Duse64bitall DEBUGGING
~~ ../ext/File-Glob/t/taint.t .................................. FAILED Non-zero exit status: 2 No plan found in TAP output
  [stdio] -Dcc=g++ -Duse64bitall
  [stdio] -Dcc=g++ -Duselongdouble DEBUGGING
  [stdio] -Dcc=g++ DEBUGGING
  [stdio] -Dcc=g++
  [stdio] -Dcc=g++ -Duselongdouble
  [stdio] -Dcc=g++ -Duse64bitall DEBUGGING
~~ ../t/re/pat_special_cc_thr.t ................................ FAILED Non-zero exit status: 2 No plan found in TAP output
  [stdio] -Dcc=g++ -Duse64bitall
  [stdio] -Dcc=g++ -Duselongdouble DEBUGGING
  [stdio] -Dcc=g++ DEBUGGING
  [stdio] -Dcc=g++
  [stdio] -Dcc=g++ -Duselongdouble
  [stdio] -Dcc=g++ -Duse64bitall DEBUGGING
~~ ../t/re/reg_email.t ......................................... FAILED Non-zero exit status: 2 No plan found in TAP output
  [stdio] -Dcc=g++ -Duse64bitall
  [stdio] -Dcc=g++ -Duselongdouble DEBUGGING
  [stdio] -Dcc=g++ DEBUGGING
  [stdio] -Dcc=g++
  [stdio] -Dcc=g++ -Duselongdouble
  [stdio] -Dcc=g++ -Duse64bitall DEBUGGING
~~ ../t/op/require_errors.t .................................... FAILED Non-zero exit status: 2 No plan found in TAP output
  [stdio] -Dcc=g++ -Duse64bitall
  [stdio] -Dcc=g++ -Duselongdouble DEBUGGING
  [stdio] -Dcc=g++ DEBUGGING
  [stdio] -Dcc=g++
  [stdio] -Dcc=g++ -Duselongdouble
  [stdio] -Dcc=g++ -Duse64bitall DEBUGGING
~~ ../t/op/push.t .............................................. FAILED Non-zero exit status: 2 No plan found in TAP output
  [stdio] -Dcc=g++ -Duse64bitall
  [stdio] -Dcc=g++ -Duselongdouble DEBUGGING
  [stdio] -Dcc=g++ DEBUGGING
  [stdio] -Dcc=g++
  [stdio] -Dcc=g++ -Duselongdouble
  [stdio] -Dcc=g++ -Duse64bitall DEBUGGING
~~ ../lib/universal.t .......................................... FAILED Non-zero exit status: 2 No plan found in TAP output
  [stdio] -Dcc=g++ -Duse64bitall
  [stdio] -Dcc=g++ -Duselongdouble DEBUGGING
  [stdio] -Dcc=g++ DEBUGGING
  [stdio] -Dcc=g++
  [stdio] -Dcc=g++ -Duselongdouble
  [stdio] -Dcc=g++ -Duse64bitall DEBUGGING
~~ ../t/op/sprintf2.t .......................................... FAILED Non-zero exit status: 2 No plan found in TAP output
  [stdio] -Dcc=g++ -Duse64bitall
  [stdio] -Dcc=g++ -Duselongdouble DEBUGGING
  [stdio] -Dcc=g++ DEBUGGING
  [stdio] -Dcc=g++
  [stdio] -Dcc=g++ -Duselongdouble
  [stdio] -Dcc=g++ -Duse64bitall DEBUGGING
~~ ../t/op/utf8magic.t ......................................... FAILED Non-zero exit status: 2 No plan found in TAP output
  [stdio] -Dcc=g++ -Duse64bitall
  [stdio] -Dcc=g++ -Duselongdouble DEBUGGING
  [stdio] -Dcc=g++ DEBUGGING
  [stdio] -Dcc=g++
  [stdio] -Dcc=g++ -Duselongdouble
  [stdio] -Dcc=g++ -Duse64bitall DEBUGGING
~~ ../cpan/Compress-Raw-Bzip2/t/01bzip2.t ...................... FAILED Non-zero exit status: 2 Bad plan.  You planned 173 tests but ran 1.
  [stdio] -Dcc=g++ -Duse64bitall
  [stdio] -Dcc=g++ -Duselongdouble DEBUGGING
  [stdio] -Dcc=g++ DEBUGGING
  [stdio] -Dcc=g++
  [stdio] -Dcc=g++ -Duselongdouble
  [stdio] -Dcc=g++ -Duse64bitall DEBUGGING
~~ ../dist/Devel-PPPort/t/warn.t ............................... FAILED 4
  [stdio] -Dcc=g++ -Duse64bitall
  [stdio] -Dcc=g++ -Duselongdouble DEBUGGING
  [stdio] -Dcc=g++ DEBUGGING
  [stdio] -Dcc=g++
  [stdio] -Dcc=g++ -Duselongdouble
  [stdio] -Dcc=g++ -Duse64bitall DEBUGGING
~~ ../t/op/state.t ............................................. FAILED Non-zero exit status: 2 No plan found in TAP output
  [stdio] -Dcc=g++ -Duse64bitall
  [stdio] -Dcc=g++ -Duselongdouble DEBUGGING
  [stdio] -Dcc=g++ DEBUGGING
  [stdio] -Dcc=g++
  [stdio] -Dcc=g++ -Duselongdouble
  [stdio] -Dcc=g++ -Duse64bitall DEBUGGING
~~ ../t/op/coresubs.t .......................................... FAILED Non-zero exit status: 2 No plan found in TAP output
  [stdio] -Dcc=g++ -Duse64bitall
  [stdio] -Dcc=g++ -Duselongdouble DEBUGGING
  [stdio] -Dcc=g++ DEBUGGING
  [stdio] -Dcc=g++
  [stdio] -Dcc=g++ -Duselongdouble
  [stdio] -Dcc=g++ -Duse64bitall DEBUGGING
~~ ../dist/Exporter/t/Exporter.t ............................... FAILED Non-zero exit status: 255 No plan found in TAP output
  [stdio] -Dcc=g++ -Duse64bitall
  [stdio] -Dcc=g++ -Duselongdouble DEBUGGING
  [stdio] -Dcc=g++ DEBUGGING
  [stdio] -Dcc=g++
  [stdio] -Dcc=g++ -Duselongdouble
  [stdio] -Dcc=g++ -Duse64bitall DEBUGGING
~~ ../dist/Storable/t/weak.t ................................... FAILED Non-zero exit status: 25
  [stdio] -Dcc=g++ -Duse64bitall
  [stdio] -Dcc=g++
  [stdio] -Dcc=g++ -Duselongdouble
~~ ../t/mro/inconsistent_c3_utf8.t ............................. FAILED Non-zero exit status: 2 No plan found in TAP output
  [stdio] -Dcc=g++ -Duse64bitall
  [stdio] -Dcc=g++ -Duselongdouble DEBUGGING
  [stdio] -Dcc=g++ DEBUGGING
  [stdio] -Dcc=g++
  [stdio] -Dcc=g++ -Duselongdouble
  [stdio] -Dcc=g++ -Duse64bitall DEBUGGING
~~ ../ext/B/t/optree_check.t ................................... FAILED Non-zero exit status: 255 No plan found in TAP output
  [stdio] -Dcc=g++ -Duse64bitall
  [stdio] -Dcc=g++ -Duselongdouble DEBUGGING
  [stdio] -Dcc=g++ DEBUGGING
  [stdio] -Dcc=g++
  [stdio] -Dcc=g++ -Duselongdouble
  [stdio] -Dcc=g++ -Duse64bitall DEBUGGING
~~ ../lib/overload.t ........................................... FAILED Non-zero exit status: 255 Bad plan.  You planned 5363 tests but ran 137.
  [stdio] -Dcc=g++ -Duse64bitall
  [stdio] -Dcc=g++ -Duselongdouble DEBUGGING
  [stdio] -Dcc=g++ DEBUGGING
  [stdio] -Dcc=g++
  [stdio] -Dcc=g++ -Duselongdouble
  [stdio] -Dcc=g++ -Duse64bitall DEBUGGING
~~ ../t/op/utftaint.t .......................................... FAILED Non-zero exit status: 2 No plan found in TAP output
  [stdio] -Dcc=g++ -Duse64bitall
  [stdio] -Dcc=g++ -Duselongdouble DEBUGGING
  [stdio] -Dcc=g++ DEBUGGING
  [stdio] -Dcc=g++
  [stdio] -Dcc=g++ -Duselongdouble
  [stdio] -Dcc=g++ -Duse64bitall DEBUGGING
~~ ../t/uni/goto.t ............................................. FAILED Non-zero exit status: 2 No plan found in TAP output
  [stdio] -Dcc=g++ -Duse64bitall
  [stdio] -Dcc=g++ -Duselongdouble DEBUGGING
  [stdio] -Dcc=g++ DEBUGGING
  [stdio] -Dcc=g++
  [stdio] -Dcc=g++ -Duselongdouble
  [stdio] -Dcc=g++ -Duse64bitall DEBUGGING
~~ ../t/op/lop.t ............................................... FAILED Non-zero exit status: 2 No plan found in TAP output
  [stdio] -Dcc=g++ -Duse64bitall
  [stdio] -Dcc=g++ -Duselongdouble DEBUGGING
  [stdio] -Dcc=g++ DEBUGGING
  [stdio] -Dcc=g++
  [stdio] -Dcc=g++ -Duselongdouble
  [stdio] -Dcc=g++ -Duse64bitall DEBUGGING
~~ ../lib/locale_threads.t ..................................... FAILED Non-zero exit status: 2 No plan found in TAP output
  [stdio] -Dcc=g++ -Duse64bitall
  [stdio] -Dcc=g++ -Duselongdouble DEBUGGING
  [stdio] -Dcc=g++ DEBUGGING
  [stdio] -Dcc=g++
  [stdio] -Dcc=g++ -Duselongdouble
  [stdio] -Dcc=g++ -Duse64bitall DEBUGGING
~~ ../t/op/kvhslice.t .......................................... FAILED Non-zero exit status: 2 No plan found in TAP output
  [stdio] -Dcc=g++ -Duse64bitall
  [stdio] -Dcc=g++ -Duselongdouble DEBUGGING
  [stdio] -Dcc=g++ DEBUGGING
  [stdio] -Dcc=g++
  [stdio] -Dcc=g++ -Duselongdouble
  [stdio] -Dcc=g++ -Duse64bitall DEBUGGING
~~ ../t/io/semctl.t ............................................ FAILED Non-zero exit status: 2 No plan found in TAP output
  [stdio] -Dcc=g++ -Duse64bitall
  [stdio] -Dcc=g++ -Duselongdouble DEBUGGING
  [stdio] -Dcc=g++ DEBUGGING
  [stdio] -Dcc=g++
  [stdio] -Dcc=g++ -Duselongdouble
  [stdio] -Dcc=g++ -Duse64bitall DEBUGGING
~~ ../t/re/regexp_unicode_prop_thr.t ........................... FAILED Non-zero exit status: 2 No plan found in TAP output
  [stdio] -Dcc=g++ -Duse64bitall
  [stdio] -Dcc=g++ -Duselongdouble DEBUGGING
  [stdio] -Dcc=g++ DEBUGGING
  [stdio] -Dcc=g++
  [stdio] -Dcc=g++ -Duselongdouble
  [stdio] -Dcc=g++ -Duse64bitall DEBUGGING
~~ ../dist/Storable/t/restrict.t ............................... FAILED 1 79 115 131 147 163 179 195 211 227 243 259 275 291 Non-zero exit status: 176
  [stdio] -Dcc=g++ -Duse64bitall
  [stdio] -Dcc=g++ -Duselongdouble DEBUGGING
  [stdio] -Dcc=g++ DEBUGGING
  [stdio] -Dcc=g++
  [stdio] -Dcc=g++ -Duselongdouble
  [stdio] -Dcc=g++ -Duse64bitall DEBUGGING
~~ ../t/run/noswitch.t ......................................... FAILED Non-zero exit status: 2 No plan found in TAP output
  [stdio] -Dcc=g++ -Duse64bitall
  [stdio] -Dcc=g++ -Duselongdouble DEBUGGING
  [stdio] -Dcc=g++ DEBUGGING
  [stdio] -Dcc=g++
  [stdio] -Dcc=g++ -Duselongdouble
  [stdio] -Dcc=g++ -Duse64bitall DEBUGGING
~~ ../t/op/aassign.t ........................................... FAILED Non-zero exit status: 2 No plan found in TAP output
  [stdio] -Dcc=g++ -Duse64bitall
  [stdio] -Dcc=g++ -Duselongdouble DEBUGGING
  [stdio] -Dcc=g++ DEBUGGING
  [stdio] -Dcc=g++
  [stdio] -Dcc=g++ -Duselongdouble
  [stdio] -Dcc=g++ -Duse64bitall DEBUGGING
~~ ../lib/commonsense.t ........................................ FAILED Non-zero exit status: 2 No plan found in TAP output
  [stdio] -Dcc=g++ -Duse64bitall
  [stdio] -Dcc=g++ -Duselongdouble DEBUGGING
  [stdio] -Dcc=g++ DEBUGGING
  [stdio] -Dcc=g++
  [stdio] -Dcc=g++ -Duselongdouble
  [stdio] -Dcc=g++ -Duse64bitall DEBUGGING
~~ ../lib/Tie/Array/push.t ..................................... FAILED Non-zero exit status: 2 No plan found in TAP output
  [stdio] -Dcc=g++ -Duse64bitall
  [stdio] -Dcc=g++ -Duselongdouble DEBUGGING
  [stdio] -Dcc=g++ DEBUGGING
  [stdio] -Dcc=g++
  [stdio] -Dcc=g++ -Duselongdouble
  [stdio] -Dcc=g++ -Duse64bitall DEBUGGING
~~ ../t/run/switchI.t .......................................... FAILED Non-zero exit status: 2 No plan found in TAP output
  [stdio] -Dcc=g++ -Duse64bitall
  [stdio] -Dcc=g++ -Duselongdouble DEBUGGING
  [stdio] -Dcc=g++ DEBUGGING
  [stdio] -Dcc=g++
  [stdio] -Dcc=g++ -Duselongdouble
  [stdio] -Dcc=g++ -Duse64bitall DEBUGGING
~~ ../t/op/heredoc.t ........................................... FAILED Non-zero exit status: 2 No plan found in TAP output
  [stdio] -Dcc=g++ -Duse64bitall
  [stdio] -Dcc=g++ -Duselongdouble DEBUGGING
  [stdio] -Dcc=g++ DEBUGGING
  [stdio] -Dcc=g++
  [stdio] -Dcc=g++ -Duselongdouble
  [stdio] -Dcc=g++ -Duse64bitall DEBUGGING
~~ ../t/porting/readme.t ....................................... FAILED Non-zero exit status: 2 No plan found in TAP output
  [stdio] -Dcc=g++ -Duse64bitall
  [stdio] -Dcc=g++ -Duselongdouble DEBUGGING
  [stdio] -Dcc=g++ DEBUGGING
  [stdio] -Dcc=g++
  [stdio] -Dcc=g++ -Duselongdouble
  [stdio] -Dcc=g++ -Duse64bitall DEBUGGING
~~ ../t/re/pat_re_eval_thr.t ................................... FAILED Non-zero exit status: 2 No plan found in TAP output
  [stdio] -Dcc=g++ -Duse64bitall
  [stdio] -Dcc=g++ -Duselongdouble DEBUGGING
  [stdio] -Dcc=g++ DEBUGGING
  [stdio] -Dcc=g++
  [stdio] -Dcc=g++ -Duselongdouble
  [stdio] -Dcc=g++ -Duse64bitall DEBUGGING
~~ ../t/uni/bless.t ............................................ FAILED Non-zero exit status: 2 No plan found in TAP output
  [stdio] -Dcc=g++ -Duse64bitall
  [stdio] -Dcc=g++ -Duselongdouble DEBUGGING
  [stdio] -Dcc=g++ DEBUGGING
  [stdio] -Dcc=g++
  [stdio] -Dcc=g++ -Duselongdouble
  [stdio] -Dcc=g++ -Duse64bitall DEBUGGING
~~ ../ext/B/t/optree_varinit.t ................................. FAILED 3 30
  [stdio] -Dcc=g++ -Duse64bitall
  [stdio] -Dcc=g++ -Duselongdouble DEBUGGING
  [stdio] -Dcc=g++ DEBUGGING
  [stdio] -Dcc=g++
  [stdio] -Dcc=g++ -Duselongdouble
  [stdio] -Dcc=g++ -Duse64bitall DEBUGGING
~~ ../dist/Storable/t/regexp.t ................................. FAILED Bad plan.  You planned 64 tests but ran 4.
  [stdio] -Dcc=g++ -Duselongdouble DEBUGGING
  [stdio] -Dcc=g++ DEBUGGING
  [stdio] -Dcc=g++ -Duse64bitall DEBUGGING
~~ ../dist/Attribute-Handlers/t/multi.t ........................ FAILED Non-zero exit status: 255 No plan found in TAP output
  [stdio] -Dcc=g++ -Duse64bitall
  [stdio] -Dcc=g++ -Duselongdouble DEBUGGING
  [stdio] -Dcc=g++ DEBUGGING
  [stdio] -Dcc=g++
  [stdio] -Dcc=g++ -Duselongdouble
  [stdio] -Dcc=g++ -Duse64bitall DEBUGGING
~~ ../t/re/pat_thr.t ........................................... FAILED Non-zero exit status: 2 No plan found in TAP output
  [stdio] -Dcc=g++ -Duse64bitall
  [stdio] -Dcc=g++ -Duselongdouble DEBUGGING
  [stdio] -Dcc=g++ DEBUGGING
  [stdio] -Dcc=g++
  [stdio] -Dcc=g++ -Duselongdouble
  [stdio] -Dcc=g++ -Duse64bitall DEBUGGING
~~ ../t/io/shm.t ............................................... FAILED Non-zero exit status: 2 No plan found in TAP output
  [stdio] -Dcc=g++ -Duse64bitall
  [stdio] -Dcc=g++ -Duselongdouble DEBUGGING
  [stdio] -Dcc=g++ DEBUGGING
  [stdio] -Dcc=g++
  [stdio] -Dcc=g++ -Duselongdouble
  [stdio] -Dcc=g++ -Duse64bitall DEBUGGING
~~ ../ext/POSIX/t/math.t ....................................... FAILED Non-zero exit status: 1 No plan found in TAP output
  [stdio] -Dcc=g++ -Duselongdouble DEBUGGING
  [stdio] -Dcc=g++ -Duselongdouble
~~ ../ext/XS-APItest/t/locale.t ................................ FAILED Non-zero exit status: 2 No plan found in TAP output
  [stdio] -Dcc=g++ -Duse64bitall
  [stdio] -Dcc=g++ -Duselongdouble DEBUGGING
  [stdio] -Dcc=g++ DEBUGGING
  [stdio] -Dcc=g++
  [stdio] -Dcc=g++ -Duselongdouble
  [stdio] -Dcc=g++ -Duse64bitall DEBUGGING
~~ ../t/io/fflush.t ............................................ FAILED Non-zero exit status: 2 No plan found in TAP output
  [stdio] -Dcc=g++ -Duse64bitall
  [stdio] -Dcc=g++ -Duselongdouble DEBUGGING
  [stdio] -Dcc=g++ DEBUGGING
  [stdio] -Dcc=g++
  [stdio] -Dcc=g++ -Duselongdouble
  [stdio] -Dcc=g++ -Duse64bitall DEBUGGING
~~ ../t/op/die.t ............................................... FAILED Non-zero exit status: 2 No plan found in TAP output
  [stdio] -Dcc=g++ -Duse64bitall
  [stdio] -Dcc=g++ -Duselongdouble DEBUGGING
  [stdio] -Dcc=g++ DEBUGGING
  [stdio] -Dcc=g++
  [stdio] -Dcc=g++ -Duselongdouble
  [stdio] -Dcc=g++ -Duse64bitall DEBUGGING
~~ ../t/op/yadayada.t .......................................... FAILED Non-zero exit status: 2 No plan found in TAP output
  [stdio] -Dcc=g++ -Duse64bitall
  [stdio] -Dcc=g++ -Duselongdouble DEBUGGING
  [stdio] -Dcc=g++ DEBUGGING
  [stdio] -Dcc=g++
  [stdio] -Dcc=g++ -Duselongdouble
  [stdio] -Dcc=g++ -Duse64bitall DEBUGGING
~~ ../t/op/lexsub.t ............................................ FAILED Non-zero exit status: 2 No plan found in TAP output
  [stdio] -Dcc=g++ -Duse64bitall
  [stdio] -Dcc=g++ -Duselongdouble DEBUGGING
  [stdio] -Dcc=g++ DEBUGGING
  [stdio] -Dcc=g++
  [stdio] -Dcc=g++ -Duselongdouble
  [stdio] -Dcc=g++ -Duse64bitall DEBUGGING
~~ ../t/op/readdir.t ........................................... FAILED Non-zero exit status: 2 No plan found in TAP output
  [stdio] -Dcc=g++ -Duse64bitall
  [stdio] -Dcc=g++ -Duselongdouble DEBUGGING
  [stdio] -Dcc=g++ DEBUGGING
  [stdio] -Dcc=g++
  [stdio] -Dcc=g++ -Duselongdouble
  [stdio] -Dcc=g++ -Duse64bitall DEBUGGING
~~ ../t/mro/isa_aliases.t ...................................... FAILED Non-zero exit status: 2 No plan found in TAP output
  [stdio] -Dcc=g++ -Duse64bitall
  [stdio] -Dcc=g++ -Duselongdouble DEBUGGING
  [stdio] -Dcc=g++ DEBUGGING
  [stdio] -Dcc=g++
  [stdio] -Dcc=g++ -Duselongdouble
  [stdio] -Dcc=g++ -Duse64bitall DEBUGGING
~~ ../t/op/symbolcache.t ....................................... FAILED Non-zero exit status: 2 No plan found in TAP output
  [stdio] -Dcc=g++ -Duse64bitall
  [stdio] -Dcc=g++ -Duselongdouble DEBUGGING
  [stdio] -Dcc=g++ DEBUGGING
  [stdio] -Dcc=g++
  [stdio] -Dcc=g++ -Duselongdouble
  [stdio] -Dcc=g++ -Duse64bitall DEBUGGING
~~ ../t/run/fresh_perl.t ....................................... FAILED Non-zero exit status: 2 No plan found in TAP output
  [stdio] -Dcc=g++ -Duse64bitall
  [stdio] -Dcc=g++ -Duselongdouble DEBUGGING
  [stdio] -Dcc=g++ DEBUGGING
  [stdio] -Dcc=g++
  [stdio] -Dcc=g++ -Duselongdouble
  [stdio] -Dcc=g++ -Duse64bitall DEBUGGING
~~ ../t/op/threads.t ........................................... FAILED Non-zero exit status: 2 No plan found in TAP output
  [stdio] -Dcc=g++ -Duse64bitall
  [stdio] -Dcc=g++ -Duselongdouble DEBUGGING
  [stdio] -Dcc=g++ DEBUGGING
  [stdio] -Dcc=g++
  [stdio] -Dcc=g++ -Duselongdouble
  [stdio] -Dcc=g++ -Duse64bitall DEBUGGING
~~ ../t/op/negate.t ............................................ FAILED Non-zero exit status: 2 No plan found in TAP output
  [stdio] -Dcc=g++ -Duse64bitall
  [stdio] -Dcc=g++ -Duselongdouble DEBUGGING
  [stdio] -Dcc=g++ DEBUGGING
  [stdio] -Dcc=g++
  [stdio] -Dcc=g++ -Duselongdouble
  [stdio] -Dcc=g++ -Duse64bitall DEBUGGING
~~ ../t/op/infnan.t ............................................ FAILED Non-zero exit status: 2 No plan found in TAP output
  [stdio] -Dcc=g++ -Duse64bitall
  [stdio] -Dcc=g++ -Duselongdouble DEBUGGING
  [stdio] -Dcc=g++ DEBUGGING
  [stdio] -Dcc=g++
  [stdio] -Dcc=g++ -Duselongdouble
  [stdio] -Dcc=g++ -Duse64bitall DEBUGGING
~~ ../ext/Hash-Util/t/Util.t ................................... FAILED Non-zero exit status: 255 No plan found in TAP output
  [stdio] -Dcc=g++ -Duse64bitall
  [stdio] -Dcc=g++ -Duselongdouble DEBUGGING
  [stdio] -Dcc=g++ DEBUGGING
  [stdio] -Dcc=g++
  [stdio] -Dcc=g++ -Duselongdouble
  [stdio] -Dcc=g++ -Duse64bitall DEBUGGING
~~ ../t/op/warn.t .............................................. FAILED Non-zero exit status: 2 No plan found in TAP output
  [stdio] -Dcc=g++ -Duse64bitall
  [stdio] -Dcc=g++ -Duselongdouble DEBUGGING
  [stdio] -Dcc=g++ DEBUGGING
  [stdio] -Dcc=g++
  [stdio] -Dcc=g++ -Duselongdouble
  [stdio] -Dcc=g++ -Duse64bitall DEBUGGING
~~ ../t/op/reverse.t ........................................... FAILED Non-zero exit status: 2 No plan found in TAP output
  [stdio] -Dcc=g++ -Duse64bitall
  [stdio] -Dcc=g++ -Duselongdouble DEBUGGING
  [stdio] -Dcc=g++ DEBUGGING
  [stdio] -Dcc=g++
  [stdio] -Dcc=g++ -Duselongdouble
  [stdio] -Dcc=g++ -Duse64bitall DEBUGGING
~~ ../ext/XS-APItest/t/call.t .................................. FAILED Non-zero exit status: 2 No plan found in TAP output
  [stdio] -Dcc=g++ -Duse64bitall
  [stdio] -Dcc=g++ -Duselongdouble DEBUGGING
  [stdio] -Dcc=g++ DEBUGGING
  [stdio] -Dcc=g++
  [stdio] -Dcc=g++ -Duselongdouble
  [stdio] -Dcc=g++ -Duse64bitall DEBUGGING
~~ ../t/run/switchF2.t ......................................... FAILED Non-zero exit status: 2 No plan found in TAP output
  [stdio] -Dcc=g++ -Duse64bitall
  [stdio] -Dcc=g++ -Duselongdouble DEBUGGING
  [stdio] -Dcc=g++ DEBUGGING
  [stdio] -Dcc=g++
  [stdio] -Dcc=g++ -Duselongdouble
  [stdio] -Dcc=g++ -Duse64bitall DEBUGGING
~~ ../cpan/Test-Simple/t/Test2/acceptance/try_it_fork.t ........ FAILED Non-zero exit status: 255 No plan found in TAP output
  [stdio] -Dcc=g++ -Duse64bitall
  [stdio] -Dcc=g++ -Duselongdouble DEBUGGING
  [stdio] -Dcc=g++ DEBUGGING
  [stdio] -Dcc=g++
  [stdio] -Dcc=g++ -Duselongdouble
  [stdio] -Dcc=g++ -Duse64bitall DEBUGGING
~~ ../lib/Tie/Array/stdpush.t .................................. FAILED Non-zero exit status: 2 No plan found in TAP output
  [stdio] -Dcc=g++ -Duse64bitall
  [stdio] -Dcc=g++ -Duselongdouble DEBUGGING
  [stdio] -Dcc=g++ DEBUGGING
  [stdio] -Dcc=g++
  [stdio] -Dcc=g++ -Duselongdouble
  [stdio] -Dcc=g++ -Duse64bitall DEBUGGING
~~ ../t/op/mydef.t ............................................. FAILED Non-zero exit status: 2 No plan found in TAP output
  [stdio] -Dcc=g++ -Duse64bitall
  [stdio] -Dcc=g++ -Duselongdouble DEBUGGING
  [stdio] -Dcc=g++ DEBUGGING
  [stdio] -Dcc=g++
  [stdio] -Dcc=g++ -Duselongdouble
  [stdio] -Dcc=g++ -Duse64bitall DEBUGGING
~~ ../cpan/Text-ParseWords/t/ParseWords.t ...................... FAILED Non-zero exit status: 255 Bad plan.  You planned 27 tests but ran 0.
  [stdio] -Dcc=g++ -Duse64bitall
  [stdio] -Dcc=g++ -Duselongdouble DEBUGGING
  [stdio] -Dcc=g++ DEBUGGING
  [stdio] -Dcc=g++
  [stdio] -Dcc=g++ -Duselongdouble
  [stdio] -Dcc=g++ -Duse64bitall DEBUGGING
~~ ../t/op/threads-dirh.t ...................................... FAILED Non-zero exit status: 2 No plan found in TAP output
  [stdio] -Dcc=g++ -Duse64bitall
  [stdio] -Dcc=g++ -Duselongdouble DEBUGGING
  [stdio] -Dcc=g++ DEBUGGING
  [stdio] -Dcc=g++
  [stdio] -Dcc=g++ -Duselongdouble
  [stdio] -Dcc=g++ -Duse64bitall DEBUGGING
~~ ../t/re/reg_eval_scope.t .................................... FAILED Non-zero exit status: 2 No plan found in TAP output
  [stdio] -Dcc=g++ -Duse64bitall
  [stdio] -Dcc=g++ -Duselongdouble DEBUGGING
  [stdio] -Dcc=g++ DEBUGGING
  [stdio] -Dcc=g++
  [stdio] -Dcc=g++ -Duselongdouble
  [stdio] -Dcc=g++ -Duse64bitall DEBUGGING
~~ ../cpan/ExtUtils-MakeMaker/t/cd.t ........................... FAILED Non-zero exit status: 255 Bad plan.  You planned 4 tests but ran 0.
  [stdio] -Dcc=g++ -Duse64bitall
  [stdio] -Dcc=g++ -Duselongdouble DEBUGGING
  [stdio] -Dcc=g++ DEBUGGING
  [stdio] -Dcc=g++
  [stdio] -Dcc=g++ -Duselongdouble
  [stdio] -Dcc=g++ -Duse64bitall DEBUGGING
~~ ../dist/IO/t/io_file_export.t ............................... FAILED Non-zero exit status: 2 No plan found in TAP output
  [stdio] -Dcc=g++ -Duse64bitall
  [stdio] -Dcc=g++ -Duselongdouble DEBUGGING
  [stdio] -Dcc=g++ DEBUGGING
  [stdio] -Dcc=g++
  [stdio] -Dcc=g++ -Duselongdouble
  [stdio] -Dcc=g++ -Duse64bitall DEBUGGING
~~ ../t/op/chop.t .............................................. FAILED Non-zero exit status: 2 No plan found in TAP output
  [stdio] -Dcc=g++ -Duse64bitall
  [stdio] -Dcc=g++ -Duselongdouble DEBUGGING
  [stdio] -Dcc=g++ DEBUGGING
  [stdio] -Dcc=g++
  [stdio] -Dcc=g++ -Duselongdouble
  [stdio] -Dcc=g++ -Duse64bitall DEBUGGING
~~ ../t/porting/checkcfgvar.t .................................. FAILED Non-zero exit status: 2 No plan found in TAP output
  [stdio] -Dcc=g++ -Duse64bitall
  [stdio] -Dcc=g++ -Duselongdouble DEBUGGING
  [stdio] -Dcc=g++ DEBUGGING
  [stdio] -Dcc=g++
  [stdio] -Dcc=g++ -Duselongdouble
  [stdio] -Dcc=g++ -Duse64bitall DEBUGGING
~~ ../cpan/Pod-Checker/t/pod/selfcheck.t ....................... FAILED Non-zero exit status: 255 No plan found in TAP output
  [stdio] -Dcc=g++ -Duse64bitall
  [stdio] -Dcc=g++ -Duselongdouble DEBUGGING
  [stdio] -Dcc=g++ DEBUGGING
  [stdio] -Dcc=g++
  [stdio] -Dcc=g++ -Duselongdouble
  [stdio] -Dcc=g++ -Duse64bitall DEBUGGING
~~ ../lib/locale.t ............................................. FAILED Non-zero exit status: 255 No plan found in TAP output
  [stdio] -Dcc=g++ -Duse64bitall
  [stdio] -Dcc=g++ -Duselongdouble DEBUGGING
  [stdio] -Dcc=g++ DEBUGGING
  [stdio] -Dcc=g++
  [stdio] -Dcc=g++ -Duselongdouble
  [stdio] -Dcc=g++ -Duse64bitall DEBUGGING
~~ ../dist/Storable/t/regexp.t ................................. FAILED Non-zero exit status: 255 Bad plan.  You planned 64 tests but ran 4.
  [stdio] -Dcc=g++ -Duse64bitall
  [stdio] -Dcc=g++
  [stdio] -Dcc=g++ -Duselongdouble
~~ ../t/re/pat_advanced.t ...................................... FAILED Non-zero exit status: 2 No plan found in TAP output
  [stdio] -Dcc=g++ -Duse64bitall
  [stdio] -Dcc=g++ -Duselongdouble DEBUGGING
  [stdio] -Dcc=g++ DEBUGGING
  [stdio] -Dcc=g++
  [stdio] -Dcc=g++ -Duselongdouble
  [stdio] -Dcc=g++ -Duse64bitall DEBUGGING
~~ ../t/io/dup.t ............................................... FAILED Non-zero exit status: 2 No plan found in TAP output
  [stdio] -Dcc=g++ -Duse64bitall
  [stdio] -Dcc=g++ -Duselongdouble DEBUGGING
  [stdio] -Dcc=g++ DEBUGGING
  [stdio] -Dcc=g++
  [stdio] -Dcc=g++ -Duselongdouble
  [stdio] -Dcc=g++ -Duse64bitall DEBUGGING
~~ ../t/op/alarm.t ............................................. FAILED Non-zero exit status: 2 No plan found in TAP output
  [stdio] -Dcc=g++ -Duse64bitall
  [stdio] -Dcc=g++ -Duselongdouble DEBUGGING
  [stdio] -Dcc=g++ DEBUGGING
  [stdio] -Dcc=g++
  [stdio] -Dcc=g++ -Duselongdouble
  [stdio] -Dcc=g++ -Duse64bitall DEBUGGING
~~ ../ext/B/t/optree_specials.t ................................ FAILED 3
  [stdio] -Dcc=g++ -Duse64bitall
  [stdio] -Dcc=g++ -Duselongdouble DEBUGGING
  [stdio] -Dcc=g++ DEBUGGING
  [stdio] -Dcc=g++
  [stdio] -Dcc=g++ -Duselongdouble
  [stdio] -Dcc=g++ -Duse64bitall DEBUGGING
~~ ../lib/meta_notation.t ...................................... FAILED Non-zero exit status: 2 No plan found in TAP output
  [stdio] -Dcc=g++ -Duse64bitall
  [stdio] -Dcc=g++ -Duselongdouble DEBUGGING
  [stdio] -Dcc=g++ DEBUGGING
  [stdio] -Dcc=g++
  [stdio] -Dcc=g++ -Duselongdouble
  [stdio] -Dcc=g++ -Duse64bitall DEBUGGING
~~ ../t/mro/package_aliases.t .................................. FAILED Non-zero exit status: 2 No plan found in TAP output
  [stdio] -Dcc=g++ -Duse64bitall
  [stdio] -Dcc=g++ -Duselongdouble DEBUGGING
  [stdio] -Dcc=g++ DEBUGGING
  [stdio] -Dcc=g++
  [stdio] -Dcc=g++ -Duselongdouble
  [stdio] -Dcc=g++ -Duse64bitall DEBUGGING
~~ ../ext/FileCache/t/05override.t ............................. FAILED Non-zero exit status: 25 Bad plan.  You planned 1 tests but ran 0.
  [stdio] -Dcc=g++ -Duse64bitall
  [stdio] -Dcc=g++ -Duselongdouble DEBUGGING
  [stdio] -Dcc=g++ DEBUGGING
  [stdio] -Dcc=g++
  [stdio] -Dcc=g++ -Duselongdouble
  [stdio] -Dcc=g++ -Duse64bitall DEBUGGING
~~ ../cpan/Compress-Raw-Zlib/t/18lvalue.t ...................... FAILED Non-zero exit status: 255 No plan found in TAP output
  [stdio] -Dcc=g++ -Duse64bitall
  [stdio] -Dcc=g++ -Duselongdouble DEBUGGING
  [stdio] -Dcc=g++ DEBUGGING
  [stdio] -Dcc=g++
  [stdio] -Dcc=g++ -Duselongdouble
  [stdio] -Dcc=g++ -Duse64bitall DEBUGGING
~~ ../t/op/sleep.t ............................................. FAILED Non-zero exit status: 2 No plan found in TAP output
  [stdio] -Dcc=g++ -Duse64bitall
  [stdio] -Dcc=g++ -Duselongdouble DEBUGGING
  [stdio] -Dcc=g++ DEBUGGING
  [stdio] -Dcc=g++
  [stdio] -Dcc=g++ -Duselongdouble
  [stdio] -Dcc=g++ -Duse64bitall DEBUGGING
~~ ../t/porting/bench_selftest.t ............................... FAILED Non-zero exit status: 2 No plan found in TAP output
  [stdio] -Dcc=g++ -Duse64bitall
  [stdio] -Dcc=g++ -Duselongdouble DEBUGGING
  [stdio] -Dcc=g++ DEBUGGING
  [stdio] -Dcc=g++
  [stdio] -Dcc=g++ -Duselongdouble
  [stdio] -Dcc=g++ -Duse64bitall DEBUGGING
~~ ../t/re/script_run.t ........................................ FAILED Non-zero exit status: 2 No plan found in TAP output
  [stdio] -Dcc=g++ -Duse64bitall
  [stdio] -Dcc=g++ -Duselongdouble DEBUGGING
  [stdio] -Dcc=g++ DEBUGGING
  [stdio] -Dcc=g++
  [stdio] -Dcc=g++ -Duselongdouble
  [stdio] -Dcc=g++ -Duse64bitall DEBUGGING
~~ ../lib/warnings.t ........................................... FAILED Non-zero exit status: 2 No plan found in TAP output
  [stdio] -Dcc=g++ -Duse64bitall
  [stdio] -Dcc=g++ -Duselongdouble DEBUGGING
  [stdio] -Dcc=g++ DEBUGGING
  [stdio] -Dcc=g++
  [stdio] -Dcc=g++ -Duselongdouble
  [stdio] -Dcc=g++ -Duse64bitall DEBUGGING
~~ ../t/op/tr_latin1.t ......................................... FAILED Non-zero exit status: 2 No plan found in TAP output
  [stdio] -Dcc=g++ -Duse64bitall
  [stdio] -Dcc=g++ -Duselongdouble DEBUGGING
  [stdio] -Dcc=g++ DEBUGGING
  [stdio] -Dcc=g++
  [stdio] -Dcc=g++ -Duselongdouble
  [stdio] -Dcc=g++ -Duse64bitall DEBUGGING
~~ ../t/porting/maintainers.t .................................. FAILED Non-zero exit status: 2 No plan found in TAP output
  [stdio] -Dcc=g++ -Duse64bitall
  [stdio] -Dcc=g++ -Duselongdouble DEBUGGING
  [stdio] -Dcc=g++ DEBUGGING
  [stdio] -Dcc=g++
  [stdio] -Dcc=g++ -Duselongdouble
  [stdio] -Dcc=g++ -Duse64bitall DEBUGGING
~~ ../t/re/pat_rt_report_thr.t ................................. FAILED Non-zero exit status: 2 No plan found in TAP output
  [stdio] -Dcc=g++ -Duse64bitall
  [stdio] -Dcc=g++ -Duselongdouble DEBUGGING
  [stdio] -Dcc=g++ DEBUGGING
  [stdio] -Dcc=g++
  [stdio] -Dcc=g++ -Duselongdouble
  [stdio] -Dcc=g++ -Duse64bitall DEBUGGING
~~ ../t/op/override.t .......................................... FAILED Non-zero exit status: 2 No plan found in TAP output
  [stdio] -Dcc=g++ -Duse64bitall
  [stdio] -Dcc=g++ -Duselongdouble DEBUGGING
  [stdio] -Dcc=g++ DEBUGGING
  [stdio] -Dcc=g++
  [stdio] -Dcc=g++ -Duselongdouble
  [stdio] -Dcc=g++ -Duse64bitall DEBUGGING
~~ ../t/op/context.t ........................................... FAILED Non-zero exit status: 2 No plan found in TAP output
  [stdio] -Dcc=g++ -Duse64bitall
  [stdio] -Dcc=g++ -Duselongdouble DEBUGGING
  [stdio] -Dcc=g++ DEBUGGING
  [stdio] -Dcc=g++
  [stdio] -Dcc=g++ -Duselongdouble
  [stdio] -Dcc=g++ -Duse64bitall DEBUGGING
~~ ../dist/threads/t/err.t ..................................... FAILED Non-zero exit status: 2 No plan found in TAP output
  [stdio] -Dcc=g++ -Duse64bitall
  [stdio] -Dcc=g++ -Duselongdouble DEBUGGING
  [stdio] -Dcc=g++ DEBUGGING
  [stdio] -Dcc=g++
  [stdio] -Dcc=g++ -Duselongdouble
  [stdio] -Dcc=g++ -Duse64bitall DEBUGGING
~~ ../t/op/pos.t ............................................... FAILED Non-zero exit status: 2 No plan found in TAP output
  [stdio] -Dcc=g++ -Duse64bitall
  [stdio] -Dcc=g++ -Duselongdouble DEBUGGING
  [stdio] -Dcc=g++ DEBUGGING
  [stdio] -Dcc=g++
  [stdio] -Dcc=g++ -Duselongdouble
  [stdio] -Dcc=g++ -Duse64bitall DEBUGGING
~~ ../dist/Storable/t/downgrade.t .............................. FAILED 13-14 61-63 109-110 Non-zero exit status: 36
  [stdio] -Dcc=g++ -Duselongdouble DEBUGGING
~~ ../t/op/lc.t ................................................ FAILED Non-zero exit status: 2 No plan found in TAP output
  [stdio] -Dcc=g++ -Duse64bitall
  [stdio] -Dcc=g++ -Duselongdouble DEBUGGING
  [stdio] -Dcc=g++ DEBUGGING
  [stdio] -Dcc=g++
  [stdio] -Dcc=g++ -Duselongdouble
  [stdio] -Dcc=g++ -Duse64bitall DEBUGGING
~~ ../t/op/chr.t ............................................... FAILED Non-zero exit status: 2 No plan found in TAP output
  [stdio] -Dcc=g++ -Duse64bitall
  [stdio] -Dcc=g++ -Duselongdouble DEBUGGING
  [stdio] -Dcc=g++ DEBUGGING
  [stdio] -Dcc=g++
  [stdio] -Dcc=g++ -Duselongdouble
  [stdio] -Dcc=g++ -Duse64bitall DEBUGGING
~~ ../dist/Exporter/t/warn.t ................................... FAILED Non-zero exit status: 255 No plan found in TAP output
  [stdio] -Dcc=g++ -Duse64bitall
  [stdio] -Dcc=g++ -Duselongdouble DEBUGGING
  [stdio] -Dcc=g++ DEBUGGING
  [stdio] -Dcc=g++
  [stdio] -Dcc=g++ -Duselongdouble
  [stdio] -Dcc=g++ -Duse64bitall DEBUGGING
~~ ../t/re/pat_rt_report.t ..................................... FAILED Non-zero exit status: 2 No plan found in TAP output
  [stdio] -Dcc=g++ -Duse64bitall
  [stdio] -Dcc=g++ -Duselongdouble DEBUGGING
  [stdio] -Dcc=g++ DEBUGGING
  [stdio] -Dcc=g++
  [stdio] -Dcc=g++ -Duselongdouble
  [stdio] -Dcc=g++ -Duse64bitall DEBUGGING
~~ ../ext/POSIX/t/sigaction.t .................................. FAILED Non-zero exit status: 255 Bad plan.  You planned 36 tests but ran 0.
  [stdio] -Dcc=g++ -Duse64bitall
  [stdio] -Dcc=g++ -Duselongdouble DEBUGGING
  [stdio] -Dcc=g++ DEBUGGING
  [stdio] -Dcc=g++
  [stdio] -Dcc=g++ -Duselongdouble
  [stdio] -Dcc=g++ -Duse64bitall DEBUGGING
~~ ../t/op/bop.t ............................................... FAILED Non-zero exit status: 2 No plan found in TAP output
  [stdio] -Dcc=g++ -Duse64bitall
  [stdio] -Dcc=g++ -Duselongdouble DEBUGGING
  [stdio] -Dcc=g++ DEBUGGING
  [stdio] -Dcc=g++
  [stdio] -Dcc=g++ -Duselongdouble
  [stdio] -Dcc=g++ -Duse64bitall DEBUGGING
~~ ../t/uni/caller.t ........................................... FAILED Non-zero exit status: 2 No plan found in TAP output
  [stdio] -Dcc=g++ -Duse64bitall
  [stdio] -Dcc=g++ -Duselongdouble DEBUGGING
  [stdio] -Dcc=g++ DEBUGGING
  [stdio] -Dcc=g++
  [stdio] -Dcc=g++ -Duselongdouble
  [stdio] -Dcc=g++ -Duse64bitall DEBUGGING
~~ ../dist/threads-shared/t/wait.t ............................. FAILED Non-zero exit status: 2 No plan found in TAP output
  [stdio] -Dcc=g++ -Duse64bitall
  [stdio] -Dcc=g++ -Duselongdouble DEBUGGING
  [stdio] -Dcc=g++ DEBUGGING
  [stdio] -Dcc=g++
  [stdio] -Dcc=g++ -Duselongdouble
  [stdio] -Dcc=g++ -Duse64bitall DEBUGGING
~~ ../t/run/switchd.t .......................................... FAILED Non-zero exit status: 2 No plan found in TAP output
  [stdio] -Dcc=g++ -Duse64bitall
  [stdio] -Dcc=g++ -Duselongdouble DEBUGGING
  [stdio] -Dcc=g++ DEBUGGING
  [stdio] -Dcc=g++
  [stdio] -Dcc=g++ -Duselongdouble
  [stdio] -Dcc=g++ -Duse64bitall DEBUGGING
~~ ../t/re/reg_posixcc.t ....................................... FAILED Non-zero exit status: 2 No plan found in TAP output
  [stdio] -Dcc=g++ -Duse64bitall
  [stdio] -Dcc=g++ -Duselongdouble DEBUGGING
  [stdio] -Dcc=g++ DEBUGGING
  [stdio] -Dcc=g++
  [stdio] -Dcc=g++ -Duselongdouble
  [stdio] -Dcc=g++ -Duse64bitall DEBUGGING
~~ ../cpan/Test-Simple/t/Legacy/buffer.t ....................... FAILED Non-zero exit status: 255 Bad plan.  You planned 20 tests but ran 0.
  [stdio] -Dcc=g++ -Duse64bitall
  [stdio] -Dcc=g++ -Duselongdouble DEBUGGING
  [stdio] -Dcc=g++ DEBUGGING
  [stdio] -Dcc=g++
  [stdio] -Dcc=g++ -Duselongdouble
  [stdio] -Dcc=g++ -Duse64bitall DEBUGGING
~~ ../t/op/inc.t ............................................... FAILED Non-zero exit status: 2 No plan found in TAP output
  [stdio] -Dcc=g++ -Duse64bitall
  [stdio] -Dcc=g++ -Duselongdouble DEBUGGING
  [stdio] -Dcc=g++ DEBUGGING
  [stdio] -Dcc=g++
  [stdio] -Dcc=g++ -Duselongdouble
  [stdio] -Dcc=g++ -Duse64bitall DEBUGGING
~~ ../ext/POSIX/t/mb.t ......................................... FAILED Non-zero exit status: 255 No plan found in TAP output
  [stdio] -Dcc=g++ -Duse64bitall
  [stdio] -Dcc=g++ -Duselongdouble DEBUGGING
  [stdio] -Dcc=g++ DEBUGGING
  [stdio] -Dcc=g++
  [stdio] -Dcc=g++ -Duselongdouble
  [stdio] -Dcc=g++ -Duse64bitall DEBUGGING
~~ ../t/op/read.t .............................................. FAILED Non-zero exit status: 2 No plan found in TAP output
  [stdio] -Dcc=g++ -Duse64bitall
  [stdio] -Dcc=g++ -Duselongdouble DEBUGGING
  [stdio] -Dcc=g++ DEBUGGING
  [stdio] -Dcc=g++
  [stdio] -Dcc=g++ -Duselongdouble
  [stdio] -Dcc=g++ -Duse64bitall DEBUGGING
~~ ../t/porting/authors.t ...................................... FAILED Non-zero exit status: 2 No plan found in TAP output
  [stdio] -Dcc=g++ -Duse64bitall
  [stdio] -Dcc=g++ -Duselongdouble DEBUGGING
  [stdio] -Dcc=g++ DEBUGGING
  [stdio] -Dcc=g++
  [stdio] -Dcc=g++ -Duselongdouble
  [stdio] -Dcc=g++ -Duse64bitall DEBUGGING
~~ ../t/re/fold_grind_l.t ...................................... FAILED Non-zero exit status: 2 No plan found in TAP output
  [stdio] -Dcc=g++ -Duse64bitall
  [stdio] -Dcc=g++ -Duselongdouble DEBUGGING
  [stdio] -Dcc=g++ DEBUGGING
  [stdio] -Dcc=g++
  [stdio] -Dcc=g++ -Duselongdouble
  [stdio] -Dcc=g++ -Duse64bitall DEBUGGING
~~ ../ext/POSIX/t/taint.t ...................................... FAILED Non-zero exit status: 255 No plan found in TAP output
  [stdio] -Dcc=g++ -Duse64bitall
  [stdio] -Dcc=g++ -Duselongdouble DEBUGGING
  [stdio] -Dcc=g++ DEBUGGING
  [stdio] -Dcc=g++
  [stdio] -Dcc=g++ -Duselongdouble
  [stdio] -Dcc=g++ -Duse64bitall DEBUGGING
~~ ../t/re/pat_psycho_thr.t .................................... FAILED Non-zero exit status: 2 No plan found in TAP output
  [stdio] -Dcc=g++ -Duse64bitall
  [stdio] -Dcc=g++ -Duselongdouble DEBUGGING
  [stdio] -Dcc=g++ DEBUGGING
  [stdio] -Dcc=g++
  [stdio] -Dcc=g++ -Duselongdouble
  [stdio] -Dcc=g++ -Duse64bitall DEBUGGING
~~ ../t/op/setpgrpstack.t ...................................... FAILED Non-zero exit status: 2 No plan found in TAP output
  [stdio] -Dcc=g++ -Duse64bitall
  [stdio] -Dcc=g++ -Duselongdouble DEBUGGING
  [stdio] -Dcc=g++ DEBUGGING
  [stdio] -Dcc=g++
  [stdio] -Dcc=g++ -Duselongdouble
  [stdio] -Dcc=g++ -Duse64bitall DEBUGGING
~~ ../t/run/switchx.t .......................................... FAILED Non-zero exit status: 2 No plan found in TAP output
  [stdio] -Dcc=g++ -Duse64bitall
  [stdio] -Dcc=g++ -Duselongdouble DEBUGGING
  [stdio] -Dcc=g++ DEBUGGING
  [stdio] -Dcc=g++
  [stdio] -Dcc=g++ -Duselongdouble
  [stdio] -Dcc=g++ -Duse64bitall DEBUGGING
~~ ../t/op/print.t ............................................. FAILED Non-zero exit status: 2 No plan found in TAP output
  [stdio] -Dcc=g++ -Duse64bitall
  [stdio] -Dcc=g++ -Duselongdouble DEBUGGING
  [stdio] -Dcc=g++ DEBUGGING
  [stdio] -Dcc=g++
  [stdio] -Dcc=g++ -Duselongdouble
  [stdio] -Dcc=g++ -Duse64bitall DEBUGGING
~~ ../dist/Data-Dumper/t/qr.t .................................. FAILED 1-2 Non-zero exit status: 2
  [stdio] -Dcc=g++ -Duse64bitall
  [stdio] -Dcc=g++ -Duselongdouble DEBUGGING
  [stdio] -Dcc=g++ DEBUGGING
  [stdio] -Dcc=g++
  [stdio] -Dcc=g++ -Duselongdouble
  [stdio] -Dcc=g++ -Duse64bitall DEBUGGING
~~ ../cpan/Compress-Raw-Zlib/t/09limitoutput.t ................. FAILED Non-zero exit status: 255 No plan found in TAP output
  [stdio] -Dcc=g++ -Duse64bitall
  [stdio] -Dcc=g++ -Duselongdouble DEBUGGING
  [stdio] -Dcc=g++ DEBUGGING
  [stdio] -Dcc=g++
  [stdio] -Dcc=g++ -Duselongdouble
  [stdio] -Dcc=g++ -Duse64bitall DEBUGGING
~~ ../t/op/glob.t .............................................. FAILED Non-zero exit status: 2 No plan found in TAP output
  [stdio] -Dcc=g++ -Duse64bitall
  [stdio] -Dcc=g++ -Duselongdouble DEBUGGING
  [stdio] -Dcc=g++ DEBUGGING
  [stdio] -Dcc=g++
  [stdio] -Dcc=g++ -Duselongdouble
  [stdio] -Dcc=g++ -Duse64bitall DEBUGGING
~~ ../t/op/getpid.t ............................................ FAILED Non-zero exit status: 2 No plan found in TAP output
  [stdio] -Dcc=g++ -Duse64bitall
  [stdio] -Dcc=g++ -Duselongdouble DEBUGGING
  [stdio] -Dcc=g++ DEBUGGING
  [stdio] -Dcc=g++
  [stdio] -Dcc=g++ -Duselongdouble
  [stdio] -Dcc=g++ -Duse64bitall DEBUGGING
~~ ../t/re/qr.t ................................................ FAILED Non-zero exit status: 2 No plan found in TAP output
  [stdio] -Dcc=g++ -Duse64bitall
  [stdio] -Dcc=g++ -Duselongdouble DEBUGGING
  [stdio] -Dcc=g++ DEBUGGING
  [stdio] -Dcc=g++
  [stdio] -Dcc=g++ -Duselongdouble
  [stdio] -Dcc=g++ -Duse64bitall DEBUGGING
~~ ../t/re/regex_sets.t ........................................ FAILED Non-zero exit status: 2 No plan found in TAP output
  [stdio] -Dcc=g++ -Duse64bitall
  [stdio] -Dcc=g++ -Duselongdouble DEBUGGING
  [stdio] -Dcc=g++ DEBUGGING
  [stdio] -Dcc=g++
  [stdio] -Dcc=g++ -Duselongdouble
  [stdio] -Dcc=g++ -Duse64bitall DEBUGGING
~~ ../t/op/blocks.t ............................................ FAILED Non-zero exit status: 2 No plan found in TAP output
  [stdio] -Dcc=g++ -Duse64bitall
  [stdio] -Dcc=g++ -Duselongdouble DEBUGGING
  [stdio] -Dcc=g++ DEBUGGING
  [stdio] -Dcc=g++
  [stdio] -Dcc=g++ -Duselongdouble
  [stdio] -Dcc=g++ -Duse64bitall DEBUGGING
~~ ../t/op/hexfp.t ............................................. FAILED Non-zero exit status: 2 No plan found in TAP output
  [stdio] -Dcc=g++ -Duse64bitall
  [stdio] -Dcc=g++ -Duselongdouble DEBUGGING
  [stdio] -Dcc=g++ DEBUGGING
  [stdio] -Dcc=g++
  [stdio] -Dcc=g++ -Duselongdouble
  [stdio] -Dcc=g++ -Duse64bitall DEBUGGING
~~ ../dist/Storable/t/downgrade.t .............................. FAILED 13 66-67 114-115 Non-zero exit status: 29
  [stdio] -Dcc=g++ -Duse64bitall DEBUGGING
~~ ../t/io/errnosig.t .......................................... FAILED Non-zero exit status: 2 No plan found in TAP output
  [stdio] -Dcc=g++ -Duse64bitall
  [stdio] -Dcc=g++ -Duselongdouble DEBUGGING
  [stdio] -Dcc=g++ DEBUGGING
  [stdio] -Dcc=g++
  [stdio] -Dcc=g++ -Duselongdouble
  [stdio] -Dcc=g++ -Duse64bitall DEBUGGING
~~ ../t/io/defout.t ............................................ FAILED Non-zero exit status: 2 No plan found in TAP output
  [stdio] -Dcc=g++ -Duse64bitall
  [stdio] -Dcc=g++ -Duselongdouble DEBUGGING
  [stdio] -Dcc=g++ DEBUGGING
  [stdio] -Dcc=g++
  [stdio] -Dcc=g++ -Duselongdouble
  [stdio] -Dcc=g++ -Duse64bitall DEBUGGING
~~ ../t/re/pat_psycho.t ........................................ FAILED Non-zero exit status: 2 No plan found in TAP output
  [stdio] -Dcc=g++ -Duse64bitall
  [stdio] -Dcc=g++ -Duselongdouble DEBUGGING
  [stdio] -Dcc=g++ DEBUGGING
  [stdio] -Dcc=g++
  [stdio] -Dcc=g++ -Duselongdouble
  [stdio] -Dcc=g++ -Duse64bitall DEBUGGING
~~ ../t/re/pat.t ............................................... FAILED Non-zero exit status: 2 No plan found in TAP output
  [stdio] -Dcc=g++ -Duse64bitall
  [stdio] -Dcc=g++ -Duselongdouble DEBUGGING
  [stdio] -Dcc=g++ DEBUGGING
  [stdio] -Dcc=g++
  [stdio] -Dcc=g++ -Duselongdouble
  [stdio] -Dcc=g++ -Duse64bitall DEBUGGING
~~ ../t/io/closepid.t .......................................... FAILED Non-zero exit status: 2 No plan found in TAP output
  [stdio] -Dcc=g++ -Duse64bitall
  [stdio] -Dcc=g++ -Duselongdouble DEBUGGING
  [stdio] -Dcc=g++ DEBUGGING
  [stdio] -Dcc=g++
  [stdio] -Dcc=g++ -Duselongdouble
  [stdio] -Dcc=g++ -Duse64bitall DEBUGGING
~~ ../ext/B/t/concise-xs.t ..................................... FAILED Non-zero exit status: 255
  [stdio] -Dcc=g++ -Duse64bitall
  [stdio] -Dcc=g++ -Duselongdouble DEBUGGING
  [stdio] -Dcc=g++ DEBUGGING
  [stdio] -Dcc=g++
  [stdio] -Dcc=g++ -Duselongdouble
  [stdio] -Dcc=g++ -Duse64bitall DEBUGGING
~~ ../t/op/coreamp.t ........................................... FAILED Non-zero exit status: 2 No plan found in TAP output
  [stdio] -Dcc=g++ -Duse64bitall
  [stdio] -Dcc=g++ -Duselongdouble DEBUGGING
  [stdio] -Dcc=g++ DEBUGGING
  [stdio] -Dcc=g++
  [stdio] -Dcc=g++ -Duselongdouble
  [stdio] -Dcc=g++ -Duse64bitall DEBUGGING
~~ ../t/porting/re_context.t ................................... FAILED Non-zero exit status: 2 No plan found in TAP output
  [stdio] -Dcc=g++ -Duse64bitall
  [stdio] -Dcc=g++ -Duselongdouble DEBUGGING
  [stdio] -Dcc=g++ DEBUGGING
  [stdio] -Dcc=g++
  [stdio] -Dcc=g++ -Duselongdouble
  [stdio] -Dcc=g++ -Duse64bitall DEBUGGING
~~ ../ext/re/t/re_funcs_u.t .................................... FAILED Non-zero exit status: 2 No plan found in TAP output
  [stdio] -Dcc=g++ -Duse64bitall
  [stdio] -Dcc=g++ -Duselongdouble DEBUGGING
  [stdio] -Dcc=g++ DEBUGGING
  [stdio] -Dcc=g++
  [stdio] -Dcc=g++ -Duselongdouble
  [stdio] -Dcc=g++ -Duse64bitall DEBUGGING
~~ ../t/op/overload_integer.t .................................. FAILED Non-zero exit status: 2 No plan found in TAP output
  [stdio] -Dcc=g++ -Duse64bitall
  [stdio] -Dcc=g++ -Duselongdouble DEBUGGING
  [stdio] -Dcc=g++ DEBUGGING
  [stdio] -Dcc=g++
  [stdio] -Dcc=g++ -Duselongdouble
  [stdio] -Dcc=g++ -Duse64bitall DEBUGGING
~~ ../t/op/int.t ............................................... FAILED Non-zero exit status: 2 No plan found in TAP output
  [stdio] -Dcc=g++ -Duse64bitall
  [stdio] -Dcc=g++ -Duselongdouble DEBUGGING
  [stdio] -Dcc=g++ DEBUGGING
  [stdio] -Dcc=g++
  [stdio] -Dcc=g++ -Duselongdouble
  [stdio] -Dcc=g++ -Duse64bitall DEBUGGING
~~ ../t/op/tiearray.t .......................................... FAILED Non-zero exit status: 2 No plan found in TAP output
  [stdio] -Dcc=g++ -Duse64bitall
  [stdio] -Dcc=g++ -Duselongdouble DEBUGGING
  [stdio] -Dcc=g++ DEBUGGING
  [stdio] -Dcc=g++
  [stdio] -Dcc=g++ -Duselongdouble
  [stdio] -Dcc=g++ -Duse64bitall DEBUGGING
~~ ../t/op/defined.t ........................................... FAILED Non-zero exit status: 2 No plan found in TAP output
  [stdio] -Dcc=g++ -Duse64bitall
  [stdio] -Dcc=g++ -Duselongdouble DEBUGGING
  [stdio] -Dcc=g++ DEBUGGING
  [stdio] -Dcc=g++
  [stdio] -Dcc=g++ -Duselongdouble
  [stdio] -Dcc=g++ -Duse64bitall DEBUGGING
~~ ../ext/re/t/lexical_debug.t ................................. FAILED Non-zero exit status: 2 No plan found in TAP output
  [stdio] -Dcc=g++ -Duse64bitall
  [stdio] -Dcc=g++ -Duselongdouble DEBUGGING
  [stdio] -Dcc=g++ DEBUGGING
  [stdio] -Dcc=g++
  [stdio] -Dcc=g++ -Duselongdouble
  [stdio] -Dcc=g++ -Duse64bitall DEBUGGING
~~ ../t/op/quotemeta.t ......................................... FAILED Non-zero exit status: 2 No plan found in TAP output
  [stdio] -Dcc=g++ -Duse64bitall
  [stdio] -Dcc=g++ -Duselongdouble DEBUGGING
  [stdio] -Dcc=g++ DEBUGGING
  [stdio] -Dcc=g++
  [stdio] -Dcc=g++ -Duselongdouble
  [stdio] -Dcc=g++ -Duse64bitall DEBUGGING
~~ ../t/re/reg_pmod.t .......................................... FAILED Non-zero exit status: 2 No plan found in TAP output
  [stdio] -Dcc=g++ -Duse64bitall
  [stdio] -Dcc=g++ -Duselongdouble DEBUGGING
  [stdio] -Dcc=g++ DEBUGGING
  [stdio] -Dcc=g++
  [stdio] -Dcc=g++ -Duselongdouble
  [stdio] -Dcc=g++ -Duse64bitall DEBUGGING
~~ ../t/op/for.t ............................................... FAILED Non-zero exit status: 2 No plan found in TAP output
  [stdio] -Dcc=g++ -Duse64bitall
  [stdio] -Dcc=g++ -Duselongdouble DEBUGGING
  [stdio] -Dcc=g++ DEBUGGING
  [stdio] -Dcc=g++
  [stdio] -Dcc=g++ -Duselongdouble
  [stdio] -Dcc=g++ -Duse64bitall DEBUGGING
~~ ../t/re/speed.t ............................................. FAILED Non-zero exit status: 2 No plan found in TAP output
  [stdio] -Dcc=g++ -Duse64bitall
  [stdio] -Dcc=g++ -Duselongdouble DEBUGGING
  [stdio] -Dcc=g++ DEBUGGING
  [stdio] -Dcc=g++
  [stdio] -Dcc=g++ -Duselongdouble
  [stdio] -Dcc=g++ -Duse64bitall DEBUGGING
~~ ../t/op/mkdir.t ............................................. FAILED Non-zero exit status: 2 No plan found in TAP output
  [stdio] -Dcc=g++ -Duse64bitall
  [stdio] -Dcc=g++ -Duselongdouble DEBUGGING
  [stdio] -Dcc=g++ DEBUGGING
  [stdio] -Dcc=g++
  [stdio] -Dcc=g++ -Duselongdouble
  [stdio] -Dcc=g++ -Duse64bitall DEBUGGING
~~ ../cpan/ExtUtils-MakeMaker/t/oneliner.t ..................... FAILED 5 Non-zero exit status: 1
  [stdio] -Dcc=g++ -Duse64bitall
  [stdio] -Dcc=g++ -Duselongdouble DEBUGGING
  [stdio] -Dcc=g++ DEBUGGING
  [stdio] -Dcc=g++
  [stdio] -Dcc=g++ -Duselongdouble
  [stdio] -Dcc=g++ -Duse64bitall DEBUGGING
~~ ../lib/feature.t ............................................ FAILED Non-zero exit status: 2 No plan found in TAP output
  [stdio] -Dcc=g++ -Duse64bitall
  [stdio] -Dcc=g++ -Duselongdouble DEBUGGING
  [stdio] -Dcc=g++ DEBUGGING
  [stdio] -Dcc=g++
  [stdio] -Dcc=g++ -Duselongdouble
  [stdio] -Dcc=g++ -Duse64bitall DEBUGGING
~~ ../t/io/through.t ........................................... FAILED Non-zero exit status: 2 No plan found in TAP output
  [stdio] -Dcc=g++ -Duse64bitall
  [stdio] -Dcc=g++ -Duselongdouble DEBUGGING
  [stdio] -Dcc=g++ DEBUGGING
  [stdio] -Dcc=g++
  [stdio] -Dcc=g++ -Duselongdouble
  [stdio] -Dcc=g++ -Duse64bitall DEBUGGING
~~ ../t/op/sysio.t ............................................. FAILED Non-zero exit status: 2 No plan found in TAP output
  [stdio] -Dcc=g++ -Duse64bitall
  [stdio] -Dcc=g++ -Duselongdouble DEBUGGING
  [stdio] -Dcc=g++ DEBUGGING
  [stdio] -Dcc=g++
  [stdio] -Dcc=g++ -Duselongdouble
  [stdio] -Dcc=g++ -Duse64bitall DEBUGGING
~~ ../t/op/or.t ................................................ FAILED Non-zero exit status: 2 No plan found in TAP output
  [stdio] -Dcc=g++ -Duse64bitall
  [stdio] -Dcc=g++ -Duselongdouble DEBUGGING
  [stdio] -Dcc=g++ DEBUGGING
  [stdio] -Dcc=g++
  [stdio] -Dcc=g++ -Duselongdouble
  [stdio] -Dcc=g++ -Duse64bitall DEBUGGING
~~ ../t/op/local.t ............................................. FAILED Non-zero exit status: 2 No plan found in TAP output
  [stdio] -Dcc=g++ -Duse64bitall
  [stdio] -Dcc=g++ -Duselongdouble DEBUGGING
  [stdio] -Dcc=g++ DEBUGGING
  [stdio] -Dcc=g++
  [stdio] -Dcc=g++ -Duselongdouble
  [stdio] -Dcc=g++ -Duse64bitall DEBUGGING
~~ ../t/io/pvbm.t .............................................. FAILED Non-zero exit status: 2 No plan found in TAP output
  [stdio] -Dcc=g++ -Duse64bitall
  [stdio] -Dcc=g++ -Duselongdouble DEBUGGING
  [stdio] -Dcc=g++ DEBUGGING
  [stdio] -Dcc=g++
  [stdio] -Dcc=g++ -Duselongdouble
  [stdio] -Dcc=g++ -Duse64bitall DEBUGGING
~~ ../t/op/smartkve.t .......................................... FAILED Non-zero exit status: 2 No plan found in TAP output
  [stdio] -Dcc=g++ -Duse64bitall
  [stdio] -Dcc=g++ -Duselongdouble DEBUGGING
  [stdio] -Dcc=g++ DEBUGGING
  [stdio] -Dcc=g++
  [stdio] -Dcc=g++ -Duselongdouble
  [stdio] -Dcc=g++ -Duse64bitall DEBUGGING
~~ ../t/io/layers.t ............................................ FAILED Non-zero exit status: 2 No plan found in TAP output
  [stdio] -Dcc=g++ -Duse64bitall
  [stdio] -Dcc=g++ -Duselongdouble DEBUGGING
  [stdio] -Dcc=g++ DEBUGGING
  [stdio] -Dcc=g++
  [stdio] -Dcc=g++ -Duselongdouble
  [stdio] -Dcc=g++ -Duse64bitall DEBUGGING
~~ ../t/op/oct.t ............................................... FAILED Non-zero exit status: 2 No plan found in TAP output
  [stdio] -Dcc=g++ -Duse64bitall
  [stdio] -Dcc=g++ -Duselongdouble DEBUGGING
  [stdio] -Dcc=g++ DEBUGGING
  [stdio] -Dcc=g++
  [stdio] -Dcc=g++ -Duselongdouble
  [stdio] -Dcc=g++ -Duse64bitall DEBUGGING
~~ ../t/porting/checkcase.t .................................... FAILED Non-zero exit status: 2 No plan found in TAP output
  [stdio] -Dcc=g++ -Duse64bitall
  [stdio] -Dcc=g++ -Duselongdouble DEBUGGING
  [stdio] -Dcc=g++ DEBUGGING
  [stdio] -Dcc=g++
  [stdio] -Dcc=g++ -Duselongdouble
  [stdio] -Dcc=g++ -Duse64bitall DEBUGGING
~~ ../dist/constant/t/constant.t ............................... FAILED Non-zero exit status: 7 Bad plan.  You planned 109 tests but ran 1.
  [stdio] -Dcc=g++ -Duse64bitall
  [stdio] -Dcc=g++ -Duselongdouble DEBUGGING
  [stdio] -Dcc=g++ DEBUGGING
  [stdio] -Dcc=g++
  [stdio] -Dcc=g++ -Duselongdouble
  [stdio] -Dcc=g++ -Duse64bitall DEBUGGING
~~ ../cpan/Test-Simple/t/Test2/acceptance/try_it_todo.t ........ FAILED Non-zero exit status: 255 No plan found in TAP output
  [stdio] -Dcc=g++ -Duse64bitall
  [stdio] -Dcc=g++ -Duselongdouble DEBUGGING
  [stdio] -Dcc=g++ DEBUGGING
  [stdio] -Dcc=g++
  [stdio] -Dcc=g++ -Duselongdouble
  [stdio] -Dcc=g++ -Duse64bitall DEBUGGING
~~ ../t/io/data.t .............................................. FAILED Non-zero exit status: 2 No plan found in TAP output
  [stdio] -Dcc=g++ -Duse64bitall
  [stdio] -Dcc=g++ -Duselongdouble DEBUGGING
  [stdio] -Dcc=g++ DEBUGGING
  [stdio] -Dcc=g++
  [stdio] -Dcc=g++ -Duselongdouble
  [stdio] -Dcc=g++ -Duse64bitall DEBUGGING
~~ ../t/mro/recursion_dfs_utf8.t ............................... FAILED Non-zero exit status: 2 No plan found in TAP output
  [stdio] -Dcc=g++ -Duse64bitall
  [stdio] -Dcc=g++ -Duselongdouble DEBUGGING
  [stdio] -Dcc=g++ DEBUGGING
  [stdio] -Dcc=g++
  [stdio] -Dcc=g++ -Duselongdouble
  [stdio] -Dcc=g++ -Duse64bitall DEBUGGING
~~ ../lib/subs.t ............................................... FAILED Non-zero exit status: 2 No plan found in TAP output
  [stdio] -Dcc=g++ -Duse64bitall
  [stdio] -Dcc=g++ -Duselongdouble DEBUGGING
  [stdio] -Dcc=g++ DEBUGGING
  [stdio] -Dcc=g++
  [stdio] -Dcc=g++ -Duselongdouble
  [stdio] -Dcc=g++ -Duse64bitall DEBUGGING
~~ ../lib/B/Deparse.t .......................................... FAILED 69 279 303 Bad plan.  You planned 315 tests but ran 314.
  [stdio] -Dcc=g++ -Duse64bitall
  [stdio] -Dcc=g++ -Duselongdouble DEBUGGING
  [stdio] -Dcc=g++ DEBUGGING
  [stdio] -Dcc=g++
  [stdio] -Dcc=g++ -Duselongdouble
  [stdio] -Dcc=g++ -Duse64bitall DEBUGGING
~~ ../t/op/attrproto.t ......................................... FAILED Non-zero exit status: 2 No plan found in TAP output
  [stdio] -Dcc=g++ -Duse64bitall
  [stdio] -Dcc=g++ -Duselongdouble DEBUGGING
  [stdio] -Dcc=g++ DEBUGGING
  [stdio] -Dcc=g++
  [stdio] -Dcc=g++ -Duselongdouble
  [stdio] -Dcc=g++ -Duse64bitall DEBUGGING
~~ ../t/uni/readline.t ......................................... FAILED Non-zero exit status: 2 No plan found in TAP output
  [stdio] -Dcc=g++ -Duse64bitall
  [stdio] -Dcc=g++ -Duselongdouble DEBUGGING
  [stdio] -Dcc=g++ DEBUGGING
  [stdio] -Dcc=g++
  [stdio] -Dcc=g++ -Duselongdouble
  [stdio] -Dcc=g++ -Duse64bitall DEBUGGING
~~ ../ext/Hash-Util/t/builtin.t ................................ FAILED 8 Non-zero exit status: 3
  [stdio] -Dcc=g++ -Duse64bitall
  [stdio] -Dcc=g++ -Duselongdouble DEBUGGING
  [stdio] -Dcc=g++ DEBUGGING
  [stdio] -Dcc=g++
  [stdio] -Dcc=g++ -Duselongdouble
  [stdio] -Dcc=g++ -Duse64bitall DEBUGGING
~~ ../t/op/filetest_stack_ok.t ................................. FAILED Non-zero exit status: 2 No plan found in TAP output
  [stdio] -Dcc=g++ -Duse64bitall
  [stdio] -Dcc=g++ -Duselongdouble DEBUGGING
  [stdio] -Dcc=g++ DEBUGGING
  [stdio] -Dcc=g++
  [stdio] -Dcc=g++ -Duselongdouble
  [stdio] -Dcc=g++ -Duse64bitall DEBUGGING
~~ ../cpan/version/t/04strict_lax.t ............................ FAILED Non-zero exit status: 255
  [stdio] -Dcc=g++ -Duse64bitall
  [stdio] -Dcc=g++ -Duselongdouble DEBUGGING
  [stdio] -Dcc=g++ DEBUGGING
  [stdio] -Dcc=g++
  [stdio] -Dcc=g++ -Duselongdouble
  [stdio] -Dcc=g++ -Duse64bitall DEBUGGING
~~ ../t/uni/method.t ........................................... FAILED Non-zero exit status: 2 No plan found in TAP output
  [stdio] -Dcc=g++ -Duse64bitall
  [stdio] -Dcc=g++ -Duselongdouble DEBUGGING
  [stdio] -Dcc=g++ DEBUGGING
  [stdio] -Dcc=g++
  [stdio] -Dcc=g++ -Duselongdouble
  [stdio] -Dcc=g++ -Duse64bitall DEBUGGING
~~ ../t/porting/manifest.t ..................................... FAILED Non-zero exit status: 2 No plan found in TAP output
  [stdio] -Dcc=g++ -Duse64bitall
  [stdio] -Dcc=g++ -Duselongdouble DEBUGGING
  [stdio] -Dcc=g++ DEBUGGING
  [stdio] -Dcc=g++
  [stdio] -Dcc=g++ -Duselongdouble
  [stdio] -Dcc=g++ -Duse64bitall DEBUGGING
~~ ../cpan/Text-Balanced/t/06_extqlk.t ......................... FAILED Non-zero exit status: 255 Bad plan.  You planned 95 tests but ran 0.
  [stdio] -Dcc=g++ -Duse64bitall
  [stdio] -Dcc=g++ -Duselongdouble DEBUGGING
  [stdio] -Dcc=g++ DEBUGGING
  [stdio] -Dcc=g++
  [stdio] -Dcc=g++ -Duselongdouble
  [stdio] -Dcc=g++ -Duse64bitall DEBUGGING
~~ ../t/op/time.t .............................................. FAILED Non-zero exit status: 2 No plan found in TAP output
  [stdio] -Dcc=g++ -Duse64bitall
  [stdio] -Dcc=g++ -Duselongdouble DEBUGGING
  [stdio] -Dcc=g++ DEBUGGING
  [stdio] -Dcc=g++
  [stdio] -Dcc=g++ -Duselongdouble
  [stdio] -Dcc=g++ -Duse64bitall DEBUGGING
~~ ../lib/Tie/Array/std.t ...................................... FAILED Non-zero exit status: 2 No plan found in TAP output
  [stdio] -Dcc=g++ -Duse64bitall
  [stdio] -Dcc=g++ -Duselongdouble DEBUGGING
  [stdio] -Dcc=g++ DEBUGGING
  [stdio] -Dcc=g++
  [stdio] -Dcc=g++ -Duselongdouble
  [stdio] -Dcc=g++ -Duse64bitall DEBUGGING
~~ ../t/op/rand.t .............................................. FAILED Non-zero exit status: 2 No plan found in TAP output
  [stdio] -Dcc=g++ -Duse64bitall
  [stdio] -Dcc=g++ -Duselongdouble DEBUGGING
  [stdio] -Dcc=g++ DEBUGGING
  [stdio] -Dcc=g++
  [stdio] -Dcc=g++ -Duselongdouble
  [stdio] -Dcc=g++ -Duse64bitall DEBUGGING
~~ ../ext/XS-APItest/t/xsub_h.t ................................ FAILED Non-zero exit status: 255 No plan found in TAP output
  [stdio] -Dcc=g++ -Duse64bitall
  [stdio] -Dcc=g++ -Duselongdouble DEBUGGING
  [stdio] -Dcc=g++ DEBUGGING
  [stdio] -Dcc=g++
  [stdio] -Dcc=g++ -Duselongdouble
  [stdio] -Dcc=g++ -Duse64bitall DEBUGGING
~~ ../t/run/switchDx.t ......................................... FAILED Non-zero exit status: 2 No plan found in TAP output
  [stdio] -Dcc=g++ -Duse64bitall
  [stdio] -Dcc=g++ -Duselongdouble DEBUGGING
  [stdio] -Dcc=g++ DEBUGGING
  [stdio] -Dcc=g++
  [stdio] -Dcc=g++ -Duselongdouble
  [stdio] -Dcc=g++ -Duse64bitall DEBUGGING
~~ ../t/uni/lower.t ............................................ FAILED Non-zero exit status: 2 No plan found in TAP output
  [stdio] -Dcc=g++ -Duse64bitall
  [stdio] -Dcc=g++ -Duselongdouble DEBUGGING
  [stdio] -Dcc=g++ DEBUGGING
  [stdio] -Dcc=g++
  [stdio] -Dcc=g++ -Duselongdouble
  [stdio] -Dcc=g++ -Duse64bitall DEBUGGING
~~ ../t/re/pat_special_cc.t .................................... FAILED Non-zero exit status: 2 No plan found in TAP output
  [stdio] -Dcc=g++ -Duse64bitall
  [stdio] -Dcc=g++ -Duselongdouble DEBUGGING
  [stdio] -Dcc=g++ DEBUGGING
  [stdio] -Dcc=g++
  [stdio] -Dcc=g++ -Duselongdouble
  [stdio] -Dcc=g++ -Duse64bitall DEBUGGING
~~ ../dist/Storable/t/malice.t ................................. FAILED 8 249 414 Non-zero exit status: 20
  [stdio] -Dcc=g++ -Duse64bitall
  [stdio] -Dcc=g++ -Duselongdouble DEBUGGING
  [stdio] -Dcc=g++ DEBUGGING
  [stdio] -Dcc=g++
  [stdio] -Dcc=g++ -Duselongdouble
  [stdio] -Dcc=g++ -Duse64bitall DEBUGGING
~~ ../t/porting/podcheck.t ..................................... FAILED 299
  [stdio] -Dcc=g++ -Duse64bitall
  [stdio] -Dcc=g++ -Duselongdouble DEBUGGING
  [stdio] -Dcc=g++ DEBUGGING
  [stdio] -Dcc=g++
  [stdio] -Dcc=g++ -Duselongdouble
  [stdio] -Dcc=g++ -Duse64bitall DEBUGGING
~~ ../t/porting/cmp_version.t .................................. FAILED 1-68 162-175 200
  [stdio] -Dcc=g++ -Duse64bitall
  [stdio] -Dcc=g++ -Duselongdouble DEBUGGING
  [stdio] -Dcc=g++ DEBUGGING
  [stdio] -Dcc=g++
  [stdio] -Dcc=g++ -Duselongdouble
  [stdio] -Dcc=g++ -Duse64bitall DEBUGGING
~~ ../t/op/goto.t .............................................. FAILED Non-zero exit status: 2 No plan found in TAP output
  [stdio] -Dcc=g++ -Duse64bitall
  [stdio] -Dcc=g++ -Duselongdouble DEBUGGING
  [stdio] -Dcc=g++ DEBUGGING
  [stdio] -Dcc=g++
  [stdio] -Dcc=g++ -Duselongdouble
  [stdio] -Dcc=g++ -Duse64bitall DEBUGGING
~~ ../t/op/packagev.t .......................................... FAILED Non-zero exit status: 2 No plan found in TAP output
  [stdio] -Dcc=g++ -Duse64bitall
  [stdio] -Dcc=g++ -Duselongdouble DEBUGGING
  [stdio] -Dcc=g++ DEBUGGING
  [stdio] -Dcc=g++
  [stdio] -Dcc=g++ -Duselongdouble
  [stdio] -Dcc=g++ -Duse64bitall DEBUGGING
~~ ../t/op/numconvert.t ........................................ FAILED Non-zero exit status: 2 No plan found in TAP output
  [stdio] -Dcc=g++ -Duse64bitall
  [stdio] -Dcc=g++ -Duselongdouble DEBUGGING
  [stdio] -Dcc=g++ DEBUGGING
  [stdio] -Dcc=g++
  [stdio] -Dcc=g++ -Duselongdouble
  [stdio] -Dcc=g++ -Duse64bitall DEBUGGING
~~ ../cpan/Text-Balanced/t/09_gentag.t ......................... FAILED Non-zero exit status: 255 Bad plan.  You planned 37 tests but ran 0.
  [stdio] -Dcc=g++ -Duse64bitall
  [stdio] -Dcc=g++ -Duselongdouble DEBUGGING
  [stdio] -Dcc=g++ DEBUGGING
  [stdio] -Dcc=g++
  [stdio] -Dcc=g++ -Duselongdouble
  [stdio] -Dcc=g++ -Duse64bitall DEBUGGING
~~ ../t/op/assignwarn.t ........................................ FAILED Non-zero exit status: 2 No plan found in TAP output
  [stdio] -Dcc=g++ -Duse64bitall
  [stdio] -Dcc=g++ -Duselongdouble DEBUGGING
  [stdio] -Dcc=g++ DEBUGGING
  [stdio] -Dcc=g++
  [stdio] -Dcc=g++ -Duselongdouble
  [stdio] -Dcc=g++ -Duse64bitall DEBUGGING
~~ ../lib/B/Deparse-core.t ..................................... FAILED 3823-3840 Non-zero exit status: 18
  [stdio] -Dcc=g++ -Duse64bitall
  [stdio] -Dcc=g++ -Duselongdouble DEBUGGING
  [stdio] -Dcc=g++ DEBUGGING
  [stdio] -Dcc=g++
  [stdio] -Dcc=g++ -Duselongdouble
  [stdio] -Dcc=g++ -Duse64bitall DEBUGGING
~~ ../t/re/subst_amp.t ......................................... FAILED Non-zero exit status: 2 No plan found in TAP output
  [stdio] -Dcc=g++ -Duse64bitall
  [stdio] -Dcc=g++ -Duselongdouble DEBUGGING
  [stdio] -Dcc=g++ DEBUGGING
  [stdio] -Dcc=g++
  [stdio] -Dcc=g++ -Duselongdouble
  [stdio] -Dcc=g++ -Duse64bitall DEBUGGING
~~ ../t/op/cmpchain.t .......................................... FAILED Non-zero exit status: 2 No plan found in TAP output
  [stdio] -Dcc=g++ -Duse64bitall
  [stdio] -Dcc=g++ -Duselongdouble DEBUGGING
  [stdio] -Dcc=g++ DEBUGGING
  [stdio] -Dcc=g++
  [stdio] -Dcc=g++ -Duselongdouble
  [stdio] -Dcc=g++ -Duse64bitall DEBUGGING
~~ ../cpan/Test-Simple/t/Test2/modules/API.t ................... FAILED Non-zero exit status: 255 No plan found in TAP output
  [stdio] -Dcc=g++ -Duse64bitall
  [stdio] -Dcc=g++ -Duselongdouble DEBUGGING
  [stdio] -Dcc=g++ DEBUGGING
  [stdio] -Dcc=g++
  [stdio] -Dcc=g++ -Duselongdouble
  [stdio] -Dcc=g++ -Duse64bitall DEBUGGING
~~ ../t/op/attrhand.t .......................................... FAILED Non-zero exit status: 2 No plan found in TAP output
  [stdio] -Dcc=g++ -Duse64bitall
  [stdio] -Dcc=g++ -Duselongdouble DEBUGGING
  [stdio] -Dcc=g++ DEBUGGING
  [stdio] -Dcc=g++
  [stdio] -Dcc=g++ -Duselongdouble
  [stdio] -Dcc=g++ -Duse64bitall DEBUGGING
~~ ../t/op/join.t .............................................. FAILED Non-zero exit status: 2 No plan found in TAP output
  [stdio] -Dcc=g++ -Duse64bitall
  [stdio] -Dcc=g++ -Duselongdouble DEBUGGING
  [stdio] -Dcc=g++ DEBUGGING
  [stdio] -Dcc=g++
  [stdio] -Dcc=g++ -Duselongdouble
  [stdio] -Dcc=g++ -Duse64bitall DEBUGGING
~~ ../dist/ExtUtils-CBuilder/t/03-cplusplus.t .................. FAILED Non-zero exit status: 255 No plan found in TAP output
  [stdio] -Dcc=g++ -Duse64bitall
  [stdio] -Dcc=g++ -Duselongdouble DEBUGGING
  [stdio] -Dcc=g++ DEBUGGING
  [stdio] -Dcc=g++
  [stdio] -Dcc=g++ -Duselongdouble
  [stdio] -Dcc=g++ -Duse64bitall DEBUGGING
~~ ../t/op/filetest_t.t ........................................ FAILED Non-zero exit status: 2 No plan found in TAP output
  [stdio] -Dcc=g++ -Duse64bitall
  [stdio] -Dcc=g++ -Duselongdouble DEBUGGING
  [stdio] -Dcc=g++ DEBUGGING
  [stdio] -Dcc=g++
  [stdio] -Dcc=g++ -Duselongdouble
  [stdio] -Dcc=g++ -Duse64bitall DEBUGGING
~~ ../t/op/filetest.t .......................................... FAILED Non-zero exit status: 2 No plan found in TAP output
  [stdio] -Dcc=g++ -Duse64bitall
  [stdio] -Dcc=g++ -Duselongdouble DEBUGGING
  [stdio] -Dcc=g++ DEBUGGING
  [stdio] -Dcc=g++
  [stdio] -Dcc=g++ -Duselongdouble
  [stdio] -Dcc=g++ -Duse64bitall DEBUGGING
~~ ../t/mro/recursion_dfs.t .................................... FAILED Non-zero exit status: 2 No plan found in TAP output
  [stdio] -Dcc=g++ -Duse64bitall
  [stdio] -Dcc=g++ -Duselongdouble DEBUGGING
  [stdio] -Dcc=g++ DEBUGGING
  [stdio] -Dcc=g++
  [stdio] -Dcc=g++ -Duselongdouble
  [stdio] -Dcc=g++ -Duse64bitall DEBUGGING
~~ ../t/op/smartmatch.t ........................................ FAILED Non-zero exit status: 2 No plan found in TAP output
  [stdio] -Dcc=g++ -Duse64bitall
  [stdio] -Dcc=g++ -Duselongdouble DEBUGGING
  [stdio] -Dcc=g++ DEBUGGING
  [stdio] -Dcc=g++
  [stdio] -Dcc=g++ -Duselongdouble
  [stdio] -Dcc=g++ -Duse64bitall DEBUGGING
~~ ../dist/Storable/t/downgrade.t .............................. FAILED 13 66-67 125-127 Non-zero exit status: 28
  [stdio] -Dcc=g++
~~ ../dist/IO/t/io_multihomed.t ................................ FAILED Non-zero exit status: 2 No plan found in TAP output
  [stdio] -Dcc=g++ -Duse64bitall
  [stdio] -Dcc=g++ -Duselongdouble DEBUGGING
  [stdio] -Dcc=g++ DEBUGGING
  [stdio] -Dcc=g++
  [stdio] -Dcc=g++ -Duselongdouble
  [stdio] -Dcc=g++ -Duse64bitall DEBUGGING
~~ ../t/comp/filter_exception.t ................................ FAILED Non-zero exit status: 2 No plan found in TAP output
  [stdio] -Dcc=g++ -Duse64bitall
  [stdio] -Dcc=g++ -Duselongdouble DEBUGGING
  [stdio] -Dcc=g++ DEBUGGING
  [stdio] -Dcc=g++
  [stdio] -Dcc=g++ -Duselongdouble
  [stdio] -Dcc=g++ -Duse64bitall DEBUGGING
~~ ../ext/Sys-Hostname/t/Hostname.t ............................ FAILED Non-zero exit status: 255 No plan found in TAP output
  [stdio] -Dcc=g++ -Duse64bitall
  [stdio] -Dcc=g++ -Duselongdouble DEBUGGING
  [stdio] -Dcc=g++ DEBUGGING
  [stdio] -Dcc=g++
  [stdio] -Dcc=g++ -Duselongdouble
  [stdio] -Dcc=g++ -Duse64bitall DEBUGGING
~~ ../lib/strict.t ............................................. FAILED Non-zero exit status: 2 No plan found in TAP output
  [stdio] -Dcc=g++ -Duse64bitall
  [stdio] -Dcc=g++ -Duselongdouble DEBUGGING
  [stdio] -Dcc=g++ DEBUGGING
  [stdio] -Dcc=g++
  [stdio] -Dcc=g++ -Duselongdouble
  [stdio] -Dcc=g++ -Duse64bitall DEBUGGING
~~ ../ext/Fcntl/t/fcntl.t ...................................... FAILED Non-zero exit status: 2 No plan found in TAP output
  [stdio] -Dcc=g++ -Duse64bitall
  [stdio] -Dcc=g++ -Duselongdouble DEBUGGING
  [stdio] -Dcc=g++ DEBUGGING
  [stdio] -Dcc=g++
  [stdio] -Dcc=g++ -Duselongdouble
  [stdio] -Dcc=g++ -Duse64bitall DEBUGGING
~~ ../cpan/Test-Simple/t/Legacy/subtest/predicate.t ............ FAILED Non-zero exit status: 255 Bad plan.  You planned 5 tests but ran 0.
  [stdio] -Dcc=g++ -Duse64bitall
  [stdio] -Dcc=g++ -Duselongdouble DEBUGGING
  [stdio] -Dcc=g++ DEBUGGING
  [stdio] -Dcc=g++
  [stdio] -Dcc=g++ -Duselongdouble
  [stdio] -Dcc=g++ -Duse64bitall DEBUGGING
~~ ../t/op/filehandle.t ........................................ FAILED Non-zero exit status: 2 No plan found in TAP output
  [stdio] -Dcc=g++ -Duse64bitall
  [stdio] -Dcc=g++ -Duselongdouble DEBUGGING
  [stdio] -Dcc=g++ DEBUGGING
  [stdio] -Dcc=g++
  [stdio] -Dcc=g++ -Duselongdouble
  [stdio] -Dcc=g++ -Duse64bitall DEBUGGING
~~ ../t/mro/pkg_gen.t .......................................... FAILED Non-zero exit status: 2 No plan found in TAP output
  [stdio] -Dcc=g++ -Duse64bitall
  [stdio] -Dcc=g++ -Duselongdouble DEBUGGING
  [stdio] -Dcc=g++ DEBUGGING
  [stdio] -Dcc=g++
  [stdio] -Dcc=g++ -Duselongdouble
  [stdio] -Dcc=g++ -Duse64bitall DEBUGGING
~~ ../t/op/multideref.t ........................................ FAILED Non-zero exit status: 2 No plan found in TAP output
  [stdio] -Dcc=g++ -Duse64bitall
  [stdio] -Dcc=g++ -Duselongdouble DEBUGGING
  [stdio] -Dcc=g++ DEBUGGING
  [stdio] -Dcc=g++
  [stdio] -Dcc=g++ -Duselongdouble
  [stdio] -Dcc=g++ -Duse64bitall DEBUGGING
~~ ../t/op/catch.t ............................................. FAILED Non-zero exit status: 2 No plan found in TAP output
  [stdio] -Dcc=g++ -Duse64bitall
  [stdio] -Dcc=g++ -Duselongdouble DEBUGGING
  [stdio] -Dcc=g++ DEBUGGING
  [stdio] -Dcc=g++
  [stdio] -Dcc=g++ -Duselongdouble
  [stdio] -Dcc=g++ -Duse64bitall DEBUGGING
~~ ../t/op/hashassign.t ........................................ FAILED Non-zero exit status: 2 No plan found in TAP output
  [stdio] -Dcc=g++ -Duse64bitall
  [stdio] -Dcc=g++ -Duselongdouble DEBUGGING
  [stdio] -Dcc=g++ DEBUGGING
  [stdio] -Dcc=g++
  [stdio] -Dcc=g++ -Duselongdouble
  [stdio] -Dcc=g++ -Duse64bitall DEBUGGING
~~ ../t/run/switches.t ......................................... FAILED Non-zero exit status: 2 No plan found in TAP output
  [stdio] -Dcc=g++ -Duse64bitall
  [stdio] -Dcc=g++ -Duselongdouble DEBUGGING
  [stdio] -Dcc=g++ DEBUGGING
  [stdio] -Dcc=g++
  [stdio] -Dcc=g++ -Duselongdouble
  [stdio] -Dcc=g++ -Duse64bitall DEBUGGING
~~ ../t/op/require_override.t .................................. FAILED Non-zero exit status: 2 No plan found in TAP output
  [stdio] -Dcc=g++ -Duse64bitall
  [stdio] -Dcc=g++ -Duselongdouble DEBUGGING
  [stdio] -Dcc=g++ DEBUGGING
  [stdio] -Dcc=g++
  [stdio] -Dcc=g++ -Duselongdouble
  [stdio] -Dcc=g++ -Duse64bitall DEBUGGING
~~ ../ext/File-Glob/t/threads.t ................................ FAILED Non-zero exit status: 2 No plan found in TAP output
  [stdio] -Dcc=g++ -Duse64bitall
  [stdio] -Dcc=g++ -Duselongdouble DEBUGGING
  [stdio] -Dcc=g++ DEBUGGING
  [stdio] -Dcc=g++
  [stdio] -Dcc=g++ -Duselongdouble
  [stdio] -Dcc=g++ -Duse64bitall DEBUGGING
~~ ../t/uni/lex_utf8.t ......................................... FAILED Non-zero exit status: 2 No plan found in TAP output
  [stdio] -Dcc=g++ -Duse64bitall
  [stdio] -Dcc=g++ -Duselongdouble DEBUGGING
  [stdio] -Dcc=g++ DEBUGGING
  [stdio] -Dcc=g++
  [stdio] -Dcc=g++ -Duselongdouble
  [stdio] -Dcc=g++ -Duse64bitall DEBUGGING
~~ ../t/run/switchF.t .......................................... FAILED Non-zero exit status: 2 No plan found in TAP output
  [stdio] -Dcc=g++ -Duse64bitall
  [stdio] -Dcc=g++ -Duselongdouble DEBUGGING
  [stdio] -Dcc=g++ DEBUGGING
  [stdio] -Dcc=g++
  [stdio] -Dcc=g++ -Duselongdouble
  [stdio] -Dcc=g++ -Duse64bitall DEBUGGING
~~ ../t/op/fresh_perl_utf8.t ................................... FAILED Non-zero exit status: 2 No plan found in TAP output
  [stdio] -Dcc=g++ -Duse64bitall
  [stdio] -Dcc=g++ -Duselongdouble DEBUGGING
  [stdio] -Dcc=g++ DEBUGGING
  [stdio] -Dcc=g++
  [stdio] -Dcc=g++ -Duselongdouble
  [stdio] -Dcc=g++ -Duse64bitall DEBUGGING
~~ ../ext/File-Glob/t/basic.t .................................. FAILED Non-zero exit status: 2 No plan found in TAP output
  [stdio] -Dcc=g++ -Duse64bitall
  [stdio] -Dcc=g++ -Duselongdouble DEBUGGING
  [stdio] -Dcc=g++ DEBUGGING
  [stdio] -Dcc=g++
  [stdio] -Dcc=g++ -Duselongdouble
  [stdio] -Dcc=g++ -Duse64bitall DEBUGGING
~~ ../cpan/Test-Simple/t/Test2/legacy/TAP.t .................... FAILED Non-zero exit status: 255 No plan found in TAP output
  [stdio] -Dcc=g++ -Duse64bitall
  [stdio] -Dcc=g++ -Duselongdouble DEBUGGING
  [stdio] -Dcc=g++ DEBUGGING
  [stdio] -Dcc=g++
  [stdio] -Dcc=g++ -Duselongdouble
  [stdio] -Dcc=g++ -Duse64bitall DEBUGGING
~~ ../t/re/speed_thr.t ......................................... FAILED Non-zero exit status: 2 No plan found in TAP output
  [stdio] -Dcc=g++ -Duse64bitall
  [stdio] -Dcc=g++ -Duselongdouble DEBUGGING
  [stdio] -Dcc=g++ DEBUGGING
  [stdio] -Dcc=g++
  [stdio] -Dcc=g++ -Duselongdouble
  [stdio] -Dcc=g++ -Duse64bitall DEBUGGING
~~ ../t/op/qr.t ................................................ FAILED Non-zero exit status: 2 No plan found in TAP output
  [stdio] -Dcc=g++ -Duse64bitall
  [stdio] -Dcc=g++ -Duselongdouble DEBUGGING
  [stdio] -Dcc=g++ DEBUGGING
  [stdio] -Dcc=g++
  [stdio] -Dcc=g++ -Duselongdouble
  [stdio] -Dcc=g++ -Duse64bitall DEBUGGING
~~ ../t/io/tell.t .............................................. FAILED Non-zero exit status: 2 No plan found in TAP output
  [stdio] -Dcc=g++ -Duse64bitall
  [stdio] -Dcc=g++ -Duselongdouble DEBUGGING
  [stdio] -Dcc=g++ DEBUGGING
  [stdio] -Dcc=g++
  [stdio] -Dcc=g++ -Duselongdouble
  [stdio] -Dcc=g++ -Duse64bitall DEBUGGING
~~ ../dist/autouse/t/autouse.t ................................. FAILED Non-zero exit status: 255 Bad plan.  You planned 15 tests but ran 0.
  [stdio] -Dcc=g++ -Duse64bitall
  [stdio] -Dcc=g++ -Duselongdouble DEBUGGING
  [stdio] -Dcc=g++ DEBUGGING
  [stdio] -Dcc=g++
  [stdio] -Dcc=g++ -Duselongdouble
  [stdio] -Dcc=g++ -Duse64bitall DEBUGGING
~~ ../t/op/const-optree.t ...................................... FAILED Non-zero exit status: 2 No plan found in TAP output
  [stdio] -Dcc=g++ -Duse64bitall
  [stdio] -Dcc=g++ -Duselongdouble DEBUGGING
  [stdio] -Dcc=g++ DEBUGGING
  [stdio] -Dcc=g++
  [stdio] -Dcc=g++ -Duselongdouble
  [stdio] -Dcc=g++ -Duse64bitall DEBUGGING
~~ ../t/uni/parser.t ........................................... FAILED Non-zero exit status: 2 No plan found in TAP output
  [stdio] -Dcc=g++ -Duse64bitall
  [stdio] -Dcc=g++ -Duselongdouble DEBUGGING
  [stdio] -Dcc=g++ DEBUGGING
  [stdio] -Dcc=g++
  [stdio] -Dcc=g++ -Duselongdouble
  [stdio] -Dcc=g++ -Duse64bitall DEBUGGING
~~ ../t/op/index_thr.t ......................................... FAILED Non-zero exit status: 2 No plan found in TAP output
  [stdio] -Dcc=g++ -Duse64bitall
  [stdio] -Dcc=g++ -Duselongdouble DEBUGGING
  [stdio] -Dcc=g++ DEBUGGING
  [stdio] -Dcc=g++
  [stdio] -Dcc=g++ -Duselongdouble
  [stdio] -Dcc=g++ -Duse64bitall DEBUGGING
~~ ../cpan/Test-Simple/t/Legacy/exit.t ......................... FAILED 1-258
  [stdio] -Dcc=g++ -Duselongdouble DEBUGGING
~~ ../t/op/current_sub.t ....................................... FAILED Non-zero exit status: 2 No plan found in TAP output
  [stdio] -Dcc=g++ -Duse64bitall
  [stdio] -Dcc=g++ -Duselongdouble DEBUGGING
  [stdio] -Dcc=g++ DEBUGGING
  [stdio] -Dcc=g++
  [stdio] -Dcc=g++ -Duselongdouble
  [stdio] -Dcc=g++ -Duse64bitall DEBUGGING
~~ ../lib/proxy_constant_subs.t ................................ FAILED Non-zero exit status: 2 No plan found in TAP output
  [stdio] -Dcc=g++ -Duse64bitall
  [stdio] -Dcc=g++ -Duselongdouble DEBUGGING
  [stdio] -Dcc=g++ DEBUGGING
  [stdio] -Dcc=g++
  [stdio] -Dcc=g++ -Duselongdouble
  [stdio] -Dcc=g++ -Duse64bitall DEBUGGING
~~ ../t/io/nargv.t ............................................. FAILED Non-zero exit status: 2 No plan found in TAP output
  [stdio] -Dcc=g++ -Duse64bitall
  [stdio] -Dcc=g++ -Duselongdouble DEBUGGING
  [stdio] -Dcc=g++ DEBUGGING
  [stdio] -Dcc=g++
  [stdio] -Dcc=g++ -Duselongdouble
  [stdio] -Dcc=g++ -Duse64bitall DEBUGGING
~~ ../cpan/Test-Simple/t/Legacy/exit.t ......................... FAILED 1-260
  [stdio] -Dcc=g++ -Duse64bitall DEBUGGING
~~ ../t/uni/opcroak.t .......................................... FAILED Non-zero exit status: 2 No plan found in TAP output
  [stdio] -Dcc=g++ -Duse64bitall
  [stdio] -Dcc=g++ -Duselongdouble DEBUGGING
  [stdio] -Dcc=g++ DEBUGGING
  [stdio] -Dcc=g++
  [stdio] -Dcc=g++ -Duselongdouble
  [stdio] -Dcc=g++ -Duse64bitall DEBUGGING
~~ ../lib/no_load.t ............................................ FAILED Non-zero exit status: 2 No plan found in TAP output
  [stdio] -Dcc=g++ -Duse64bitall
  [stdio] -Dcc=g++ -Duselongdouble DEBUGGING
  [stdio] -Dcc=g++ DEBUGGING
  [stdio] -Dcc=g++
  [stdio] -Dcc=g++ -Duselongdouble
  [stdio] -Dcc=g++ -Duse64bitall DEBUGGING
~~ ../t/uni/class.t ............................................ FAILED Non-zero exit status: 2 No plan found in TAP output
  [stdio] -Dcc=g++ -Duse64bitall
  [stdio] -Dcc=g++ -Duselongdouble DEBUGGING
  [stdio] -Dcc=g++ DEBUGGING
  [stdio] -Dcc=g++
  [stdio] -Dcc=g++ -Duselongdouble
  [stdio] -Dcc=g++ -Duse64bitall DEBUGGING
~~ ../t/io/perlio.t ............................................ FAILED Non-zero exit status: 2 No plan found in TAP output
  [stdio] -Dcc=g++ -Duse64bitall
  [stdio] -Dcc=g++ -Duselongdouble DEBUGGING
  [stdio] -Dcc=g++ DEBUGGING
  [stdio] -Dcc=g++
  [stdio] -Dcc=g++ -Duselongdouble
  [stdio] -Dcc=g++ -Duse64bitall DEBUGGING
~~ ../t/op/inccode-tie.t ....................................... FAILED Non-zero exit status: 2 No plan found in TAP output
  [stdio] -Dcc=g++ -Duse64bitall
  [stdio] -Dcc=g++ -Duselongdouble DEBUGGING
  [stdio] -Dcc=g++ DEBUGGING
  [stdio] -Dcc=g++
  [stdio] -Dcc=g++ -Duselongdouble
  [stdio] -Dcc=g++ -Duse64bitall DEBUGGING
~~ ../cpan/Test-Simple/t/Test2/acceptance/try_it_no_plan.t ..... FAILED Non-zero exit status: 255 No plan found in TAP output
  [stdio] -Dcc=g++ -Duse64bitall
  [stdio] -Dcc=g++ -Duselongdouble DEBUGGING
  [stdio] -Dcc=g++ DEBUGGING
  [stdio] -Dcc=g++
  [stdio] -Dcc=g++ -Duselongdouble
  [stdio] -Dcc=g++ -Duse64bitall DEBUGGING
~~ ../t/op/decl-refs.t ......................................... FAILED Non-zero exit status: 2 No plan found in TAP output
  [stdio] -Dcc=g++ -Duse64bitall
  [stdio] -Dcc=g++ -Duselongdouble DEBUGGING
  [stdio] -Dcc=g++ DEBUGGING
  [stdio] -Dcc=g++
  [stdio] -Dcc=g++ -Duselongdouble
  [stdio] -Dcc=g++ -Duse64bitall DEBUGGING
~~ ../t/op/hash.t .............................................. FAILED Non-zero exit status: 2 No plan found in TAP output
  [stdio] -Dcc=g++ -Duse64bitall
  [stdio] -Dcc=g++ -Duselongdouble DEBUGGING
  [stdio] -Dcc=g++ DEBUGGING
  [stdio] -Dcc=g++
  [stdio] -Dcc=g++ -Duselongdouble
  [stdio] -Dcc=g++ -Duse64bitall DEBUGGING
~~ ../ext/File-DosGlob/t/DosGlob.t ............................. FAILED Non-zero exit status: 255 Bad plan.  You planned 21 tests but ran 0.
  [stdio] -Dcc=g++ -Duse64bitall
  [stdio] -Dcc=g++ -Duselongdouble DEBUGGING
  [stdio] -Dcc=g++ DEBUGGING
  [stdio] -Dcc=g++
  [stdio] -Dcc=g++ -Duselongdouble
  [stdio] -Dcc=g++ -Duse64bitall DEBUGGING

Test todo-passed:
~~ ../dist/Safe/t/safesort.t ................................... PASSED 10
  [stdio] -Dcc=g++ -Duse64bitall
  [stdio] -Dcc=g++ -Duselongdouble DEBUGGING
  [stdio] -Dcc=g++ DEBUGGING
  [stdio] -Dcc=g++
  [stdio] -Dcc=g++ -Duselongdouble
  [stdio] -Dcc=g++ -Duse64bitall DEBUGGING

MANIFEST messages:
  MANIFEST did not declare '.mailmap'

Compiler messages:
  /usr/include/sys/cdefs_elf.h:67:20: error: missing binary operator before token "("
  /usr/include/sys/cdefs_elf.h:73:20: error: missing binary operator before token "("
  /usr/include/sys/cdefs_elf.h:79:20: error: missing binary operator before token "("
  inflate.c: In function 'int inflate(z_streamp, int)':
  inflate.c:724:25: warning: this statement may fall through [-Wimplicit-fallthrough=]
  inflate.c:725:9: note: here
  inflate.c:732:25: warning: this statement may fall through [-Wimplicit-fallthrough=]
  inflate.c:733:9: note: here
  inflate.c:947:25: warning: this statement may fall through [-Wimplicit-fallthrough=]
  inflate.c:948:9: note: here
  inflate.c:968:25: warning: this statement may fall through [-Wimplicit-fallthrough=]
  inflate.c:969:9: note: here
  DB_File.xs: In function 'DB_File_type* ParseOpenInfo(int, char*, int, int, SV*)':
  DB_File.xs:476:44: warning: suggest braces around empty body in an 'if' statement [-Wempty-body]
  DB_File.xs:1044:13: note: in expansion of macro 'croak_and_free'
  DB_File.xs:1050:13: note: in expansion of macro 'croak_and_free'
  DB_File.xs:1056:17: note: in expansion of macro 'croak_and_free'
  DB_File.xs:1091:17: note: in expansion of macro 'croak_and_free'
  DB_File.xs:1140:17: note: in expansion of macro 'croak_and_free'
  DB_File.xs:1229:13: note: in expansion of macro 'croak_and_free'
  Socket.c: In function 'void XS_Socket_pack_ip_mreq_source(CV*)':
  Socket.c:1673:7: warning: variable 'interface' set but not used [-Wunused-but-set-variable]
  const-c.inc: In function 'int constant_19(const char*, IV*)':
  const-c.inc:351:42: warning: unused parameter 'iv_return' [-Wunused-parameter]
  HiRes.xs: In function 'void XS_Time__HiRes_setitimer(CV*)':
  HiRes.xs:1436:42: warning: option '-Wc++-compat' is valid for C/ObjC but not for C++ [-Wpragmas]
  HiRes.xs: In function 'void XS_Time__HiRes_getitimer(CV*)':
  HiRes.xs:1456:42: warning: option '-Wc++-compat' is valid for C/ObjC but not for C++ [-Wpragmas]
  Piece.xs: In function 'char* _strptime(const char*, const char*, tm*, int*)':
  Piece.xs:719:8: warning: 'len' may be used uninitialized in this function [-Wmaybe-uninitialized]
  re_exec.c: In function 'bool S_regtry(regmatch_info*, char**)':
  re_exec.c:6539:38: warning: 'fold_array' may be used uninitialized in this function [-Wmaybe-uninitialized]
  re_exec.c:6443:17: note: 'fold_array' was declared here
  re_exec.c:6545:28: warning: 'folder' may be used uninitialized in this function [-Wmaybe-uninitialized]
  re_exec.c:6442:16: note: 'folder' was declared here
  regexec.c: In function 'bool S_regtry(regmatch_info*, char**)':
  regexec.c:6539:38: warning: 'fold_array' may be used uninitialized in this function [-Wmaybe-uninitialized]
  regexec.c:6443:17: note: 'fold_array' was declared here
  regexec.c:6545:28: warning: 'folder' may be used uninitialized in this function [-Wmaybe-uninitialized]
  regexec.c:6442:16: note: 'folder' was declared here
  Storable.xs: In function 'int store_scalar(stcxt_t*, SV*)':
  Storable.xs:2585:75: warning: format '%f' expects argument of type 'double', but argument 2 has type 'NV_bytes' [-Wformat=]
  Storable.xs:131:30: note: in definition of macro 'TRACEME'
  Storable.xs:2585:75: warning: format '%Lf' expects argument of type 'long double', but argument 2 has type 'NV_bytes' [-Wformat=]
  time64.c: In function 'TM64* Perl_localtime64_r(const Time64_T*, TM64*)':
  time64.c:573:30: warning: 'orig_year' may be used uninitialized in this function [-Wmaybe-uninitialized]
  DB_File.xs: In function 'DB_File_type* ParseOpenInfo(PerlInterpreter*, int, char*, int, int, SV*)':
  Socket.c: In function 'void XS_Socket_pack_ip_mreq_source(PerlInterpreter*, CV*)':
  Storable.xs: In function 'int store_hash(PerlInterpreter*, stcxt_t*, HV*)':
  ../../thread.h:314:57: error: invalid conversion from 'void*' to 'PerlInterpreter* {aka interpreter*}' [-fpermissive]
  ../../thread.h:318:28: note: in expansion of macro 'PTHREAD_GETSPECIFIC'
  Storable.xs:1363:38: note: in expansion of macro 'PERL_GET_CONTEXT'
  Storable.xs:2921:9: note: in expansion of macro 'STORE_HASH_SORT'
  regexec.c: In function 'bool S_regtry(PerlInterpreter*, regmatch_info*, char**)':
  Storable.xs: In function 'int store_scalar(PerlInterpreter*, stcxt_t*, SV*)':

About this smoke:
    smoking-perl: 5.26.1
  smoker-version: 1.71/0.046
       timestamp: 2020-07-12 05:55:07+00
          tester: core

-- 
Report generated by Test::Smoke::Gateway v0.09_01