Show logfile
Automated smoke report for branch smoke-me/jkeenan/sugar-magnolia 7.0.0 patch 39568decb91df7e01426bdd32a20f626e3953186 v5.32.0-586-g39568decb9
cjg-openbsd6: Intel(R) Xeon(R) CPU E5-2620 v2 @ 2.10GHz (2110 MHz) (amd64/1 cpus)
    on        openbsd 6.7
    using     clang++ version 4.2.1 Compatible OpenBSD Clang 8.0.1 (tags/RELEASE_801/final) (*1)
    smoketime 6 hours 27 minutes (average 32 minutes 18 seconds)

Summary: FAIL(FM)

O = OK  F = Failure(s), extended report at the bottom
X = Failure(s) under TEST but not under harness
? = still running or test results not (yet) available
Build failures during:       - = unknown or N/A
c = Configure, m = make, M = make (after miniperl), t = make test-prep

v5.32.0-586-g39568decb9
---------------------- ----------------------------------------------------
-  F  -  F              -Dcc=clang++ (*1)
-  F  -  F              -Dcc=clang++ -Duse64bitall (*1)
-  F  -  F              -Dcc=clang++ -Duselongdouble (*1)
M  -  M  -              -Dcc=clang++ -Duseithreads (*1)
M  -  M  -              -Dcc=clang++ -Duseithreads -Duse64bitall (*1)
M  -  M  -              -Dcc=clang++ -Duseithreads -Duselongdouble (*1)
|  |  |  |
|  |  |  +------------  stdio DEBUGGING
|  |  +---------------  minitest DEBUGGING
|  +------------------  stdio
+---------------------  minitest

Applied patches:
  SMOKE39568decb91df7e01426bdd32a20f626e3953186

Skipped tests:
      # One test name on a line

Test failures:
~~ ../t/op/exists_sub.t ........................................ FAILED Non-zero exit status: 2 No plan found in TAP output
  [stdio] -Dcc=clang++ -Duse64bitall DEBUGGING
  [stdio] -Dcc=clang++ -Duse64bitall
  [stdio] -Dcc=clang++
  [stdio] -Dcc=clang++ DEBUGGING
  [stdio] -Dcc=clang++ -Duselongdouble
  [stdio] -Dcc=clang++ -Duselongdouble DEBUGGING
~~ ../t/porting/args_assert.t .................................. FAILED Non-zero exit status: 2 No plan found in TAP output
  [stdio] -Dcc=clang++ -Duse64bitall DEBUGGING
  [stdio] -Dcc=clang++ -Duse64bitall
  [stdio] -Dcc=clang++
  [stdio] -Dcc=clang++ DEBUGGING
  [stdio] -Dcc=clang++ -Duselongdouble
  [stdio] -Dcc=clang++ -Duselongdouble DEBUGGING
~~ ../cpan/Tie-RefHash/t/storable.t ............................ FAILED Non-zero exit status: 255 No plan found in TAP output
  [stdio] -Dcc=clang++ -Duse64bitall DEBUGGING
  [stdio] -Dcc=clang++ -Duse64bitall
  [stdio] -Dcc=clang++
  [stdio] -Dcc=clang++ DEBUGGING
  [stdio] -Dcc=clang++ -Duselongdouble
  [stdio] -Dcc=clang++ -Duselongdouble DEBUGGING
~~ ../t/uni/labels.t ........................................... FAILED Non-zero exit status: 2 No plan found in TAP output
  [stdio] -Dcc=clang++ -Duse64bitall DEBUGGING
  [stdio] -Dcc=clang++ -Duse64bitall
  [stdio] -Dcc=clang++
  [stdio] -Dcc=clang++ DEBUGGING
  [stdio] -Dcc=clang++ -Duselongdouble
  [stdio] -Dcc=clang++ -Duselongdouble DEBUGGING
~~ ../t/io/errno.t ............................................. FAILED Non-zero exit status: 2 No plan found in TAP output
  [stdio] -Dcc=clang++ -Duse64bitall DEBUGGING
  [stdio] -Dcc=clang++ -Duse64bitall
  [stdio] -Dcc=clang++
  [stdio] -Dcc=clang++ DEBUGGING
  [stdio] -Dcc=clang++ -Duselongdouble
  [stdio] -Dcc=clang++ -Duselongdouble DEBUGGING
~~ ../t/op/cproto.t ............................................ FAILED Non-zero exit status: 2 No plan found in TAP output
  [stdio] -Dcc=clang++ -Duse64bitall DEBUGGING
  [stdio] -Dcc=clang++ -Duse64bitall
  [stdio] -Dcc=clang++
  [stdio] -Dcc=clang++ DEBUGGING
  [stdio] -Dcc=clang++ -Duselongdouble
  [stdio] -Dcc=clang++ -Duselongdouble DEBUGGING
~~ ../t/op/dbm.t ............................................... FAILED Non-zero exit status: 2 No plan found in TAP output
  [stdio] -Dcc=clang++ -Duse64bitall DEBUGGING
  [stdio] -Dcc=clang++ -Duse64bitall
  [stdio] -Dcc=clang++
  [stdio] -Dcc=clang++ DEBUGGING
  [stdio] -Dcc=clang++ -Duselongdouble
  [stdio] -Dcc=clang++ -Duselongdouble DEBUGGING
~~ ../t/re/user_prop_race_thr.t ................................ FAILED Non-zero exit status: 2 No plan found in TAP output
  [stdio] -Dcc=clang++ -Duse64bitall DEBUGGING
  [stdio] -Dcc=clang++ -Duse64bitall
  [stdio] -Dcc=clang++
  [stdio] -Dcc=clang++ DEBUGGING
  [stdio] -Dcc=clang++ -Duselongdouble
  [stdio] -Dcc=clang++ -Duselongdouble DEBUGGING
~~ ../t/uni/tie.t .............................................. FAILED Non-zero exit status: 2 No plan found in TAP output
  [stdio] -Dcc=clang++ -Duse64bitall DEBUGGING
  [stdio] -Dcc=clang++ -Duse64bitall
  [stdio] -Dcc=clang++
  [stdio] -Dcc=clang++ DEBUGGING
  [stdio] -Dcc=clang++ -Duselongdouble
  [stdio] -Dcc=clang++ -Duselongdouble DEBUGGING
~~ ../ext/POSIX/t/posix.t ...................................... FAILED Non-zero exit status: 255 No plan found in TAP output
  [stdio] -Dcc=clang++ -Duse64bitall DEBUGGING
  [stdio] -Dcc=clang++ -Duse64bitall
  [stdio] -Dcc=clang++
  [stdio] -Dcc=clang++ DEBUGGING
  [stdio] -Dcc=clang++ -Duselongdouble
  [stdio] -Dcc=clang++ -Duselongdouble DEBUGGING
~~ ../cpan/ExtUtils-MakeMaker/t/min_perl_version.t ............. FAILED 16 Non-zero exit status: 1
  [stdio] -Dcc=clang++ -Duse64bitall DEBUGGING
  [stdio] -Dcc=clang++ -Duse64bitall
  [stdio] -Dcc=clang++
  [stdio] -Dcc=clang++ DEBUGGING
  [stdio] -Dcc=clang++ -Duselongdouble
  [stdio] -Dcc=clang++ -Duselongdouble DEBUGGING
~~ ../t/op/lex_assign.t ........................................ FAILED Non-zero exit status: 2 No plan found in TAP output
  [stdio] -Dcc=clang++ -Duse64bitall DEBUGGING
  [stdio] -Dcc=clang++ -Duse64bitall
  [stdio] -Dcc=clang++
  [stdio] -Dcc=clang++ DEBUGGING
  [stdio] -Dcc=clang++ -Duselongdouble
  [stdio] -Dcc=clang++ -Duselongdouble DEBUGGING
~~ ../t/op/tiehandle.t ......................................... FAILED Non-zero exit status: 2 No plan found in TAP output
  [stdio] -Dcc=clang++ -Duse64bitall DEBUGGING
  [stdio] -Dcc=clang++ -Duse64bitall
  [stdio] -Dcc=clang++
  [stdio] -Dcc=clang++ DEBUGGING
  [stdio] -Dcc=clang++ -Duselongdouble
  [stdio] -Dcc=clang++ -Duselongdouble DEBUGGING
~~ ../t/op/loopctl.t ........................................... FAILED Non-zero exit status: 2 No plan found in TAP output
  [stdio] -Dcc=clang++ -Duse64bitall DEBUGGING
  [stdio] -Dcc=clang++ -Duse64bitall
  [stdio] -Dcc=clang++
  [stdio] -Dcc=clang++ DEBUGGING
  [stdio] -Dcc=clang++ -Duselongdouble
  [stdio] -Dcc=clang++ -Duselongdouble DEBUGGING
~~ ../t/op/time_loop.t ......................................... FAILED Non-zero exit status: 2 No plan found in TAP output
  [stdio] -Dcc=clang++ -Duse64bitall DEBUGGING
  [stdio] -Dcc=clang++ -Duse64bitall
  [stdio] -Dcc=clang++
  [stdio] -Dcc=clang++ DEBUGGING
  [stdio] -Dcc=clang++ -Duselongdouble
  [stdio] -Dcc=clang++ -Duselongdouble DEBUGGING
~~ ../t/re/regexp_qr_embed_thr.t ............................... FAILED Non-zero exit status: 2 No plan found in TAP output
  [stdio] -Dcc=clang++ -Duse64bitall DEBUGGING
  [stdio] -Dcc=clang++ -Duse64bitall
  [stdio] -Dcc=clang++
  [stdio] -Dcc=clang++ DEBUGGING
  [stdio] -Dcc=clang++ -Duselongdouble
  [stdio] -Dcc=clang++ -Duselongdouble DEBUGGING
~~ ../t/op/fork.t .............................................. FAILED Non-zero exit status: 2 No plan found in TAP output
  [stdio] -Dcc=clang++ -Duse64bitall DEBUGGING
  [stdio] -Dcc=clang++ -Duse64bitall
  [stdio] -Dcc=clang++
  [stdio] -Dcc=clang++ DEBUGGING
  [stdio] -Dcc=clang++ -Duselongdouble
  [stdio] -Dcc=clang++ -Duselongdouble DEBUGGING
~~ ../t/op/sigsystem.t ......................................... FAILED Non-zero exit status: 2 No plan found in TAP output
  [stdio] -Dcc=clang++ -Duse64bitall DEBUGGING
  [stdio] -Dcc=clang++ -Duse64bitall
  [stdio] -Dcc=clang++
  [stdio] -Dcc=clang++ DEBUGGING
  [stdio] -Dcc=clang++ -Duselongdouble
  [stdio] -Dcc=clang++ -Duselongdouble DEBUGGING
~~ ../ext/IPC-Open3/t/fd.t ..................................... FAILED Non-zero exit status: 2 No plan found in TAP output
  [stdio] -Dcc=clang++ -Duse64bitall DEBUGGING
  [stdio] -Dcc=clang++ -Duse64bitall
  [stdio] -Dcc=clang++
  [stdio] -Dcc=clang++ DEBUGGING
  [stdio] -Dcc=clang++ -Duselongdouble
  [stdio] -Dcc=clang++ -Duselongdouble DEBUGGING
~~ ../t/uni/title.t ............................................ FAILED Non-zero exit status: 2 No plan found in TAP output
  [stdio] -Dcc=clang++ -Duse64bitall DEBUGGING
  [stdio] -Dcc=clang++ -Duse64bitall
  [stdio] -Dcc=clang++
  [stdio] -Dcc=clang++ DEBUGGING
  [stdio] -Dcc=clang++ -Duselongdouble
  [stdio] -Dcc=clang++ -Duselongdouble DEBUGGING
~~ ../t/op/readline.t .......................................... FAILED Non-zero exit status: 2 No plan found in TAP output
  [stdio] -Dcc=clang++ -Duse64bitall DEBUGGING
  [stdio] -Dcc=clang++ -Duse64bitall
  [stdio] -Dcc=clang++
  [stdio] -Dcc=clang++ DEBUGGING
  [stdio] -Dcc=clang++ -Duselongdouble
  [stdio] -Dcc=clang++ -Duselongdouble DEBUGGING
~~ ../t/op/tr.t ................................................ FAILED Non-zero exit status: 2 No plan found in TAP output
  [stdio] -Dcc=clang++ -Duse64bitall DEBUGGING
  [stdio] -Dcc=clang++ -Duse64bitall
  [stdio] -Dcc=clang++
  [stdio] -Dcc=clang++ DEBUGGING
  [stdio] -Dcc=clang++ -Duselongdouble
  [stdio] -Dcc=clang++ -Duselongdouble DEBUGGING
~~ ../t/op/kill0.t ............................................. FAILED Non-zero exit status: 2 No plan found in TAP output
  [stdio] -Dcc=clang++ -Duse64bitall DEBUGGING
  [stdio] -Dcc=clang++ -Duse64bitall
  [stdio] -Dcc=clang++
  [stdio] -Dcc=clang++ DEBUGGING
  [stdio] -Dcc=clang++ -Duselongdouble
  [stdio] -Dcc=clang++ -Duselongdouble DEBUGGING
~~ ../ext/B/t/optree_samples.t ................................. FAILED Non-zero exit status: 2 No plan found in TAP output
  [stdio] -Dcc=clang++ -Duse64bitall DEBUGGING
  [stdio] -Dcc=clang++ -Duse64bitall
  [stdio] -Dcc=clang++
  [stdio] -Dcc=clang++ DEBUGGING
  [stdio] -Dcc=clang++ -Duselongdouble
  [stdio] -Dcc=clang++ -Duselongdouble DEBUGGING
~~ ../cpan/Compress-Raw-Bzip2/t/19nonpv.t ...................... FAILED Non-zero exit status: 255 No plan found in TAP output
  [stdio] -Dcc=clang++ -Duse64bitall DEBUGGING
  [stdio] -Dcc=clang++ -Duse64bitall
  [stdio] -Dcc=clang++
  [stdio] -Dcc=clang++ DEBUGGING
  [stdio] -Dcc=clang++ -Duselongdouble
  [stdio] -Dcc=clang++ -Duselongdouble DEBUGGING
~~ ../t/mro/isa_aliases_utf8.t ................................. FAILED Non-zero exit status: 2 No plan found in TAP output
  [stdio] -Dcc=clang++ -Duse64bitall DEBUGGING
  [stdio] -Dcc=clang++ -Duse64bitall
  [stdio] -Dcc=clang++
  [stdio] -Dcc=clang++ DEBUGGING
  [stdio] -Dcc=clang++ -Duselongdouble
  [stdio] -Dcc=clang++ -Duselongdouble DEBUGGING
~~ ../t/uni/greek.t ............................................ FAILED Non-zero exit status: 2 No plan found in TAP output
  [stdio] -Dcc=clang++ -Duse64bitall DEBUGGING
  [stdio] -Dcc=clang++ -Duse64bitall
  [stdio] -Dcc=clang++
  [stdio] -Dcc=clang++ DEBUGGING
  [stdio] -Dcc=clang++ -Duselongdouble
  [stdio] -Dcc=clang++ -Duselongdouble DEBUGGING
~~ ../t/io/read.t .............................................. FAILED Non-zero exit status: 2 No plan found in TAP output
  [stdio] -Dcc=clang++ -Duse64bitall DEBUGGING
  [stdio] -Dcc=clang++ -Duse64bitall
  [stdio] -Dcc=clang++
  [stdio] -Dcc=clang++ DEBUGGING
  [stdio] -Dcc=clang++ -Duselongdouble
  [stdio] -Dcc=clang++ -Duselongdouble DEBUGGING
~~ ../dist/threads/t/thread.t .................................. FAILED Non-zero exit status: 2 No plan found in TAP output
  [stdio] -Dcc=clang++ -Duse64bitall DEBUGGING
  [stdio] -Dcc=clang++ -Duse64bitall
  [stdio] -Dcc=clang++
  [stdio] -Dcc=clang++ DEBUGGING
  [stdio] -Dcc=clang++ -Duselongdouble
  [stdio] -Dcc=clang++ -Duselongdouble DEBUGGING
~~ ../t/op/array.t ............................................. FAILED Non-zero exit status: 2 No plan found in TAP output
  [stdio] -Dcc=clang++ -Duse64bitall DEBUGGING
  [stdio] -Dcc=clang++ -Duse64bitall
  [stdio] -Dcc=clang++
  [stdio] -Dcc=clang++ DEBUGGING
  [stdio] -Dcc=clang++ -Duselongdouble
  [stdio] -Dcc=clang++ -Duselongdouble DEBUGGING
~~ ../lib/Config.t ............................................. FAILED Non-zero exit status: 2 No plan found in TAP output
  [stdio] -Dcc=clang++ -Duse64bitall DEBUGGING
  [stdio] -Dcc=clang++ -Duse64bitall
  [stdio] -Dcc=clang++
  [stdio] -Dcc=clang++ DEBUGGING
  [stdio] -Dcc=clang++ -Duselongdouble
  [stdio] -Dcc=clang++ -Duselongdouble DEBUGGING
~~ ../dist/Devel-PPPort/t/ppphtest.t ........................... FAILED 5-13 50-53 83-84 118-132 152-161 202-204 Bad plan.  You planned 238 tests but ran 209.
  [stdio] -Dcc=clang++ -Duse64bitall DEBUGGING
  [stdio] -Dcc=clang++ -Duse64bitall
  [stdio] -Dcc=clang++
  [stdio] -Dcc=clang++ DEBUGGING
  [stdio] -Dcc=clang++ -Duselongdouble
  [stdio] -Dcc=clang++ -Duselongdouble DEBUGGING
~~ ../ext/File-Glob/t/case.t ................................... FAILED Non-zero exit status: 2 No plan found in TAP output
  [stdio] -Dcc=clang++ -Duse64bitall DEBUGGING
  [stdio] -Dcc=clang++ -Duse64bitall
  [stdio] -Dcc=clang++
  [stdio] -Dcc=clang++ DEBUGGING
  [stdio] -Dcc=clang++ -Duselongdouble
  [stdio] -Dcc=clang++ -Duselongdouble DEBUGGING
~~ ../t/op/flip.t .............................................. FAILED Non-zero exit status: 2 No plan found in TAP output
  [stdio] -Dcc=clang++ -Duse64bitall DEBUGGING
  [stdio] -Dcc=clang++ -Duse64bitall
  [stdio] -Dcc=clang++
  [stdio] -Dcc=clang++ DEBUGGING
  [stdio] -Dcc=clang++ -Duselongdouble
  [stdio] -Dcc=clang++ -Duselongdouble DEBUGGING
~~ ../ext/B/t/showlex.t ........................................ FAILED Non-zero exit status: 2 No plan found in TAP output
  [stdio] -Dcc=clang++ -Duse64bitall DEBUGGING
  [stdio] -Dcc=clang++ -Duse64bitall
  [stdio] -Dcc=clang++
  [stdio] -Dcc=clang++ DEBUGGING
  [stdio] -Dcc=clang++ -Duselongdouble
  [stdio] -Dcc=clang++ -Duselongdouble DEBUGGING
~~ ../t/op/inccode.t ........................................... FAILED Non-zero exit status: 2 No plan found in TAP output
  [stdio] -Dcc=clang++ -Duse64bitall DEBUGGING
  [stdio] -Dcc=clang++ -Duse64bitall
  [stdio] -Dcc=clang++
  [stdio] -Dcc=clang++ DEBUGGING
  [stdio] -Dcc=clang++ -Duselongdouble
  [stdio] -Dcc=clang++ -Duselongdouble DEBUGGING
~~ ../t/op/stash.t ............................................. FAILED Non-zero exit status: 2 No plan found in TAP output
  [stdio] -Dcc=clang++ -Duse64bitall DEBUGGING
  [stdio] -Dcc=clang++ -Duse64bitall
  [stdio] -Dcc=clang++
  [stdio] -Dcc=clang++ DEBUGGING
  [stdio] -Dcc=clang++ -Duselongdouble
  [stdio] -Dcc=clang++ -Duselongdouble DEBUGGING
~~ ../t/mro/isa_c3.t ........................................... FAILED Non-zero exit status: 2 No plan found in TAP output
  [stdio] -Dcc=clang++ -Duse64bitall DEBUGGING
  [stdio] -Dcc=clang++ -Duse64bitall
  [stdio] -Dcc=clang++
  [stdio] -Dcc=clang++ DEBUGGING
  [stdio] -Dcc=clang++ -Duselongdouble
  [stdio] -Dcc=clang++ -Duselongdouble DEBUGGING
~~ ../t/run/switchd-78586.t .................................... FAILED Non-zero exit status: 2 No plan found in TAP output
  [stdio] -Dcc=clang++ -Duse64bitall DEBUGGING
  [stdio] -Dcc=clang++ -Duse64bitall
  [stdio] -Dcc=clang++
  [stdio] -Dcc=clang++ DEBUGGING
  [stdio] -Dcc=clang++ -Duselongdouble
  [stdio] -Dcc=clang++ -Duselongdouble DEBUGGING
~~ ../t/uni/latin2.t ........................................... FAILED Non-zero exit status: 2 No plan found in TAP output
  [stdio] -Dcc=clang++ -Duse64bitall DEBUGGING
  [stdio] -Dcc=clang++ -Duse64bitall
  [stdio] -Dcc=clang++
  [stdio] -Dcc=clang++ DEBUGGING
  [stdio] -Dcc=clang++ -Duselongdouble
  [stdio] -Dcc=clang++ -Duselongdouble DEBUGGING
~~ ../ext/XS-APItest/t/xs_special_subs_require.t ............... FAILED 71-73 Non-zero exit status: 3
  [stdio] -Dcc=clang++ -Duse64bitall DEBUGGING
  [stdio] -Dcc=clang++ -Duse64bitall
  [stdio] -Dcc=clang++
  [stdio] -Dcc=clang++ DEBUGGING
  [stdio] -Dcc=clang++ -Duselongdouble
  [stdio] -Dcc=clang++ -Duselongdouble DEBUGGING
~~ ../dist/threads/t/free2.t ................................... FAILED Non-zero exit status: 2 No plan found in TAP output
  [stdio] -Dcc=clang++ -Duse64bitall DEBUGGING
  [stdio] -Dcc=clang++ -Duse64bitall
  [stdio] -Dcc=clang++
  [stdio] -Dcc=clang++ DEBUGGING
  [stdio] -Dcc=clang++ -Duselongdouble
  [stdio] -Dcc=clang++ -Duselongdouble DEBUGGING
~~ ../lib/Symbol.t ............................................. FAILED Non-zero exit status: 255 Bad plan.  You planned 26 tests but ran 0.
  [stdio] -Dcc=clang++ -Duse64bitall DEBUGGING
  [stdio] -Dcc=clang++ -Duse64bitall
  [stdio] -Dcc=clang++
  [stdio] -Dcc=clang++ DEBUGGING
  [stdio] -Dcc=clang++ -Duselongdouble
  [stdio] -Dcc=clang++ -Duselongdouble DEBUGGING
~~ ../t/op/stat.t .............................................. FAILED Non-zero exit status: 2 No plan found in TAP output
  [stdio] -Dcc=clang++ -Duse64bitall DEBUGGING
  [stdio] -Dcc=clang++ -Duse64bitall
  [stdio] -Dcc=clang++
  [stdio] -Dcc=clang++ DEBUGGING
  [stdio] -Dcc=clang++ -Duselongdouble
  [stdio] -Dcc=clang++ -Duselongdouble DEBUGGING
~~ ../t/op/magic-27839.t ....................................... FAILED Non-zero exit status: 2 No plan found in TAP output
  [stdio] -Dcc=clang++ -Duse64bitall DEBUGGING
  [stdio] -Dcc=clang++ -Duse64bitall
  [stdio] -Dcc=clang++
  [stdio] -Dcc=clang++ DEBUGGING
  [stdio] -Dcc=clang++ -Duselongdouble
  [stdio] -Dcc=clang++ -Duselongdouble DEBUGGING
~~ ../ext/File-Find/t/find.t ................................... FAILED Non-zero exit status: 2 No plan found in TAP output
  [stdio] -Dcc=clang++ -Duse64bitall DEBUGGING
  [stdio] -Dcc=clang++ -Duse64bitall
  [stdio] -Dcc=clang++
  [stdio] -Dcc=clang++ DEBUGGING
  [stdio] -Dcc=clang++ -Duselongdouble
  [stdio] -Dcc=clang++ -Duselongdouble DEBUGGING
~~ ../t/op/method.t ............................................ FAILED Non-zero exit status: 2 No plan found in TAP output
  [stdio] -Dcc=clang++ -Duse64bitall DEBUGGING
  [stdio] -Dcc=clang++ -Duse64bitall
  [stdio] -Dcc=clang++
  [stdio] -Dcc=clang++ DEBUGGING
  [stdio] -Dcc=clang++ -Duselongdouble
  [stdio] -Dcc=clang++ -Duselongdouble DEBUGGING
~~ ../t/op/getppid.t ........................................... FAILED Non-zero exit status: 2 No plan found in TAP output
  [stdio] -Dcc=clang++ -Duse64bitall DEBUGGING
  [stdio] -Dcc=clang++ -Duse64bitall
  [stdio] -Dcc=clang++
  [stdio] -Dcc=clang++ DEBUGGING
  [stdio] -Dcc=clang++ -Duselongdouble
  [stdio] -Dcc=clang++ -Duselongdouble DEBUGGING
~~ ../lib/sigtrap.t ............................................ FAILED Non-zero exit status: 2 No plan found in TAP output
  [stdio] -Dcc=clang++ -Duse64bitall DEBUGGING
  [stdio] -Dcc=clang++ -Duse64bitall
  [stdio] -Dcc=clang++
  [stdio] -Dcc=clang++ DEBUGGING
  [stdio] -Dcc=clang++ -Duselongdouble
  [stdio] -Dcc=clang++ -Duselongdouble DEBUGGING
~~ ../t/op/unshift.t ........................................... FAILED Non-zero exit status: 2 No plan found in TAP output
  [stdio] -Dcc=clang++ -Duse64bitall DEBUGGING
  [stdio] -Dcc=clang++ -Duse64bitall
  [stdio] -Dcc=clang++
  [stdio] -Dcc=clang++ DEBUGGING
  [stdio] -Dcc=clang++ -Duselongdouble
  [stdio] -Dcc=clang++ -Duselongdouble DEBUGGING
~~ ../t/uni/fold.t ............................................. FAILED Non-zero exit status: 2 No plan found in TAP output
  [stdio] -Dcc=clang++ -Duse64bitall DEBUGGING
  [stdio] -Dcc=clang++ -Duse64bitall
  [stdio] -Dcc=clang++
  [stdio] -Dcc=clang++ DEBUGGING
  [stdio] -Dcc=clang++ -Duselongdouble
  [stdio] -Dcc=clang++ -Duselongdouble DEBUGGING
~~ ../t/re/fold_grind_u.t ...................................... FAILED Non-zero exit status: 2 No plan found in TAP output
  [stdio] -Dcc=clang++ -Duse64bitall DEBUGGING
  [stdio] -Dcc=clang++ -Duse64bitall
  [stdio] -Dcc=clang++
  [stdio] -Dcc=clang++ DEBUGGING
  [stdio] -Dcc=clang++ -Duselongdouble
  [stdio] -Dcc=clang++ -Duselongdouble DEBUGGING
~~ ../t/io/socketpair.t ........................................ FAILED Non-zero exit status: 2 No plan found in TAP output
  [stdio] -Dcc=clang++ -Duse64bitall DEBUGGING
  [stdio] -Dcc=clang++ -Duse64bitall
  [stdio] -Dcc=clang++
  [stdio] -Dcc=clang++ DEBUGGING
  [stdio] -Dcc=clang++ -Duselongdouble
  [stdio] -Dcc=clang++ -Duselongdouble DEBUGGING
~~ ../dist/Data-Dumper/t/dumper.t .............................. FAILED 1 Non-zero exit status: 2 Bad plan.  You planned 468 tests but ran 36.
  [stdio] -Dcc=clang++ -Duse64bitall DEBUGGING
  [stdio] -Dcc=clang++ -Duse64bitall
  [stdio] -Dcc=clang++
  [stdio] -Dcc=clang++ DEBUGGING
  [stdio] -Dcc=clang++ -Duselongdouble
  [stdio] -Dcc=clang++ -Duselongdouble DEBUGGING
~~ ../t/op/incfilter.t ......................................... FAILED Non-zero exit status: 2 No plan found in TAP output
  [stdio] -Dcc=clang++ -Duse64bitall DEBUGGING
  [stdio] -Dcc=clang++ -Duse64bitall
  [stdio] -Dcc=clang++
  [stdio] -Dcc=clang++ DEBUGGING
  [stdio] -Dcc=clang++ -Duselongdouble
  [stdio] -Dcc=clang++ -Duselongdouble DEBUGGING
~~ ../t/porting/regen.t ........................................ FAILED 20-21
  [stdio] -Dcc=clang++ -Duse64bitall DEBUGGING
  [stdio] -Dcc=clang++ -Duse64bitall
  [stdio] -Dcc=clang++
  [stdio] -Dcc=clang++ DEBUGGING
  [stdio] -Dcc=clang++ -Duselongdouble
  [stdio] -Dcc=clang++ -Duselongdouble DEBUGGING
~~ ../t/perf/taint.t ........................................... FAILED Non-zero exit status: 2 No plan found in TAP output
  [stdio] -Dcc=clang++ -Duse64bitall DEBUGGING
  [stdio] -Dcc=clang++ -Duse64bitall
  [stdio] -Dcc=clang++
  [stdio] -Dcc=clang++ DEBUGGING
  [stdio] -Dcc=clang++ -Duselongdouble
  [stdio] -Dcc=clang++ -Duselongdouble DEBUGGING
~~ ../t/op/write.t ............................................. FAILED Non-zero exit status: 2 No plan found in TAP output
  [stdio] -Dcc=clang++ -Duse64bitall DEBUGGING
  [stdio] -Dcc=clang++ -Duse64bitall
  [stdio] -Dcc=clang++
  [stdio] -Dcc=clang++ DEBUGGING
  [stdio] -Dcc=clang++ -Duselongdouble
  [stdio] -Dcc=clang++ -Duselongdouble DEBUGGING
~~ ../cpan/Time-Piece/t/07arith.t .............................. FAILED Non-zero exit status: 255 Bad plan.  You planned 43 tests but ran 2.
  [stdio] -Dcc=clang++ -Duse64bitall DEBUGGING
  [stdio] -Dcc=clang++ -Duse64bitall
  [stdio] -Dcc=clang++
  [stdio] -Dcc=clang++ DEBUGGING
  [stdio] -Dcc=clang++ -Duselongdouble
  [stdio] -Dcc=clang++ -Duselongdouble DEBUGGING
~~ ../t/op/sigdispatch.t ....................................... FAILED Non-zero exit status: 2 No plan found in TAP output
  [stdio] -Dcc=clang++ -Duse64bitall DEBUGGING
  [stdio] -Dcc=clang++ -Duse64bitall
  [stdio] -Dcc=clang++
  [stdio] -Dcc=clang++ DEBUGGING
  [stdio] -Dcc=clang++ -Duselongdouble
  [stdio] -Dcc=clang++ -Duselongdouble DEBUGGING
~~ ../t/op/exp.t ............................................... FAILED Non-zero exit status: 2 No plan found in TAP output
  [stdio] -Dcc=clang++ -Duse64bitall DEBUGGING
  [stdio] -Dcc=clang++ -Duse64bitall
  [stdio] -Dcc=clang++
  [stdio] -Dcc=clang++ DEBUGGING
  [stdio] -Dcc=clang++ -Duselongdouble
  [stdio] -Dcc=clang++ -Duselongdouble DEBUGGING
~~ ../t/uni/select.t ........................................... FAILED Non-zero exit status: 2 No plan found in TAP output
  [stdio] -Dcc=clang++ -Duse64bitall DEBUGGING
  [stdio] -Dcc=clang++ -Duse64bitall
  [stdio] -Dcc=clang++
  [stdio] -Dcc=clang++ DEBUGGING
  [stdio] -Dcc=clang++ -Duselongdouble
  [stdio] -Dcc=clang++ -Duselongdouble DEBUGGING
~~ ../t/io/say.t ............................................... FAILED Non-zero exit status: 2 No plan found in TAP output
  [stdio] -Dcc=clang++ -Duse64bitall DEBUGGING
  [stdio] -Dcc=clang++ -Duse64bitall
  [stdio] -Dcc=clang++
  [stdio] -Dcc=clang++ DEBUGGING
  [stdio] -Dcc=clang++ -Duselongdouble
  [stdio] -Dcc=clang++ -Duselongdouble DEBUGGING
~~ ../ext/B/t/pragma.t ......................................... FAILED Non-zero exit status: 255 Bad plan.  You planned 12 tests but ran 0.
  [stdio] -Dcc=clang++ -Duse64bitall DEBUGGING
  [stdio] -Dcc=clang++ -Duse64bitall
  [stdio] -Dcc=clang++
  [stdio] -Dcc=clang++ DEBUGGING
  [stdio] -Dcc=clang++ -Duselongdouble
  [stdio] -Dcc=clang++ -Duselongdouble DEBUGGING
~~ ../t/run/switchn.t .......................................... FAILED Non-zero exit status: 2 No plan found in TAP output
  [stdio] -Dcc=clang++ -Duse64bitall DEBUGGING
  [stdio] -Dcc=clang++ -Duse64bitall
  [stdio] -Dcc=clang++
  [stdio] -Dcc=clang++ DEBUGGING
  [stdio] -Dcc=clang++ -Duselongdouble
  [stdio] -Dcc=clang++ -Duselongdouble DEBUGGING
~~ ../t/op/chdir.t ............................................. FAILED Non-zero exit status: 2 No plan found in TAP output
  [stdio] -Dcc=clang++ -Duse64bitall DEBUGGING
  [stdio] -Dcc=clang++ -Duse64bitall
  [stdio] -Dcc=clang++
  [stdio] -Dcc=clang++ DEBUGGING
  [stdio] -Dcc=clang++ -Duselongdouble
  [stdio] -Dcc=clang++ -Duselongdouble DEBUGGING
~~ ../ext/IPC-Open3/t/IPC-Open3.t .............................. FAILED Non-zero exit status: 255 No plan found in TAP output
  [stdio] -Dcc=clang++ -Duse64bitall DEBUGGING
  [stdio] -Dcc=clang++ -Duse64bitall
  [stdio] -Dcc=clang++
  [stdio] -Dcc=clang++ DEBUGGING
  [stdio] -Dcc=clang++ -Duselongdouble
  [stdio] -Dcc=clang++ -Duselongdouble DEBUGGING
~~ ../t/mro/isa_dfs.t .......................................... FAILED Non-zero exit status: 2 No plan found in TAP output
  [stdio] -Dcc=clang++ -Duse64bitall DEBUGGING
  [stdio] -Dcc=clang++ -Duse64bitall
  [stdio] -Dcc=clang++
  [stdio] -Dcc=clang++ DEBUGGING
  [stdio] -Dcc=clang++ -Duselongdouble
  [stdio] -Dcc=clang++ -Duselongdouble DEBUGGING
~~ ../t/io/sem.t ............................................... FAILED Non-zero exit status: 2 No plan found in TAP output
  [stdio] -Dcc=clang++ -Duse64bitall DEBUGGING
  [stdio] -Dcc=clang++ -Duse64bitall
  [stdio] -Dcc=clang++
  [stdio] -Dcc=clang++ DEBUGGING
  [stdio] -Dcc=clang++ -Duselongdouble
  [stdio] -Dcc=clang++ -Duselongdouble DEBUGGING
~~ ../t/op/wantarray.t ......................................... FAILED Non-zero exit status: 2 No plan found in TAP output
  [stdio] -Dcc=clang++ -Duse64bitall DEBUGGING
  [stdio] -Dcc=clang++ -Duse64bitall
  [stdio] -Dcc=clang++
  [stdio] -Dcc=clang++ DEBUGGING
  [stdio] -Dcc=clang++ -Duselongdouble
  [stdio] -Dcc=clang++ -Duselongdouble DEBUGGING
~~ ../cpan/Test-Simple/t/Legacy/Tester/tbt_05faildiag.t ........ FAILED Non-zero exit status: 255 Bad plan.  You planned 5 tests but ran 0.
  [stdio] -Dcc=clang++ -Duse64bitall DEBUGGING
  [stdio] -Dcc=clang++ -Duse64bitall
  [stdio] -Dcc=clang++
  [stdio] -Dcc=clang++ DEBUGGING
  [stdio] -Dcc=clang++ -Duselongdouble
  [stdio] -Dcc=clang++ -Duselongdouble DEBUGGING
~~ ../t/run/cloexec.t .......................................... FAILED Non-zero exit status: 2 No plan found in TAP output
  [stdio] -Dcc=clang++ -Duse64bitall DEBUGGING
  [stdio] -Dcc=clang++ -Duse64bitall
  [stdio] -Dcc=clang++
  [stdio] -Dcc=clang++ DEBUGGING
  [stdio] -Dcc=clang++ -Duselongdouble
  [stdio] -Dcc=clang++ -Duselongdouble DEBUGGING
~~ ../cpan/Pod-Checker/t/pod/podchkenc.t ....................... FAILED Non-zero exit status: 255 No plan found in TAP output
  [stdio] -Dcc=clang++ -Duse64bitall DEBUGGING
  [stdio] -Dcc=clang++ -Duse64bitall
  [stdio] -Dcc=clang++
  [stdio] -Dcc=clang++ DEBUGGING
  [stdio] -Dcc=clang++ -Duselongdouble
  [stdio] -Dcc=clang++ -Duselongdouble DEBUGGING
~~ ../t/op/64bitint.t .......................................... FAILED Non-zero exit status: 2 No plan found in TAP output
  [stdio] -Dcc=clang++ -Duse64bitall DEBUGGING
  [stdio] -Dcc=clang++ -Duse64bitall
  [stdio] -Dcc=clang++
  [stdio] -Dcc=clang++ DEBUGGING
  [stdio] -Dcc=clang++ -Duselongdouble
  [stdio] -Dcc=clang++ -Duselongdouble DEBUGGING
~~ ../t/uni/variables.t ........................................ FAILED Non-zero exit status: 2 No plan found in TAP output
  [stdio] -Dcc=clang++ -Duse64bitall DEBUGGING
  [stdio] -Dcc=clang++ -Duse64bitall
  [stdio] -Dcc=clang++
  [stdio] -Dcc=clang++ DEBUGGING
  [stdio] -Dcc=clang++ -Duselongdouble
  [stdio] -Dcc=clang++ -Duselongdouble DEBUGGING
~~ ../cpan/Test-Simple/t/Test2/acceptance/try_it_plan.t ........ FAILED Non-zero exit status: 255 No plan found in TAP output
  [stdio] -Dcc=clang++ -Duse64bitall DEBUGGING
  [stdio] -Dcc=clang++ -Duse64bitall
  [stdio] -Dcc=clang++
  [stdio] -Dcc=clang++ DEBUGGING
  [stdio] -Dcc=clang++ -Duselongdouble
  [stdio] -Dcc=clang++ -Duselongdouble DEBUGGING
~~ ../cpan/Text-Balanced/t/08_extvar.t ......................... FAILED Non-zero exit status: 255 Bad plan.  You planned 183 tests but ran 0.
  [stdio] -Dcc=clang++ -Duse64bitall DEBUGGING
  [stdio] -Dcc=clang++ -Duse64bitall
  [stdio] -Dcc=clang++
  [stdio] -Dcc=clang++ DEBUGGING
  [stdio] -Dcc=clang++ -Duselongdouble
  [stdio] -Dcc=clang++ -Duselongdouble DEBUGGING
~~ ../t/op/sselect.t ........................................... FAILED Non-zero exit status: 2 No plan found in TAP output
  [stdio] -Dcc=clang++ -Duse64bitall DEBUGGING
  [stdio] -Dcc=clang++ -Duse64bitall
  [stdio] -Dcc=clang++
  [stdio] -Dcc=clang++ DEBUGGING
  [stdio] -Dcc=clang++ -Duselongdouble
  [stdio] -Dcc=clang++ -Duselongdouble DEBUGGING
~~ ../ext/XS-APItest/t/my_exit.t ............................... FAILED Non-zero exit status: 2 No plan found in TAP output
  [stdio] -Dcc=clang++ -Duse64bitall DEBUGGING
  [stdio] -Dcc=clang++ -Duse64bitall
  [stdio] -Dcc=clang++
  [stdio] -Dcc=clang++ DEBUGGING
  [stdio] -Dcc=clang++ -Duselongdouble
  [stdio] -Dcc=clang++ -Duselongdouble DEBUGGING
~~ ../t/op/isa.t ............................................... FAILED Non-zero exit status: 2 No plan found in TAP output
  [stdio] -Dcc=clang++ -Duse64bitall DEBUGGING
  [stdio] -Dcc=clang++ -Duse64bitall
  [stdio] -Dcc=clang++
  [stdio] -Dcc=clang++ DEBUGGING
  [stdio] -Dcc=clang++ -Duselongdouble
  [stdio] -Dcc=clang++ -Duselongdouble DEBUGGING
~~ ../t/io/crlf_through.t ...................................... FAILED Non-zero exit status: 2 No plan found in TAP output
  [stdio] -Dcc=clang++ -Duse64bitall DEBUGGING
  [stdio] -Dcc=clang++ -Duse64bitall
  [stdio] -Dcc=clang++
  [stdio] -Dcc=clang++ DEBUGGING
  [stdio] -Dcc=clang++ -Duselongdouble
  [stdio] -Dcc=clang++ -Duselongdouble DEBUGGING
~~ ../t/re/overload.t .......................................... FAILED Non-zero exit status: 2 No plan found in TAP output
  [stdio] -Dcc=clang++ -Duse64bitall DEBUGGING
  [stdio] -Dcc=clang++ -Duse64bitall
  [stdio] -Dcc=clang++
  [stdio] -Dcc=clang++ DEBUGGING
  [stdio] -Dcc=clang++ -Duselongdouble
  [stdio] -Dcc=clang++ -Duselongdouble DEBUGGING
~~ ../ext/FileCache/t/07noimport.t ............................. FAILED Non-zero exit status: 25 Bad plan.  You planned 1 tests but ran 0.
  [stdio] -Dcc=clang++ -Duse64bitall DEBUGGING
  [stdio] -Dcc=clang++ -Duse64bitall
  [stdio] -Dcc=clang++
  [stdio] -Dcc=clang++ DEBUGGING
  [stdio] -Dcc=clang++ -Duselongdouble
  [stdio] -Dcc=clang++ -Duselongdouble DEBUGGING
~~ ../dist/ExtUtils-CBuilder/t/02-link.t ....................... FAILED Non-zero exit status: 255 No plan found in TAP output
  [stdio] -Dcc=clang++ -Duse64bitall DEBUGGING
  [stdio] -Dcc=clang++ -Duse64bitall
  [stdio] -Dcc=clang++
  [stdio] -Dcc=clang++ DEBUGGING
  [stdio] -Dcc=clang++ -Duselongdouble
  [stdio] -Dcc=clang++ -Duselongdouble DEBUGGING
~~ ../dist/threads/t/free.t .................................... FAILED Non-zero exit status: 2 No plan found in TAP output
  [stdio] -Dcc=clang++ -Duse64bitall DEBUGGING
  [stdio] -Dcc=clang++ -Duse64bitall
  [stdio] -Dcc=clang++
  [stdio] -Dcc=clang++ DEBUGGING
  [stdio] -Dcc=clang++ -Duselongdouble
  [stdio] -Dcc=clang++ -Duselongdouble DEBUGGING
~~ ../t/re/reg_email_thr.t ..................................... FAILED Non-zero exit status: 2 No plan found in TAP output
  [stdio] -Dcc=clang++ -Duse64bitall DEBUGGING
  [stdio] -Dcc=clang++ -Duse64bitall
  [stdio] -Dcc=clang++
  [stdio] -Dcc=clang++ DEBUGGING
  [stdio] -Dcc=clang++ -Duselongdouble
  [stdio] -Dcc=clang++ -Duselongdouble DEBUGGING
~~ ../dist/ExtUtils-CBuilder/t/01-basic.t ...................... FAILED Non-zero exit status: 255 No plan found in TAP output
  [stdio] -Dcc=clang++ -Duse64bitall DEBUGGING
  [stdio] -Dcc=clang++ -Duse64bitall
  [stdio] -Dcc=clang++
  [stdio] -Dcc=clang++ DEBUGGING
  [stdio] -Dcc=clang++ -Duselongdouble
  [stdio] -Dcc=clang++ -Duselongdouble DEBUGGING
~~ ../ext/B/t/concise.t ........................................ FAILED Non-zero exit status: 2 No plan found in TAP output
  [stdio] -Dcc=clang++ -Duse64bitall DEBUGGING
  [stdio] -Dcc=clang++ -Duse64bitall
  [stdio] -Dcc=clang++
  [stdio] -Dcc=clang++ DEBUGGING
  [stdio] -Dcc=clang++ -Duselongdouble
  [stdio] -Dcc=clang++ -Duselongdouble DEBUGGING
~~ ../t/mro/overload_c3_utf8.t ................................. FAILED Non-zero exit status: 2 No plan found in TAP output
  [stdio] -Dcc=clang++ -Duse64bitall DEBUGGING
  [stdio] -Dcc=clang++ -Duse64bitall
  [stdio] -Dcc=clang++
  [stdio] -Dcc=clang++ DEBUGGING
  [stdio] -Dcc=clang++ -Duselongdouble
  [stdio] -Dcc=clang++ -Duselongdouble DEBUGGING
~~ ../t/op/anonsub.t ........................................... FAILED Non-zero exit status: 2 No plan found in TAP output
  [stdio] -Dcc=clang++ -Duse64bitall DEBUGGING
  [stdio] -Dcc=clang++ -Duse64bitall
  [stdio] -Dcc=clang++
  [stdio] -Dcc=clang++ DEBUGGING
  [stdio] -Dcc=clang++ -Duselongdouble
  [stdio] -Dcc=clang++ -Duselongdouble DEBUGGING
~~ ../t/io/getcwd.t ............................................ FAILED Non-zero exit status: 2 No plan found in TAP output
  [stdio] -Dcc=clang++ -Duse64bitall DEBUGGING
  [stdio] -Dcc=clang++ -Duse64bitall
  [stdio] -Dcc=clang++
  [stdio] -Dcc=clang++ DEBUGGING
  [stdio] -Dcc=clang++ -Duselongdouble
  [stdio] -Dcc=clang++ -Duselongdouble DEBUGGING
~~ ../t/op/signame_canonical.t ................................. FAILED Non-zero exit status: 2 No plan found in TAP output
  [stdio] -Dcc=clang++ -Duse64bitall DEBUGGING
  [stdio] -Dcc=clang++ -Duse64bitall
  [stdio] -Dcc=clang++
  [stdio] -Dcc=clang++ DEBUGGING
  [stdio] -Dcc=clang++ -Duselongdouble
  [stdio] -Dcc=clang++ -Duselongdouble DEBUGGING
~~ ../dist/Storable/t/downgrade.t .............................. FAILED 13-14 66-67 114-115 Non-zero exit status: 31
  [stdio] -Dcc=clang++ -Duse64bitall
~~ ../t/op/die_except.t ........................................ FAILED Non-zero exit status: 2 No plan found in TAP output
  [stdio] -Dcc=clang++ -Duse64bitall DEBUGGING
  [stdio] -Dcc=clang++ -Duse64bitall
  [stdio] -Dcc=clang++
  [stdio] -Dcc=clang++ DEBUGGING
  [stdio] -Dcc=clang++ -Duselongdouble
  [stdio] -Dcc=clang++ -Duselongdouble DEBUGGING
~~ ../ext/XS-APItest/t/svpv.t .................................. FAILED Non-zero exit status: 2 No plan found in TAP output
  [stdio] -Dcc=clang++ -Duse64bitall DEBUGGING
  [stdio] -Dcc=clang++ -Duse64bitall
  [stdio] -Dcc=clang++
  [stdio] -Dcc=clang++ DEBUGGING
  [stdio] -Dcc=clang++ -Duselongdouble
  [stdio] -Dcc=clang++ -Duselongdouble DEBUGGING
~~ ../t/io/perlio_leaks.t ...................................... FAILED Non-zero exit status: 2 No plan found in TAP output
  [stdio] -Dcc=clang++ -Duse64bitall DEBUGGING
  [stdio] -Dcc=clang++ -Duse64bitall
  [stdio] -Dcc=clang++
  [stdio] -Dcc=clang++ DEBUGGING
  [stdio] -Dcc=clang++ -Duselongdouble
  [stdio] -Dcc=clang++ -Duselongdouble DEBUGGING
~~ ../t/op/tie_fetch_count.t ................................... FAILED Non-zero exit status: 2 No plan found in TAP output
  [stdio] -Dcc=clang++ -Duse64bitall DEBUGGING
  [stdio] -Dcc=clang++ -Duse64bitall
  [stdio] -Dcc=clang++
  [stdio] -Dcc=clang++ DEBUGGING
  [stdio] -Dcc=clang++ -Duselongdouble
  [stdio] -Dcc=clang++ -Duselongdouble DEBUGGING
~~ ../t/op/require_37033.t ..................................... FAILED Non-zero exit status: 2 No plan found in TAP output
  [stdio] -Dcc=clang++ -Duse64bitall DEBUGGING
  [stdio] -Dcc=clang++ -Duse64bitall
  [stdio] -Dcc=clang++
  [stdio] -Dcc=clang++ DEBUGGING
  [stdio] -Dcc=clang++ -Duselongdouble
  [stdio] -Dcc=clang++ -Duselongdouble DEBUGGING
~~ ../t/run/dtrace.t ........................................... FAILED Non-zero exit status: 2 No plan found in TAP output
  [stdio] -Dcc=clang++ -Duse64bitall DEBUGGING
  [stdio] -Dcc=clang++ -Duse64bitall
  [stdio] -Dcc=clang++
  [stdio] -Dcc=clang++ DEBUGGING
  [stdio] -Dcc=clang++ -Duselongdouble
  [stdio] -Dcc=clang++ -Duselongdouble DEBUGGING
~~ ../t/op/lfs.t ............................................... FAILED Non-zero exit status: 2 No plan found in TAP output
  [stdio] -Dcc=clang++ -Duse64bitall DEBUGGING
  [stdio] -Dcc=clang++ -Duse64bitall
  [stdio] -Dcc=clang++
  [stdio] -Dcc=clang++ DEBUGGING
  [stdio] -Dcc=clang++ -Duselongdouble
  [stdio] -Dcc=clang++ -Duselongdouble DEBUGGING
~~ ../t/uni/package.t .......................................... FAILED Non-zero exit status: 2 No plan found in TAP output
  [stdio] -Dcc=clang++ -Duse64bitall DEBUGGING
  [stdio] -Dcc=clang++ -Duse64bitall
  [stdio] -Dcc=clang++
  [stdio] -Dcc=clang++ DEBUGGING
  [stdio] -Dcc=clang++ -Duselongdouble
  [stdio] -Dcc=clang++ -Duselongdouble DEBUGGING
~~ ../t/mro/recursion_c3_utf8.t ................................ FAILED Non-zero exit status: 2 No plan found in TAP output
  [stdio] -Dcc=clang++ -Duse64bitall DEBUGGING
  [stdio] -Dcc=clang++ -Duse64bitall
  [stdio] -Dcc=clang++
  [stdio] -Dcc=clang++ DEBUGGING
  [stdio] -Dcc=clang++ -Duselongdouble
  [stdio] -Dcc=clang++ -Duselongdouble DEBUGGING
~~ ../t/re/reg_eval.t .......................................... FAILED Non-zero exit status: 2 No plan found in TAP output
  [stdio] -Dcc=clang++ -Duse64bitall DEBUGGING
  [stdio] -Dcc=clang++ -Duse64bitall
  [stdio] -Dcc=clang++
  [stdio] -Dcc=clang++ DEBUGGING
  [stdio] -Dcc=clang++ -Duselongdouble
  [stdio] -Dcc=clang++ -Duselongdouble DEBUGGING
~~ ../ext/Opcode/t/Opcode.t .................................... FAILED Non-zero exit status: 255 No plan found in TAP output
  [stdio] -Dcc=clang++ -Duse64bitall DEBUGGING
  [stdio] -Dcc=clang++ -Duse64bitall
  [stdio] -Dcc=clang++
  [stdio] -Dcc=clang++ DEBUGGING
  [stdio] -Dcc=clang++ -Duselongdouble
  [stdio] -Dcc=clang++ -Duselongdouble DEBUGGING
~~ ../dist/IO/t/io_file.t ...................................... FAILED Non-zero exit status: 2 No plan found in TAP output
  [stdio] -Dcc=clang++ -Duse64bitall DEBUGGING
  [stdio] -Dcc=clang++ -Duse64bitall
  [stdio] -Dcc=clang++
  [stdio] -Dcc=clang++ DEBUGGING
  [stdio] -Dcc=clang++ -Duselongdouble
  [stdio] -Dcc=clang++ -Duselongdouble DEBUGGING
~~ ../t/op/lex.t ............................................... FAILED Non-zero exit status: 2 No plan found in TAP output
  [stdio] -Dcc=clang++ -Duse64bitall DEBUGGING
  [stdio] -Dcc=clang++ -Duse64bitall
  [stdio] -Dcc=clang++
  [stdio] -Dcc=clang++ DEBUGGING
  [stdio] -Dcc=clang++ -Duselongdouble
  [stdio] -Dcc=clang++ -Duselongdouble DEBUGGING
~~ ../t/re/rxcode.t ............................................ FAILED Non-zero exit status: 2 No plan found in TAP output
  [stdio] -Dcc=clang++ -Duse64bitall DEBUGGING
  [stdio] -Dcc=clang++ -Duse64bitall
  [stdio] -Dcc=clang++
  [stdio] -Dcc=clang++ DEBUGGING
  [stdio] -Dcc=clang++ -Duselongdouble
  [stdio] -Dcc=clang++ -Duselongdouble DEBUGGING
~~ ../t/op/studytied.t ......................................... FAILED Non-zero exit status: 2 No plan found in TAP output
  [stdio] -Dcc=clang++ -Duse64bitall DEBUGGING
  [stdio] -Dcc=clang++ -Duse64bitall
  [stdio] -Dcc=clang++
  [stdio] -Dcc=clang++ DEBUGGING
  [stdio] -Dcc=clang++ -Duselongdouble
  [stdio] -Dcc=clang++ -Duselongdouble DEBUGGING
~~ ../t/op/stash_parse_gv.t .................................... FAILED Non-zero exit status: 2 No plan found in TAP output
  [stdio] -Dcc=clang++ -Duse64bitall DEBUGGING
  [stdio] -Dcc=clang++ -Duse64bitall
  [stdio] -Dcc=clang++
  [stdio] -Dcc=clang++ DEBUGGING
  [stdio] -Dcc=clang++ -Duselongdouble
  [stdio] -Dcc=clang++ -Duselongdouble DEBUGGING
~~ ../t/op/pwent.t ............................................. FAILED Non-zero exit status: 2 No plan found in TAP output
  [stdio] -Dcc=clang++ -Duse64bitall DEBUGGING
  [stdio] -Dcc=clang++ -Duse64bitall
  [stdio] -Dcc=clang++
  [stdio] -Dcc=clang++ DEBUGGING
  [stdio] -Dcc=clang++ -Duselongdouble
  [stdio] -Dcc=clang++ -Duselongdouble DEBUGGING
~~ ../cpan/Text-Balanced/t/02_extbrk.t ......................... FAILED Non-zero exit status: 255 Bad plan.  You planned 19 tests but ran 0.
  [stdio] -Dcc=clang++ -Duse64bitall DEBUGGING
  [stdio] -Dcc=clang++ -Duse64bitall
  [stdio] -Dcc=clang++
  [stdio] -Dcc=clang++ DEBUGGING
  [stdio] -Dcc=clang++ -Duselongdouble
  [stdio] -Dcc=clang++ -Duselongdouble DEBUGGING
~~ ../t/op/each_array.t ........................................ FAILED Non-zero exit status: 2 No plan found in TAP output
  [stdio] -Dcc=clang++ -Duse64bitall DEBUGGING
  [stdio] -Dcc=clang++ -Duse64bitall
  [stdio] -Dcc=clang++
  [stdio] -Dcc=clang++ DEBUGGING
  [stdio] -Dcc=clang++ -Duselongdouble
  [stdio] -Dcc=clang++ -Duselongdouble DEBUGGING
~~ ../cpan/Text-Balanced/t/04_extdel.t ......................... FAILED Non-zero exit status: 255 Bad plan.  You planned 45 tests but ran 0.
  [stdio] -Dcc=clang++ -Duse64bitall DEBUGGING
  [stdio] -Dcc=clang++ -Duse64bitall
  [stdio] -Dcc=clang++
  [stdio] -Dcc=clang++ DEBUGGING
  [stdio] -Dcc=clang++ -Duselongdouble
  [stdio] -Dcc=clang++ -Duselongdouble DEBUGGING
~~ ../t/mro/method_caching_utf8.t .............................. FAILED Non-zero exit status: 2 No plan found in TAP output
  [stdio] -Dcc=clang++ -Duse64bitall DEBUGGING
  [stdio] -Dcc=clang++ -Duse64bitall
  [stdio] -Dcc=clang++
  [stdio] -Dcc=clang++ DEBUGGING
  [stdio] -Dcc=clang++ -Duselongdouble
  [stdio] -Dcc=clang++ -Duselongdouble DEBUGGING
~~ ../dist/Storable/t/recurse.t ................................ FAILED Non-zero exit status: 255 Bad plan.  You planned 39 tests but ran 0.
  [stdio] -Dcc=clang++ -Duse64bitall DEBUGGING
  [stdio] -Dcc=clang++ -Duse64bitall
  [stdio] -Dcc=clang++
  [stdio] -Dcc=clang++ DEBUGGING
  [stdio] -Dcc=clang++ -Duselongdouble
  [stdio] -Dcc=clang++ -Duselongdouble DEBUGGING
~~ ../t/op/die_exit.t .......................................... FAILED Non-zero exit status: 2 No plan found in TAP output
  [stdio] -Dcc=clang++ -Duse64bitall DEBUGGING
  [stdio] -Dcc=clang++ -Duse64bitall
  [stdio] -Dcc=clang++
  [stdio] -Dcc=clang++ DEBUGGING
  [stdio] -Dcc=clang++ -Duselongdouble
  [stdio] -Dcc=clang++ -Duselongdouble DEBUGGING
~~ ../t/io/perlio_open.t ....................................... FAILED Non-zero exit status: 2 No plan found in TAP output
  [stdio] -Dcc=clang++ -Duse64bitall DEBUGGING
  [stdio] -Dcc=clang++ -Duse64bitall
  [stdio] -Dcc=clang++
  [stdio] -Dcc=clang++ DEBUGGING
  [stdio] -Dcc=clang++ -Duselongdouble
  [stdio] -Dcc=clang++ -Duselongdouble DEBUGGING
~~ ../t/io/crlf.t .............................................. FAILED Non-zero exit status: 2 No plan found in TAP output
  [stdio] -Dcc=clang++ -Duse64bitall DEBUGGING
  [stdio] -Dcc=clang++ -Duse64bitall
  [stdio] -Dcc=clang++
  [stdio] -Dcc=clang++ DEBUGGING
  [stdio] -Dcc=clang++ -Duselongdouble
  [stdio] -Dcc=clang++ -Duselongdouble DEBUGGING
~~ ../t/op/postfixderef.t ...................................... FAILED Non-zero exit status: 2 No plan found in TAP output
  [stdio] -Dcc=clang++ -Duse64bitall DEBUGGING
  [stdio] -Dcc=clang++ -Duse64bitall
  [stdio] -Dcc=clang++
  [stdio] -Dcc=clang++ DEBUGGING
  [stdio] -Dcc=clang++ -Duselongdouble
  [stdio] -Dcc=clang++ -Duselongdouble DEBUGGING
~~ ../lib/overload_nomethod.t .................................. FAILED Non-zero exit status: 2 No plan found in TAP output
  [stdio] -Dcc=clang++ -Duse64bitall DEBUGGING
  [stdio] -Dcc=clang++ -Duse64bitall
  [stdio] -Dcc=clang++
  [stdio] -Dcc=clang++ DEBUGGING
  [stdio] -Dcc=clang++ -Duselongdouble
  [stdio] -Dcc=clang++ -Duselongdouble DEBUGGING
~~ ../t/run/switcht.t .......................................... FAILED Non-zero exit status: 2 No plan found in TAP output
  [stdio] -Dcc=clang++ -Duse64bitall DEBUGGING
  [stdio] -Dcc=clang++ -Duse64bitall
  [stdio] -Dcc=clang++
  [stdio] -Dcc=clang++ DEBUGGING
  [stdio] -Dcc=clang++ -Duselongdouble
  [stdio] -Dcc=clang++ -Duselongdouble DEBUGGING
~~ ../t/op/bless.t ............................................. FAILED Non-zero exit status: 2 No plan found in TAP output
  [stdio] -Dcc=clang++ -Duse64bitall DEBUGGING
  [stdio] -Dcc=clang++ -Duse64bitall
  [stdio] -Dcc=clang++
  [stdio] -Dcc=clang++ DEBUGGING
  [stdio] -Dcc=clang++ -Duselongdouble
  [stdio] -Dcc=clang++ -Duselongdouble DEBUGGING
~~ ../lib/h2ph.t ............................................... FAILED Non-zero exit status: 2 No plan found in TAP output
  [stdio] -Dcc=clang++ -Duse64bitall DEBUGGING
  [stdio] -Dcc=clang++ -Duse64bitall
  [stdio] -Dcc=clang++
  [stdio] -Dcc=clang++ DEBUGGING
  [stdio] -Dcc=clang++ -Duselongdouble
  [stdio] -Dcc=clang++ -Duselongdouble DEBUGGING
~~ ../lib/croak.t .............................................. FAILED Non-zero exit status: 2 No plan found in TAP output
  [stdio] -Dcc=clang++ -Duse64bitall DEBUGGING
  [stdio] -Dcc=clang++ -Duse64bitall
  [stdio] -Dcc=clang++
  [stdio] -Dcc=clang++ DEBUGGING
  [stdio] -Dcc=clang++ -Duselongdouble
  [stdio] -Dcc=clang++ -Duselongdouble DEBUGGING
~~ ../lib/mypragma.t ........................................... FAILED Non-zero exit status: 2 No plan found in TAP output
  [stdio] -Dcc=clang++ -Duse64bitall DEBUGGING
  [stdio] -Dcc=clang++ -Duse64bitall
  [stdio] -Dcc=clang++
  [stdio] -Dcc=clang++ DEBUGGING
  [stdio] -Dcc=clang++ -Duselongdouble
  [stdio] -Dcc=clang++ -Duselongdouble DEBUGGING
~~ ../t/op/length.t ............................................ FAILED Non-zero exit status: 2 No plan found in TAP output
  [stdio] -Dcc=clang++ -Duse64bitall DEBUGGING
  [stdio] -Dcc=clang++ -Duse64bitall
  [stdio] -Dcc=clang++
  [stdio] -Dcc=clang++ DEBUGGING
  [stdio] -Dcc=clang++ -Duselongdouble
  [stdio] -Dcc=clang++ -Duselongdouble DEBUGGING
~~ ../ext/Devel-Peek/t/Peek.t .................................. FAILED Non-zero exit status: 255 No plan found in TAP output
  [stdio] -Dcc=clang++ -Duse64bitall DEBUGGING
  [stdio] -Dcc=clang++ -Duse64bitall
  [stdio] -Dcc=clang++
  [stdio] -Dcc=clang++ DEBUGGING
  [stdio] -Dcc=clang++ -Duselongdouble
  [stdio] -Dcc=clang++ -Duselongdouble DEBUGGING
~~ ../t/re/reg_fold.t .......................................... FAILED Non-zero exit status: 2 No plan found in TAP output
  [stdio] -Dcc=clang++ -Duse64bitall DEBUGGING
  [stdio] -Dcc=clang++ -Duse64bitall
  [stdio] -Dcc=clang++
  [stdio] -Dcc=clang++ DEBUGGING
  [stdio] -Dcc=clang++ -Duselongdouble
  [stdio] -Dcc=clang++ -Duselongdouble DEBUGGING
~~ ../lib/utf8.t ............................................... FAILED Non-zero exit status: 2 No plan found in TAP output
  [stdio] -Dcc=clang++ -Duse64bitall DEBUGGING
  [stdio] -Dcc=clang++ -Duse64bitall
  [stdio] -Dcc=clang++
  [stdio] -Dcc=clang++ DEBUGGING
  [stdio] -Dcc=clang++ -Duselongdouble
  [stdio] -Dcc=clang++ -Duselongdouble DEBUGGING
~~ ../dist/Storable/t/downgrade.t .............................. FAILED 13 66-67 114-115 Non-zero exit status: 30
  [stdio] -Dcc=clang++ -Duse64bitall DEBUGGING
  [stdio] -Dcc=clang++ DEBUGGING
~~ ../t/io/argv.t .............................................. FAILED Non-zero exit status: 2 No plan found in TAP output
  [stdio] -Dcc=clang++ -Duse64bitall DEBUGGING
  [stdio] -Dcc=clang++ -Duse64bitall
  [stdio] -Dcc=clang++
  [stdio] -Dcc=clang++ DEBUGGING
  [stdio] -Dcc=clang++ -Duselongdouble
  [stdio] -Dcc=clang++ -Duselongdouble DEBUGGING
~~ ../cpan/version/t/03require.t ............................... FAILED Non-zero exit status: 255
  [stdio] -Dcc=clang++ -Duse64bitall DEBUGGING
  [stdio] -Dcc=clang++ -Duse64bitall
  [stdio] -Dcc=clang++
  [stdio] -Dcc=clang++ DEBUGGING
  [stdio] -Dcc=clang++ -Duselongdouble
  [stdio] -Dcc=clang++ -Duselongdouble DEBUGGING
~~ ../t/io/paragraph_mode.t .................................... FAILED Non-zero exit status: 2 No plan found in TAP output
  [stdio] -Dcc=clang++ -Duse64bitall DEBUGGING
  [stdio] -Dcc=clang++ -Duse64bitall
  [stdio] -Dcc=clang++
  [stdio] -Dcc=clang++ DEBUGGING
  [stdio] -Dcc=clang++ -Duselongdouble
  [stdio] -Dcc=clang++ -Duselongdouble DEBUGGING
~~ ../cpan/Text-Balanced/t/05_extmul.t ......................... FAILED Non-zero exit status: 255 Bad plan.  You planned 86 tests but ran 0.
  [stdio] -Dcc=clang++ -Duse64bitall DEBUGGING
  [stdio] -Dcc=clang++ -Duse64bitall
  [stdio] -Dcc=clang++
  [stdio] -Dcc=clang++ DEBUGGING
  [stdio] -Dcc=clang++ -Duselongdouble
  [stdio] -Dcc=clang++ -Duselongdouble DEBUGGING
~~ ../t/run/switch0.t .......................................... FAILED Non-zero exit status: 2 No plan found in TAP output
  [stdio] -Dcc=clang++ -Duse64bitall DEBUGGING
  [stdio] -Dcc=clang++ -Duse64bitall
  [stdio] -Dcc=clang++
  [stdio] -Dcc=clang++ DEBUGGING
  [stdio] -Dcc=clang++ -Duselongdouble
  [stdio] -Dcc=clang++ -Duselongdouble DEBUGGING
~~ ../cpan/Test-Simple/t/Test2/modules/IPC/Driver/Files.t ...... FAILED Non-zero exit status: 255 No plan found in TAP output
  [stdio] -Dcc=clang++ -Duse64bitall DEBUGGING
  [stdio] -Dcc=clang++ -Duse64bitall
  [stdio] -Dcc=clang++
  [stdio] -Dcc=clang++ DEBUGGING
  [stdio] -Dcc=clang++ -Duselongdouble
  [stdio] -Dcc=clang++ -Duselongdouble DEBUGGING
~~ ../lib/bytes.t .............................................. FAILED Non-zero exit status: 2 No plan found in TAP output
  [stdio] -Dcc=clang++ -Duse64bitall DEBUGGING
  [stdio] -Dcc=clang++ -Duse64bitall
  [stdio] -Dcc=clang++
  [stdio] -Dcc=clang++ DEBUGGING
  [stdio] -Dcc=clang++ -Duselongdouble
  [stdio] -Dcc=clang++ -Duselongdouble DEBUGGING
~~ ../lib/deprecate.t .......................................... FAILED Non-zero exit status: 2 No plan found in TAP output
  [stdio] -Dcc=clang++ -Duse64bitall DEBUGGING
  [stdio] -Dcc=clang++ -Duse64bitall
  [stdio] -Dcc=clang++
  [stdio] -Dcc=clang++ DEBUGGING
  [stdio] -Dcc=clang++ -Duselongdouble
  [stdio] -Dcc=clang++ -Duselongdouble DEBUGGING
~~ ../t/op/each.t .............................................. FAILED Non-zero exit status: 2 No plan found in TAP output
  [stdio] -Dcc=clang++ -Duse64bitall DEBUGGING
  [stdio] -Dcc=clang++ -Duse64bitall
  [stdio] -Dcc=clang++
  [stdio] -Dcc=clang++ DEBUGGING
  [stdio] -Dcc=clang++ -Duselongdouble
  [stdio] -Dcc=clang++ -Duselongdouble DEBUGGING
~~ ../cpan/Compress-Raw-Zlib/t/02zlib.t ........................ FAILED Non-zero exit status: 255 No plan found in TAP output
  [stdio] -Dcc=clang++ -Duse64bitall DEBUGGING
  [stdio] -Dcc=clang++ -Duse64bitall
  [stdio] -Dcc=clang++
  [stdio] -Dcc=clang++ DEBUGGING
  [stdio] -Dcc=clang++ -Duselongdouble
  [stdio] -Dcc=clang++ -Duselongdouble DEBUGGING
~~ ../t/op/caller.t ............................................ FAILED Non-zero exit status: 2 No plan found in TAP output
  [stdio] -Dcc=clang++ -Duse64bitall DEBUGGING
  [stdio] -Dcc=clang++ -Duse64bitall
  [stdio] -Dcc=clang++
  [stdio] -Dcc=clang++ DEBUGGING
  [stdio] -Dcc=clang++ -Duselongdouble
  [stdio] -Dcc=clang++ -Duselongdouble DEBUGGING
~~ ../dist/threads/t/libc.t .................................... FAILED Non-zero exit status: 2 No plan found in TAP output
  [stdio] -Dcc=clang++ -Duse64bitall DEBUGGING
  [stdio] -Dcc=clang++ -Duse64bitall
  [stdio] -Dcc=clang++
  [stdio] -Dcc=clang++ DEBUGGING
  [stdio] -Dcc=clang++ -Duselongdouble
  [stdio] -Dcc=clang++ -Duselongdouble DEBUGGING
~~ ../t/op/crypt.t ............................................. FAILED Non-zero exit status: 2 No plan found in TAP output
  [stdio] -Dcc=clang++ -Duse64bitall DEBUGGING
  [stdio] -Dcc=clang++ -Duse64bitall
  [stdio] -Dcc=clang++
  [stdio] -Dcc=clang++ DEBUGGING
  [stdio] -Dcc=clang++ -Duselongdouble
  [stdio] -Dcc=clang++ -Duselongdouble DEBUGGING
~~ ../t/porting/libperl.t ...................................... FAILED Non-zero exit status: 2 No plan found in TAP output
  [stdio] -Dcc=clang++ -Duse64bitall DEBUGGING
  [stdio] -Dcc=clang++ -Duse64bitall
  [stdio] -Dcc=clang++
  [stdio] -Dcc=clang++ DEBUGGING
  [stdio] -Dcc=clang++ -Duselongdouble
  [stdio] -Dcc=clang++ -Duselongdouble DEBUGGING
~~ ../t/op/runlevel.t .......................................... FAILED Non-zero exit status: 2 No plan found in TAP output
  [stdio] -Dcc=clang++ -Duse64bitall DEBUGGING
  [stdio] -Dcc=clang++ -Duse64bitall
  [stdio] -Dcc=clang++
  [stdio] -Dcc=clang++ DEBUGGING
  [stdio] -Dcc=clang++ -Duselongdouble
  [stdio] -Dcc=clang++ -Duselongdouble DEBUGGING
~~ ../t/re/charset.t ........................................... FAILED Non-zero exit status: 2 No plan found in TAP output
  [stdio] -Dcc=clang++ -Duse64bitall DEBUGGING
  [stdio] -Dcc=clang++ -Duse64bitall
  [stdio] -Dcc=clang++
  [stdio] -Dcc=clang++ DEBUGGING
  [stdio] -Dcc=clang++ -Duselongdouble
  [stdio] -Dcc=clang++ -Duselongdouble DEBUGGING
~~ ../t/op/repeat.t ............................................ FAILED Non-zero exit status: 2 No plan found in TAP output
  [stdio] -Dcc=clang++ -Duse64bitall DEBUGGING
  [stdio] -Dcc=clang++ -Duse64bitall
  [stdio] -Dcc=clang++
  [stdio] -Dcc=clang++ DEBUGGING
  [stdio] -Dcc=clang++ -Duselongdouble
  [stdio] -Dcc=clang++ -Duselongdouble DEBUGGING
~~ ../cpan/NEXT/t/next.t ....................................... FAILED Bad plan.  You planned 27 tests but ran 26.
  [stdio] -Dcc=clang++ -Duse64bitall DEBUGGING
  [stdio] -Dcc=clang++ -Duse64bitall
  [stdio] -Dcc=clang++
  [stdio] -Dcc=clang++ DEBUGGING
  [stdio] -Dcc=clang++ -Duselongdouble
  [stdio] -Dcc=clang++ -Duselongdouble DEBUGGING
~~ ../t/mro/overload_dfs.t ..................................... FAILED Non-zero exit status: 2 No plan found in TAP output
  [stdio] -Dcc=clang++ -Duse64bitall DEBUGGING
  [stdio] -Dcc=clang++ -Duse64bitall
  [stdio] -Dcc=clang++
  [stdio] -Dcc=clang++ DEBUGGING
  [stdio] -Dcc=clang++ -Duselongdouble
  [stdio] -Dcc=clang++ -Duselongdouble DEBUGGING
~~ ../t/op/upgrade.t ........................................... FAILED Non-zero exit status: 2 No plan found in TAP output
  [stdio] -Dcc=clang++ -Duse64bitall DEBUGGING
  [stdio] -Dcc=clang++ -Duse64bitall
  [stdio] -Dcc=clang++
  [stdio] -Dcc=clang++ DEBUGGING
  [stdio] -Dcc=clang++ -Duselongdouble
  [stdio] -Dcc=clang++ -Duselongdouble DEBUGGING
~~ ../t/op/hash-rt85026.t ...................................... FAILED Non-zero exit status: 2 No plan found in TAP output
  [stdio] -Dcc=clang++ -Duse64bitall DEBUGGING
  [stdio] -Dcc=clang++ -Duse64bitall
  [stdio] -Dcc=clang++
  [stdio] -Dcc=clang++ DEBUGGING
  [stdio] -Dcc=clang++ -Duselongdouble
  [stdio] -Dcc=clang++ -Duselongdouble DEBUGGING
~~ ../cpan/Scalar-List-Utils/t/dualvar.t ....................... FAILED Non-zero exit status: 255 Bad plan.  You planned 41 tests but ran 0.
  [stdio] -Dcc=clang++ -Duse64bitall DEBUGGING
  [stdio] -Dcc=clang++ -Duse64bitall
  [stdio] -Dcc=clang++
  [stdio] -Dcc=clang++ DEBUGGING
  [stdio] -Dcc=clang++ -Duselongdouble
  [stdio] -Dcc=clang++ -Duselongdouble DEBUGGING
~~ ../t/op/signatures.t ........................................ FAILED Non-zero exit status: 2 No plan found in TAP output
  [stdio] -Dcc=clang++ -Duse64bitall DEBUGGING
  [stdio] -Dcc=clang++ -Duse64bitall
  [stdio] -Dcc=clang++
  [stdio] -Dcc=clang++ DEBUGGING
  [stdio] -Dcc=clang++ -Duselongdouble
  [stdio] -Dcc=clang++ -Duselongdouble DEBUGGING
~~ ../t/op/do.t ................................................ FAILED Non-zero exit status: 2 No plan found in TAP output
  [stdio] -Dcc=clang++ -Duse64bitall DEBUGGING
  [stdio] -Dcc=clang++ -Duse64bitall
  [stdio] -Dcc=clang++
  [stdio] -Dcc=clang++ DEBUGGING
  [stdio] -Dcc=clang++ -Duselongdouble
  [stdio] -Dcc=clang++ -Duselongdouble DEBUGGING
~~ ../t/re/reg_60508.t ......................................... FAILED Non-zero exit status: 2 No plan found in TAP output
  [stdio] -Dcc=clang++ -Duse64bitall DEBUGGING
  [stdio] -Dcc=clang++ -Duse64bitall
  [stdio] -Dcc=clang++
  [stdio] -Dcc=clang++ DEBUGGING
  [stdio] -Dcc=clang++ -Duselongdouble
  [stdio] -Dcc=clang++ -Duselongdouble DEBUGGING
~~ ../t/uni/attrs.t ............................................ FAILED Non-zero exit status: 2 No plan found in TAP output
  [stdio] -Dcc=clang++ -Duse64bitall DEBUGGING
  [stdio] -Dcc=clang++ -Duse64bitall
  [stdio] -Dcc=clang++
  [stdio] -Dcc=clang++ DEBUGGING
  [stdio] -Dcc=clang++ -Duselongdouble
  [stdio] -Dcc=clang++ -Duselongdouble DEBUGGING
~~ ../t/porting/test_bootstrap.t ............................... FAILED Non-zero exit status: 2 No plan found in TAP output
  [stdio] -Dcc=clang++ -Duse64bitall DEBUGGING
  [stdio] -Dcc=clang++ -Duse64bitall
  [stdio] -Dcc=clang++
  [stdio] -Dcc=clang++ DEBUGGING
  [stdio] -Dcc=clang++ -Duselongdouble
  [stdio] -Dcc=clang++ -Duselongdouble DEBUGGING
~~ ../t/op/grep.t .............................................. FAILED Non-zero exit status: 2 No plan found in TAP output
  [stdio] -Dcc=clang++ -Duse64bitall DEBUGGING
  [stdio] -Dcc=clang++ -Duse64bitall
  [stdio] -Dcc=clang++
  [stdio] -Dcc=clang++ DEBUGGING
  [stdio] -Dcc=clang++ -Duselongdouble
  [stdio] -Dcc=clang++ -Duselongdouble DEBUGGING
~~ ../t/op/die_unwind.t ........................................ FAILED Non-zero exit status: 2 No plan found in TAP output
  [stdio] -Dcc=clang++ -Duse64bitall DEBUGGING
  [stdio] -Dcc=clang++ -Duse64bitall
  [stdio] -Dcc=clang++
  [stdio] -Dcc=clang++ DEBUGGING
  [stdio] -Dcc=clang++ -Duselongdouble
  [stdio] -Dcc=clang++ -Duselongdouble DEBUGGING
~~ ../t/op/chars.t ............................................. FAILED Non-zero exit status: 2 No plan found in TAP output
  [stdio] -Dcc=clang++ -Duse64bitall DEBUGGING
  [stdio] -Dcc=clang++ -Duse64bitall
  [stdio] -Dcc=clang++
  [stdio] -Dcc=clang++ DEBUGGING
  [stdio] -Dcc=clang++ -Duselongdouble
  [stdio] -Dcc=clang++ -Duselongdouble DEBUGGING
~~ ../t/op/utfhash.t ........................................... FAILED Non-zero exit status: 2 No plan found in TAP output
  [stdio] -Dcc=clang++ -Duse64bitall DEBUGGING
  [stdio] -Dcc=clang++ -Duse64bitall
  [stdio] -Dcc=clang++
  [stdio] -Dcc=clang++ DEBUGGING
  [stdio] -Dcc=clang++ -Duselongdouble
  [stdio] -Dcc=clang++ -Duselongdouble DEBUGGING
~~ ../t/op/my.t ................................................ FAILED Non-zero exit status: 2 No plan found in TAP output
  [stdio] -Dcc=clang++ -Duse64bitall DEBUGGING
  [stdio] -Dcc=clang++ -Duse64bitall
  [stdio] -Dcc=clang++
  [stdio] -Dcc=clang++ DEBUGGING
  [stdio] -Dcc=clang++ -Duselongdouble
  [stdio] -Dcc=clang++ -Duselongdouble DEBUGGING
~~ ../t/uni/chomp.t ............................................ FAILED Non-zero exit status: 2 No plan found in TAP output
  [stdio] -Dcc=clang++ -Duse64bitall DEBUGGING
  [stdio] -Dcc=clang++ -Duse64bitall
  [stdio] -Dcc=clang++
  [stdio] -Dcc=clang++ DEBUGGING
  [stdio] -Dcc=clang++ -Duselongdouble
  [stdio] -Dcc=clang++ -Duselongdouble DEBUGGING
~~ ../t/mro/isa_c3_utf8.t ...................................... FAILED Non-zero exit status: 2 No plan found in TAP output
  [stdio] -Dcc=clang++ -Duse64bitall DEBUGGING
  [stdio] -Dcc=clang++ -Duse64bitall
  [stdio] -Dcc=clang++
  [stdio] -Dcc=clang++ DEBUGGING
  [stdio] -Dcc=clang++ -Duselongdouble
  [stdio] -Dcc=clang++ -Duselongdouble DEBUGGING
~~ ../t/io/iofile.t ............................................ FAILED Non-zero exit status: 2 No plan found in TAP output
  [stdio] -Dcc=clang++ -Duse64bitall DEBUGGING
  [stdio] -Dcc=clang++ -Duse64bitall
  [stdio] -Dcc=clang++
  [stdio] -Dcc=clang++ DEBUGGING
  [stdio] -Dcc=clang++ -Duselongdouble
  [stdio] -Dcc=clang++ -Duselongdouble DEBUGGING
~~ ../t/re/reg_mesg.t .......................................... FAILED Non-zero exit status: 2 No plan found in TAP output
  [stdio] -Dcc=clang++ -Duse64bitall DEBUGGING
  [stdio] -Dcc=clang++ -Duse64bitall
  [stdio] -Dcc=clang++
  [stdio] -Dcc=clang++ DEBUGGING
  [stdio] -Dcc=clang++ -Duselongdouble
  [stdio] -Dcc=clang++ -Duselongdouble DEBUGGING
~~ ../t/uni/write.t ............................................ FAILED Non-zero exit status: 2 No plan found in TAP output
  [stdio] -Dcc=clang++ -Duse64bitall DEBUGGING
  [stdio] -Dcc=clang++ -Duse64bitall
  [stdio] -Dcc=clang++
  [stdio] -Dcc=clang++ DEBUGGING
  [stdio] -Dcc=clang++ -Duselongdouble
  [stdio] -Dcc=clang++ -Duselongdouble DEBUGGING
~~ ../cpan/version/t/07locale.t ................................ FAILED Non-zero exit status: 255 Bad plan.  You planned 8 tests but ran 1.
  [stdio] -Dcc=clang++ -Duse64bitall DEBUGGING
  [stdio] -Dcc=clang++ -Duse64bitall
  [stdio] -Dcc=clang++
  [stdio] -Dcc=clang++ DEBUGGING
  [stdio] -Dcc=clang++ -Duselongdouble
  [stdio] -Dcc=clang++ -Duselongdouble DEBUGGING
~~ ../t/op/cond.t .............................................. FAILED Non-zero exit status: 2 No plan found in TAP output
  [stdio] -Dcc=clang++ -Duse64bitall DEBUGGING
  [stdio] -Dcc=clang++ -Duse64bitall
  [stdio] -Dcc=clang++
  [stdio] -Dcc=clang++ DEBUGGING
  [stdio] -Dcc=clang++ -Duselongdouble
  [stdio] -Dcc=clang++ -Duselongdouble DEBUGGING
~~ ../ext/B/t/optree_concise.t ................................. FAILED Non-zero exit status: 255 No plan found in TAP output
  [stdio] -Dcc=clang++ -Duse64bitall DEBUGGING
  [stdio] -Dcc=clang++ -Duse64bitall
  [stdio] -Dcc=clang++
  [stdio] -Dcc=clang++ DEBUGGING
  [stdio] -Dcc=clang++ -Duselongdouble
  [stdio] -Dcc=clang++ -Duselongdouble DEBUGGING
~~ ../t/op/lvref.t ............................................. FAILED Non-zero exit status: 2 No plan found in TAP output
  [stdio] -Dcc=clang++ -Duse64bitall DEBUGGING
  [stdio] -Dcc=clang++ -Duse64bitall
  [stdio] -Dcc=clang++
  [stdio] -Dcc=clang++ DEBUGGING
  [stdio] -Dcc=clang++ -Duselongdouble
  [stdio] -Dcc=clang++ -Duselongdouble DEBUGGING
~~ ../t/op/sprintf.t ........................................... FAILED Non-zero exit status: 2 No plan found in TAP output
  [stdio] -Dcc=clang++ -Duse64bitall DEBUGGING
  [stdio] -Dcc=clang++ -Duse64bitall
  [stdio] -Dcc=clang++
  [stdio] -Dcc=clang++ DEBUGGING
  [stdio] -Dcc=clang++ -Duselongdouble
  [stdio] -Dcc=clang++ -Duselongdouble DEBUGGING
~~ ../t/op/ord.t ............................................... FAILED Non-zero exit status: 2 No plan found in TAP output
  [stdio] -Dcc=clang++ -Duse64bitall DEBUGGING
  [stdio] -Dcc=clang++ -Duse64bitall
  [stdio] -Dcc=clang++
  [stdio] -Dcc=clang++ DEBUGGING
  [stdio] -Dcc=clang++ -Duselongdouble
  [stdio] -Dcc=clang++ -Duselongdouble DEBUGGING
~~ ../ext/XS-APItest/t/keyword_plugin_threads.t ................ FAILED Non-zero exit status: 2 No plan found in TAP output
  [stdio] -Dcc=clang++ -Duse64bitall DEBUGGING
  [stdio] -Dcc=clang++ -Duse64bitall
  [stdio] -Dcc=clang++
  [stdio] -Dcc=clang++ DEBUGGING
  [stdio] -Dcc=clang++ -Duselongdouble
  [stdio] -Dcc=clang++ -Duselongdouble DEBUGGING
~~ ../cpan/ExtUtils-MakeMaker/t/eu_command.t ................... FAILED Non-zero exit status: 255 No plan found in TAP output
  [stdio] -Dcc=clang++ -Duse64bitall DEBUGGING
  [stdio] -Dcc=clang++ -Duse64bitall
  [stdio] -Dcc=clang++
  [stdio] -Dcc=clang++ DEBUGGING
  [stdio] -Dcc=clang++ -Duselongdouble
  [stdio] -Dcc=clang++ -Duselongdouble DEBUGGING
~~ ../t/op/dor.t ............................................... FAILED Non-zero exit status: 2 No plan found in TAP output
  [stdio] -Dcc=clang++ -Duse64bitall DEBUGGING
  [stdio] -Dcc=clang++ -Duse64bitall
  [stdio] -Dcc=clang++
  [stdio] -Dcc=clang++ DEBUGGING
  [stdio] -Dcc=clang++ -Duselongdouble
  [stdio] -Dcc=clang++ -Duselongdouble DEBUGGING
~~ ../t/io/open.t .............................................. FAILED Non-zero exit status: 2 No plan found in TAP output
  [stdio] -Dcc=clang++ -Duse64bitall DEBUGGING
  [stdio] -Dcc=clang++ -Duse64bitall
  [stdio] -Dcc=clang++
  [stdio] -Dcc=clang++ DEBUGGING
  [stdio] -Dcc=clang++ -Duselongdouble
  [stdio] -Dcc=clang++ -Duselongdouble DEBUGGING
~~ ../t/op/srand.t ............................................. FAILED Non-zero exit status: 2 No plan found in TAP output
  [stdio] -Dcc=clang++ -Duse64bitall DEBUGGING
  [stdio] -Dcc=clang++ -Duse64bitall
  [stdio] -Dcc=clang++
  [stdio] -Dcc=clang++ DEBUGGING
  [stdio] -Dcc=clang++ -Duselongdouble
  [stdio] -Dcc=clang++ -Duselongdouble DEBUGGING
~~ ../dist/Storable/t/weak.t ................................... FAILED No plan found in TAP output
  [stdio] -Dcc=clang++ -Duse64bitall DEBUGGING
  [stdio] -Dcc=clang++ DEBUGGING
  [stdio] -Dcc=clang++ -Duselongdouble DEBUGGING
~~ ../t/op/defins.t ............................................ FAILED Non-zero exit status: 2 No plan found in TAP output
  [stdio] -Dcc=clang++ -Duse64bitall DEBUGGING
  [stdio] -Dcc=clang++ -Duse64bitall
  [stdio] -Dcc=clang++
  [stdio] -Dcc=clang++ DEBUGGING
  [stdio] -Dcc=clang++ -Duselongdouble
  [stdio] -Dcc=clang++ -Duselongdouble DEBUGGING
~~ ../cpan/Text-Balanced/t/03_extcbk.t ......................... FAILED Non-zero exit status: 255 Bad plan.  You planned 41 tests but ran 0.
  [stdio] -Dcc=clang++ -Duse64bitall DEBUGGING
  [stdio] -Dcc=clang++ -Duse64bitall
  [stdio] -Dcc=clang++
  [stdio] -Dcc=clang++ DEBUGGING
  [stdio] -Dcc=clang++ -Duselongdouble
  [stdio] -Dcc=clang++ -Duselongdouble DEBUGGING
~~ ../t/op/ref.t ............................................... FAILED Non-zero exit status: 2 No plan found in TAP output
  [stdio] -Dcc=clang++ -Duse64bitall DEBUGGING
  [stdio] -Dcc=clang++ -Duse64bitall
  [stdio] -Dcc=clang++
  [stdio] -Dcc=clang++ DEBUGGING
  [stdio] -Dcc=clang++ -Duselongdouble
  [stdio] -Dcc=clang++ -Duselongdouble DEBUGGING
~~ ../t/op/kvaslice.t .......................................... FAILED Non-zero exit status: 2 No plan found in TAP output
  [stdio] -Dcc=clang++ -Duse64bitall DEBUGGING
  [stdio] -Dcc=clang++ -Duse64bitall
  [stdio] -Dcc=clang++
  [stdio] -Dcc=clang++ DEBUGGING
  [stdio] -Dcc=clang++ -Duselongdouble
  [stdio] -Dcc=clang++ -Duselongdouble DEBUGGING
~~ ../cpan/Test-Simple/t/Test2/acceptance/try_it_threads.t ..... FAILED Non-zero exit status: 255 No plan found in TAP output
  [stdio] -Dcc=clang++ -Duse64bitall DEBUGGING
  [stdio] -Dcc=clang++ -Duse64bitall
  [stdio] -Dcc=clang++
  [stdio] -Dcc=clang++ DEBUGGING
  [stdio] -Dcc=clang++ -Duselongdouble
  [stdio] -Dcc=clang++ -Duselongdouble DEBUGGING
~~ ../t/io/iprefix.t ........................................... FAILED Non-zero exit status: 22 No plan found in TAP output
  [stdio] -Dcc=clang++ -Duse64bitall DEBUGGING
  [stdio] -Dcc=clang++ -Duse64bitall
  [stdio] -Dcc=clang++
  [stdio] -Dcc=clang++ DEBUGGING
  [stdio] -Dcc=clang++ -Duselongdouble
  [stdio] -Dcc=clang++ -Duselongdouble DEBUGGING
~~ ../t/re/fold_grind_8.t ...................................... FAILED Non-zero exit status: 2 No plan found in TAP output
  [stdio] -Dcc=clang++ -Duse64bitall DEBUGGING
  [stdio] -Dcc=clang++ -Duse64bitall
  [stdio] -Dcc=clang++
  [stdio] -Dcc=clang++ DEBUGGING
  [stdio] -Dcc=clang++ -Duselongdouble
  [stdio] -Dcc=clang++ -Duselongdouble DEBUGGING
~~ ../t/op/recurse.t ........................................... FAILED Non-zero exit status: 2 No plan found in TAP output
  [stdio] -Dcc=clang++ -Duse64bitall DEBUGGING
  [stdio] -Dcc=clang++ -Duse64bitall
  [stdio] -Dcc=clang++
  [stdio] -Dcc=clang++ DEBUGGING
  [stdio] -Dcc=clang++ -Duselongdouble
  [stdio] -Dcc=clang++ -Duselongdouble DEBUGGING
~~ ../dist/Storable/t/downgrade.t .............................. FAILED 13-14 66-67 125-127 Non-zero exit status: 30
  [stdio] -Dcc=clang++ -Duselongdouble
~~ ../dist/threads/t/kill2.t ................................... FAILED Non-zero exit status: 2 No plan found in TAP output
  [stdio] -Dcc=clang++ -Duse64bitall DEBUGGING
  [stdio] -Dcc=clang++ -Duse64bitall
  [stdio] -Dcc=clang++
  [stdio] -Dcc=clang++ DEBUGGING
  [stdio] -Dcc=clang++ -Duselongdouble
  [stdio] -Dcc=clang++ -Duselongdouble DEBUGGING
~~ ../t/re/fold_grind_aa.t ..................................... FAILED Non-zero exit status: 2 No plan found in TAP output
  [stdio] -Dcc=clang++ -Duse64bitall DEBUGGING
  [stdio] -Dcc=clang++ -Duse64bitall
  [stdio] -Dcc=clang++
  [stdio] -Dcc=clang++ DEBUGGING
  [stdio] -Dcc=clang++ -Duselongdouble
  [stdio] -Dcc=clang++ -Duselongdouble DEBUGGING
~~ ../t/op/reset.t ............................................. FAILED Non-zero exit status: 2 No plan found in TAP output
  [stdio] -Dcc=clang++ -Duse64bitall DEBUGGING
  [stdio] -Dcc=clang++ -Duse64bitall
  [stdio] -Dcc=clang++
  [stdio] -Dcc=clang++ DEBUGGING
  [stdio] -Dcc=clang++ -Duselongdouble
  [stdio] -Dcc=clang++ -Duselongdouble DEBUGGING
~~ ../t/op/gmagic.t ............................................ FAILED Non-zero exit status: 2 No plan found in TAP output
  [stdio] -Dcc=clang++ -Duse64bitall DEBUGGING
  [stdio] -Dcc=clang++ -Duse64bitall
  [stdio] -Dcc=clang++
  [stdio] -Dcc=clang++ DEBUGGING
  [stdio] -Dcc=clang++ -Duselongdouble
  [stdio] -Dcc=clang++ -Duselongdouble DEBUGGING
~~ ../cpan/Test-Simple/t/regression/todo_and_facets.t .......... FAILED Non-zero exit status: 255 No plan found in TAP output
  [stdio] -Dcc=clang++ -Duse64bitall DEBUGGING
  [stdio] -Dcc=clang++ -Duse64bitall
  [stdio] -Dcc=clang++
  [stdio] -Dcc=clang++ DEBUGGING
  [stdio] -Dcc=clang++ -Duselongdouble
  [stdio] -Dcc=clang++ -Duselongdouble DEBUGGING
~~ ../t/op/waitpid.t ........................................... FAILED Non-zero exit status: 2 No plan found in TAP output
  [stdio] -Dcc=clang++ -Duse64bitall DEBUGGING
  [stdio] -Dcc=clang++ -Duse64bitall
  [stdio] -Dcc=clang++
  [stdio] -Dcc=clang++ DEBUGGING
  [stdio] -Dcc=clang++ -Duselongdouble
  [stdio] -Dcc=clang++ -Duselongdouble DEBUGGING
~~ ../t/op/study.t ............................................. FAILED Non-zero exit status: 2 No plan found in TAP output
  [stdio] -Dcc=clang++ -Duse64bitall DEBUGGING
  [stdio] -Dcc=clang++ -Duse64bitall
  [stdio] -Dcc=clang++
  [stdio] -Dcc=clang++ DEBUGGING
  [stdio] -Dcc=clang++ -Duselongdouble
  [stdio] -Dcc=clang++ -Duselongdouble DEBUGGING
~~ ../ext/re/t/regop.t ......................................... FAILED Non-zero exit status: 2 No plan found in TAP output
  [stdio] -Dcc=clang++ -Duse64bitall DEBUGGING
  [stdio] -Dcc=clang++ -Duse64bitall
  [stdio] -Dcc=clang++
  [stdio] -Dcc=clang++ DEBUGGING
  [stdio] -Dcc=clang++ -Duselongdouble
  [stdio] -Dcc=clang++ -Duselongdouble DEBUGGING
~~ ../t/uni/overload.t ......................................... FAILED Non-zero exit status: 2 No plan found in TAP output
  [stdio] -Dcc=clang++ -Duse64bitall DEBUGGING
  [stdio] -Dcc=clang++ -Duse64bitall
  [stdio] -Dcc=clang++
  [stdio] -Dcc=clang++ DEBUGGING
  [stdio] -Dcc=clang++ -Duselongdouble
  [stdio] -Dcc=clang++ -Duselongdouble DEBUGGING
~~ ../t/op/exec.t .............................................. FAILED Non-zero exit status: 2 No plan found in TAP output
  [stdio] -Dcc=clang++ -Duse64bitall DEBUGGING
  [stdio] -Dcc=clang++ -Duse64bitall
  [stdio] -Dcc=clang++
  [stdio] -Dcc=clang++ DEBUGGING
  [stdio] -Dcc=clang++ -Duselongdouble
  [stdio] -Dcc=clang++ -Duselongdouble DEBUGGING
~~ ../t/re/subst.t ............................................. FAILED Non-zero exit status: 2 No plan found in TAP output
  [stdio] -Dcc=clang++ -Duse64bitall DEBUGGING
  [stdio] -Dcc=clang++ -Duse64bitall
  [stdio] -Dcc=clang++
  [stdio] -Dcc=clang++ DEBUGGING
  [stdio] -Dcc=clang++ -Duselongdouble
  [stdio] -Dcc=clang++ -Duselongdouble DEBUGGING
~~ ../t/re/fold_grind_a.t ...................................... FAILED Non-zero exit status: 2 No plan found in TAP output
  [stdio] -Dcc=clang++ -Duse64bitall DEBUGGING
  [stdio] -Dcc=clang++ -Duse64bitall
  [stdio] -Dcc=clang++
  [stdio] -Dcc=clang++ DEBUGGING
  [stdio] -Dcc=clang++ -Duselongdouble
  [stdio] -Dcc=clang++ -Duselongdouble DEBUGGING
~~ ../lib/overload_fallback.t .................................. FAILED Non-zero exit status: 2 No plan found in TAP output
  [stdio] -Dcc=clang++ -Duse64bitall DEBUGGING
  [stdio] -Dcc=clang++ -Duse64bitall
  [stdio] -Dcc=clang++
  [stdio] -Dcc=clang++ DEBUGGING
  [stdio] -Dcc=clang++ -Duselongdouble
  [stdio] -Dcc=clang++ -Duselongdouble DEBUGGING
~~ ../t/porting/exec-bit.t ..................................... FAILED Non-zero exit status: 2 No plan found in TAP output
  [stdio] -Dcc=clang++ -Duse64bitall DEBUGGING
  [stdio] -Dcc=clang++ -Duse64bitall
  [stdio] -Dcc=clang++
  [stdio] -Dcc=clang++ DEBUGGING
  [stdio] -Dcc=clang++ -Duselongdouble
  [stdio] -Dcc=clang++ -Duselongdouble DEBUGGING
~~ ../t/op/stat_errors.t ....................................... FAILED Non-zero exit status: 2 No plan found in TAP output
  [stdio] -Dcc=clang++ -Duse64bitall DEBUGGING
  [stdio] -Dcc=clang++ -Duse64bitall
  [stdio] -Dcc=clang++
  [stdio] -Dcc=clang++ DEBUGGING
  [stdio] -Dcc=clang++ -Duselongdouble
  [stdio] -Dcc=clang++ -Duselongdouble DEBUGGING
~~ ../t/op/svleak.t ............................................ FAILED Non-zero exit status: 2 No plan found in TAP output
  [stdio] -Dcc=clang++ -Duse64bitall DEBUGGING
  [stdio] -Dcc=clang++ -Duse64bitall
  [stdio] -Dcc=clang++
  [stdio] -Dcc=clang++ DEBUGGING
  [stdio] -Dcc=clang++ -Duselongdouble
  [stdio] -Dcc=clang++ -Duselongdouble DEBUGGING
~~ ../t/op/args.t .............................................. FAILED Non-zero exit status: 2 No plan found in TAP output
  [stdio] -Dcc=clang++ -Duse64bitall DEBUGGING
  [stdio] -Dcc=clang++ -Duse64bitall
  [stdio] -Dcc=clang++
  [stdio] -Dcc=clang++ DEBUGGING
  [stdio] -Dcc=clang++ -Duselongdouble
  [stdio] -Dcc=clang++ -Duselongdouble DEBUGGING
~~ ../t/run/switchM.t .......................................... FAILED Non-zero exit status: 2 No plan found in TAP output
  [stdio] -Dcc=clang++ -Duse64bitall DEBUGGING
  [stdio] -Dcc=clang++ -Duse64bitall
  [stdio] -Dcc=clang++
  [stdio] -Dcc=clang++ DEBUGGING
  [stdio] -Dcc=clang++ -Duselongdouble
  [stdio] -Dcc=clang++ -Duselongdouble DEBUGGING
~~ ../t/op/delete.t ............................................ FAILED Non-zero exit status: 2 No plan found in TAP output
  [stdio] -Dcc=clang++ -Duse64bitall DEBUGGING
  [stdio] -Dcc=clang++ -Duse64bitall
  [stdio] -Dcc=clang++
  [stdio] -Dcc=clang++ DEBUGGING
  [stdio] -Dcc=clang++ -Duselongdouble
  [stdio] -Dcc=clang++ -Duselongdouble DEBUGGING
~~ ../t/mro/isa_dfs_utf8.t ..................................... FAILED Non-zero exit status: 2 No plan found in TAP output
  [stdio] -Dcc=clang++ -Duse64bitall DEBUGGING
  [stdio] -Dcc=clang++ -Duse64bitall
  [stdio] -Dcc=clang++
  [stdio] -Dcc=clang++ DEBUGGING
  [stdio] -Dcc=clang++ -Duselongdouble
  [stdio] -Dcc=clang++ -Duselongdouble DEBUGGING
~~ ../ext/B/t/o.t .............................................. FAILED Non-zero exit status: 2 No plan found in TAP output
  [stdio] -Dcc=clang++ -Duse64bitall DEBUGGING
  [stdio] -Dcc=clang++ -Duse64bitall
  [stdio] -Dcc=clang++
  [stdio] -Dcc=clang++ DEBUGGING
  [stdio] -Dcc=clang++ -Duselongdouble
  [stdio] -Dcc=clang++ -Duselongdouble DEBUGGING
~~ ../cpan/Compress-Raw-Bzip2/t/09limitoutput.t ................ FAILED Non-zero exit status: 255 No plan found in TAP output
  [stdio] -Dcc=clang++ -Duse64bitall DEBUGGING
  [stdio] -Dcc=clang++ -Duse64bitall
  [stdio] -Dcc=clang++
  [stdio] -Dcc=clang++ DEBUGGING
  [stdio] -Dcc=clang++ -Duselongdouble
  [stdio] -Dcc=clang++ -Duselongdouble DEBUGGING
~~ ../t/run/runenv.t ........................................... FAILED Non-zero exit status: 2 No plan found in TAP output
  [stdio] -Dcc=clang++ -Duse64bitall DEBUGGING
  [stdio] -Dcc=clang++ -Duse64bitall
  [stdio] -Dcc=clang++
  [stdio] -Dcc=clang++ DEBUGGING
  [stdio] -Dcc=clang++ -Duselongdouble
  [stdio] -Dcc=clang++ -Duselongdouble DEBUGGING
~~ ../t/porting/bincompat.t .................................... FAILED Non-zero exit status: 2 No plan found in TAP output
  [stdio] -Dcc=clang++ -Duse64bitall DEBUGGING
  [stdio] -Dcc=clang++ -Duse64bitall
  [stdio] -Dcc=clang++
  [stdio] -Dcc=clang++ DEBUGGING
  [stdio] -Dcc=clang++ -Duselongdouble
  [stdio] -Dcc=clang++ -Duselongdouble DEBUGGING
~~ ../cpan/Test-Simple/t/Legacy/todo.t ......................... FAILED Non-zero exit status: 255 No plan found in TAP output
  [stdio] -Dcc=clang++ -Duse64bitall DEBUGGING
  [stdio] -Dcc=clang++ -Duse64bitall
  [stdio] -Dcc=clang++
  [stdio] -Dcc=clang++ DEBUGGING
  [stdio] -Dcc=clang++ -Duselongdouble
  [stdio] -Dcc=clang++ -Duselongdouble DEBUGGING
~~ ../ext/DynaLoader/t/DynaLoader.t ............................ FAILED Non-zero exit status: 2 No plan found in TAP output
  [stdio] -Dcc=clang++ -Duse64bitall DEBUGGING
  [stdio] -Dcc=clang++ -Duse64bitall
  [stdio] -Dcc=clang++
  [stdio] -Dcc=clang++ DEBUGGING
  [stdio] -Dcc=clang++ -Duselongdouble
  [stdio] -Dcc=clang++ -Duselongdouble DEBUGGING
~~ ../dist/threads/t/kill3.t ................................... FAILED Non-zero exit status: 2 No plan found in TAP output
  [stdio] -Dcc=clang++ -Duse64bitall DEBUGGING
  [stdio] -Dcc=clang++ -Duse64bitall
  [stdio] -Dcc=clang++
  [stdio] -Dcc=clang++ DEBUGGING
  [stdio] -Dcc=clang++ -Duselongdouble
  [stdio] -Dcc=clang++ -Duselongdouble DEBUGGING
~~ ../lib/B/Deparse-subclass.t ................................. FAILED Non-zero exit status: 255 Bad plan.  You planned 2 tests but ran 0.
  [stdio] -Dcc=clang++ -Duse64bitall DEBUGGING
  [stdio] -Dcc=clang++ -Duse64bitall
  [stdio] -Dcc=clang++
  [stdio] -Dcc=clang++ DEBUGGING
  [stdio] -Dcc=clang++ -Duselongdouble
  [stdio] -Dcc=clang++ -Duselongdouble DEBUGGING
~~ ../dist/threads/t/exit.t .................................... FAILED Non-zero exit status: 2 No plan found in TAP output
  [stdio] -Dcc=clang++ -Duse64bitall DEBUGGING
  [stdio] -Dcc=clang++ -Duse64bitall
  [stdio] -Dcc=clang++
  [stdio] -Dcc=clang++ DEBUGGING
  [stdio] -Dcc=clang++ -Duselongdouble
  [stdio] -Dcc=clang++ -Duselongdouble DEBUGGING
~~ ../cpan/Compress-Raw-Zlib/t/07bufsize.t ..................... FAILED Non-zero exit status: 255 No plan found in TAP output
  [stdio] -Dcc=clang++ -Duse64bitall DEBUGGING
  [stdio] -Dcc=clang++ -Duse64bitall
  [stdio] -Dcc=clang++
  [stdio] -Dcc=clang++ DEBUGGING
  [stdio] -Dcc=clang++ -Duselongdouble
  [stdio] -Dcc=clang++ -Duselongdouble DEBUGGING
~~ ../t/uni/tr_utf8.t .......................................... FAILED Non-zero exit status: 2 No plan found in TAP output
  [stdio] -Dcc=clang++ -Duse64bitall DEBUGGING
  [stdio] -Dcc=clang++ -Duse64bitall
  [stdio] -Dcc=clang++
  [stdio] -Dcc=clang++ DEBUGGING
  [stdio] -Dcc=clang++ -Duselongdouble
  [stdio] -Dcc=clang++ -Duselongdouble DEBUGGING
~~ ../cpan/IPC-SysV/t/msg.t .................................... FAILED Non-zero exit status: 255 No plan found in TAP output
  [stdio] -Dcc=clang++ -Duse64bitall DEBUGGING
  [stdio] -Dcc=clang++ -Duse64bitall
  [stdio] -Dcc=clang++
  [stdio] -Dcc=clang++ DEBUGGING
  [stdio] -Dcc=clang++ -Duselongdouble
  [stdio] -Dcc=clang++ -Duselongdouble DEBUGGING
~~ ../t/op/utf8decode.t ........................................ FAILED Non-zero exit status: 2 No plan found in TAP output
  [stdio] -Dcc=clang++ -Duse64bitall DEBUGGING
  [stdio] -Dcc=clang++ -Duse64bitall
  [stdio] -Dcc=clang++
  [stdio] -Dcc=clang++ DEBUGGING
  [stdio] -Dcc=clang++ -Duselongdouble
  [stdio] -Dcc=clang++ -Duselongdouble DEBUGGING
~~ ../cpan/Test-Simple/t/Legacy/fail-more.t .................... FAILED Non-zero exit status: 255 No plan found in TAP output
  [stdio] -Dcc=clang++ -Duse64bitall DEBUGGING
  [stdio] -Dcc=clang++ -Duse64bitall
  [stdio] -Dcc=clang++
  [stdio] -Dcc=clang++ DEBUGGING
  [stdio] -Dcc=clang++ -Duselongdouble
  [stdio] -Dcc=clang++ -Duselongdouble DEBUGGING
~~ ../t/uni/sprintf.t .......................................... FAILED Non-zero exit status: 2 No plan found in TAP output
  [stdio] -Dcc=clang++ -Duse64bitall DEBUGGING
  [stdio] -Dcc=clang++ -Duse64bitall
  [stdio] -Dcc=clang++
  [stdio] -Dcc=clang++ DEBUGGING
  [stdio] -Dcc=clang++ -Duselongdouble
  [stdio] -Dcc=clang++ -Duselongdouble DEBUGGING
~~ ../t/run/switcha.t .......................................... FAILED Non-zero exit status: 2 No plan found in TAP output
  [stdio] -Dcc=clang++ -Duse64bitall DEBUGGING
  [stdio] -Dcc=clang++ -Duse64bitall
  [stdio] -Dcc=clang++
  [stdio] -Dcc=clang++ DEBUGGING
  [stdio] -Dcc=clang++ -Duselongdouble
  [stdio] -Dcc=clang++ -Duselongdouble DEBUGGING
~~ ../t/porting/ss_dup.t ....................................... FAILED Non-zero exit status: 2 No plan found in TAP output
  [stdio] -Dcc=clang++ -Duse64bitall DEBUGGING
  [stdio] -Dcc=clang++ -Duse64bitall
  [stdio] -Dcc=clang++
  [stdio] -Dcc=clang++ DEBUGGING
  [stdio] -Dcc=clang++ -Duselongdouble
  [stdio] -Dcc=clang++ -Duselongdouble DEBUGGING
~~ ../t/mro/recursion_c3.t ..................................... FAILED Non-zero exit status: 2 No plan found in TAP output
  [stdio] -Dcc=clang++ -Duse64bitall DEBUGGING
  [stdio] -Dcc=clang++ -Duse64bitall
  [stdio] -Dcc=clang++
  [stdio] -Dcc=clang++ DEBUGGING
  [stdio] -Dcc=clang++ -Duselongdouble
  [stdio] -Dcc=clang++ -Duselongdouble DEBUGGING
~~ ../t/re/qr_gc.t ............................................. FAILED Non-zero exit status: 2 No plan found in TAP output
  [stdio] -Dcc=clang++ -Duse64bitall DEBUGGING
  [stdio] -Dcc=clang++ -Duse64bitall
  [stdio] -Dcc=clang++
  [stdio] -Dcc=clang++ DEBUGGING
  [stdio] -Dcc=clang++ -Duselongdouble
  [stdio] -Dcc=clang++ -Duselongdouble DEBUGGING
~~ ../t/uni/universal.t ........................................ FAILED Non-zero exit status: 2 No plan found in TAP output
  [stdio] -Dcc=clang++ -Duse64bitall DEBUGGING
  [stdio] -Dcc=clang++ -Duse64bitall
  [stdio] -Dcc=clang++
  [stdio] -Dcc=clang++ DEBUGGING
  [stdio] -Dcc=clang++ -Duselongdouble
  [stdio] -Dcc=clang++ -Duselongdouble DEBUGGING
~~ ../ext/XS-APItest/t/sym-hook.t .............................. FAILED Non-zero exit status: 255 Bad plan.  You planned 4 tests but ran 0.
  [stdio] -Dcc=clang++ -Duse64bitall DEBUGGING
  [stdio] -Dcc=clang++ -Duse64bitall
  [stdio] -Dcc=clang++
  [stdio] -Dcc=clang++ DEBUGGING
  [stdio] -Dcc=clang++ -Duselongdouble
  [stdio] -Dcc=clang++ -Duselongdouble DEBUGGING
~~ ../t/io/print.t ............................................. FAILED Non-zero exit status: 2 No plan found in TAP output
  [stdio] -Dcc=clang++ -Duse64bitall DEBUGGING
  [stdio] -Dcc=clang++ -Duse64bitall
  [stdio] -Dcc=clang++
  [stdio] -Dcc=clang++ DEBUGGING
  [stdio] -Dcc=clang++ -Duselongdouble
  [stdio] -Dcc=clang++ -Duselongdouble DEBUGGING
~~ ../t/op/attrs.t ............................................. FAILED Non-zero exit status: 2 No plan found in TAP output
  [stdio] -Dcc=clang++ -Duse64bitall DEBUGGING
  [stdio] -Dcc=clang++ -Duse64bitall
  [stdio] -Dcc=clang++
  [stdio] -Dcc=clang++ DEBUGGING
  [stdio] -Dcc=clang++ -Duselongdouble
  [stdio] -Dcc=clang++ -Duselongdouble DEBUGGING
~~ ../ext/XS-APItest/t/svpv_magic.t ............................ FAILED Non-zero exit status: 2 Bad plan.  You planned 10 tests but ran 1.
  [stdio] -Dcc=clang++ -Duse64bitall DEBUGGING
  [stdio] -Dcc=clang++ -Duse64bitall
  [stdio] -Dcc=clang++
  [stdio] -Dcc=clang++ DEBUGGING
  [stdio] -Dcc=clang++ -Duselongdouble
  [stdio] -Dcc=clang++ -Duselongdouble DEBUGGING
~~ ../cpan/Getopt-Long/t/gol-oo.t .............................. FAILED Non-zero exit status: 255 No plan found in TAP output
  [stdio] -Dcc=clang++ -Duse64bitall DEBUGGING
  [stdio] -Dcc=clang++ -Duse64bitall
  [stdio] -Dcc=clang++
  [stdio] -Dcc=clang++ DEBUGGING
  [stdio] -Dcc=clang++ -Duselongdouble
  [stdio] -Dcc=clang++ -Duselongdouble DEBUGGING
~~ ../cpan/Pod-Simple/t/verb_fmt.t ............................. FAILED Non-zero exit status: 255 Bad plan.  You planned 62 tests but ran 0.
  [stdio] -Dcc=clang++ -Duse64bitall DEBUGGING
  [stdio] -Dcc=clang++ -Duse64bitall
  [stdio] -Dcc=clang++
  [stdio] -Dcc=clang++ DEBUGGING
  [stdio] -Dcc=clang++ -Duselongdouble
  [stdio] -Dcc=clang++ -Duselongdouble DEBUGGING
~~ ../ext/FileCache/t/02maxopen.t .............................. FAILED Non-zero exit status: 25 Bad plan.  You planned 5 tests but ran 0.
  [stdio] -Dcc=clang++ -Duse64bitall DEBUGGING
  [stdio] -Dcc=clang++ -Duse64bitall
  [stdio] -Dcc=clang++
  [stdio] -Dcc=clang++ DEBUGGING
  [stdio] -Dcc=clang++ -Duselongdouble
  [stdio] -Dcc=clang++ -Duselongdouble DEBUGGING
~~ ../t/op/sub.t ............................................... FAILED Non-zero exit status: 2 No plan found in TAP output
  [stdio] -Dcc=clang++ -Duse64bitall DEBUGGING
  [stdio] -Dcc=clang++ -Duse64bitall
  [stdio] -Dcc=clang++
  [stdio] -Dcc=clang++ DEBUGGING
  [stdio] -Dcc=clang++ -Duselongdouble
  [stdio] -Dcc=clang++ -Duselongdouble DEBUGGING
~~ ../ext/Opcode/t/ops.t ....................................... FAILED Non-zero exit status: 255 No plan found in TAP output
  [stdio] -Dcc=clang++ -Duse64bitall DEBUGGING
  [stdio] -Dcc=clang++ -Duse64bitall
  [stdio] -Dcc=clang++
  [stdio] -Dcc=clang++ DEBUGGING
  [stdio] -Dcc=clang++ -Duselongdouble
  [stdio] -Dcc=clang++ -Duselongdouble DEBUGGING
~~ ../cpan/Test-Simple/t/Legacy/subtest/singleton.t ............ FAILED Non-zero exit status: 255 Bad plan.  You planned 3 tests but ran 0.
  [stdio] -Dcc=clang++ -Duse64bitall DEBUGGING
  [stdio] -Dcc=clang++ -Duse64bitall
  [stdio] -Dcc=clang++
  [stdio] -Dcc=clang++ DEBUGGING
  [stdio] -Dcc=clang++ -Duselongdouble
  [stdio] -Dcc=clang++ -Duselongdouble DEBUGGING
~~ ../t/re/keep_tabs.t ......................................... FAILED Non-zero exit status: 2 No plan found in TAP output
  [stdio] -Dcc=clang++ -Duse64bitall DEBUGGING
  [stdio] -Dcc=clang++ -Duse64bitall
  [stdio] -Dcc=clang++
  [stdio] -Dcc=clang++ DEBUGGING
  [stdio] -Dcc=clang++ -Duselongdouble
  [stdio] -Dcc=clang++ -Duselongdouble DEBUGGING
~~ ../t/porting/filenames.t .................................... FAILED Non-zero exit status: 2 No plan found in TAP output
  [stdio] -Dcc=clang++ -Duse64bitall DEBUGGING
  [stdio] -Dcc=clang++ -Duse64bitall
  [stdio] -Dcc=clang++
  [stdio] -Dcc=clang++ DEBUGGING
  [stdio] -Dcc=clang++ -Duselongdouble
  [stdio] -Dcc=clang++ -Duselongdouble DEBUGGING
~~ ../t/op/evalbytes.t ......................................... FAILED Non-zero exit status: 2 No plan found in TAP output
  [stdio] -Dcc=clang++ -Duse64bitall DEBUGGING
  [stdio] -Dcc=clang++ -Duse64bitall
  [stdio] -Dcc=clang++
  [stdio] -Dcc=clang++ DEBUGGING
  [stdio] -Dcc=clang++ -Duselongdouble
  [stdio] -Dcc=clang++ -Duselongdouble DEBUGGING
~~ ../t/mro/isarev.t ........................................... FAILED Non-zero exit status: 2 No plan found in TAP output
  [stdio] -Dcc=clang++ -Duse64bitall DEBUGGING
  [stdio] -Dcc=clang++ -Duse64bitall
  [stdio] -Dcc=clang++
  [stdio] -Dcc=clang++ DEBUGGING
  [stdio] -Dcc=clang++ -Duselongdouble
  [stdio] -Dcc=clang++ -Duselongdouble DEBUGGING
~~ ../t/op/ver.t ............................................... FAILED Non-zero exit status: 2 No plan found in TAP output
  [stdio] -Dcc=clang++ -Duse64bitall DEBUGGING
  [stdio] -Dcc=clang++ -Duse64bitall
  [stdio] -Dcc=clang++
  [stdio] -Dcc=clang++ DEBUGGING
  [stdio] -Dcc=clang++ -Duselongdouble
  [stdio] -Dcc=clang++ -Duselongdouble DEBUGGING
~~ ../t/re/no_utf8_pm.t ........................................ FAILED Non-zero exit status: 2 No plan found in TAP output
  [stdio] -Dcc=clang++ -Duse64bitall DEBUGGING
  [stdio] -Dcc=clang++ -Duse64bitall
  [stdio] -Dcc=clang++
  [stdio] -Dcc=clang++ DEBUGGING
  [stdio] -Dcc=clang++ -Duselongdouble
  [stdio] -Dcc=clang++ -Duselongdouble DEBUGGING
~~ ../cpan/Test-Simple/t/Test2/behavior/Taint.t ................ FAILED Non-zero exit status: 255 No plan found in TAP output
  [stdio] -Dcc=clang++ -Duse64bitall DEBUGGING
  [stdio] -Dcc=clang++ -Duse64bitall
  [stdio] -Dcc=clang++
  [stdio] -Dcc=clang++ DEBUGGING
  [stdio] -Dcc=clang++ -Duselongdouble
  [stdio] -Dcc=clang++ -Duselongdouble DEBUGGING
~~ ../t/porting/copyright.t .................................... FAILED Non-zero exit status: 2 No plan found in TAP output
  [stdio] -Dcc=clang++ -Duse64bitall DEBUGGING
  [stdio] -Dcc=clang++ -Duse64bitall
  [stdio] -Dcc=clang++
  [stdio] -Dcc=clang++ DEBUGGING
  [stdio] -Dcc=clang++ -Duselongdouble
  [stdio] -Dcc=clang++ -Duselongdouble DEBUGGING
~~ ../t/re/substT.t ............................................ FAILED No plan found in TAP output
  [stdio] -Dcc=clang++ -Duse64bitall DEBUGGING
  [stdio] -Dcc=clang++ -Duse64bitall
  [stdio] -Dcc=clang++
  [stdio] -Dcc=clang++ DEBUGGING
  [stdio] -Dcc=clang++ -Duselongdouble
  [stdio] -Dcc=clang++ -Duselongdouble DEBUGGING
~~ ../t/mro/inconsistent_c3.t .................................. FAILED Non-zero exit status: 2 No plan found in TAP output
  [stdio] -Dcc=clang++ -Duse64bitall DEBUGGING
  [stdio] -Dcc=clang++ -Duse64bitall
  [stdio] -Dcc=clang++
  [stdio] -Dcc=clang++ DEBUGGING
  [stdio] -Dcc=clang++ -Duselongdouble
  [stdio] -Dcc=clang++ -Duselongdouble DEBUGGING
~~ ../t/run/locale.t ........................................... FAILED Non-zero exit status: 2 No plan found in TAP output
  [stdio] -Dcc=clang++ -Duse64bitall DEBUGGING
  [stdio] -Dcc=clang++ -Duse64bitall
  [stdio] -Dcc=clang++
  [stdio] -Dcc=clang++ DEBUGGING
  [stdio] -Dcc=clang++ -Duselongdouble
  [stdio] -Dcc=clang++ -Duselongdouble DEBUGGING
~~ ../t/op/rt119311.t .......................................... FAILED Non-zero exit status: 2 No plan found in TAP output
  [stdio] -Dcc=clang++ -Duse64bitall DEBUGGING
  [stdio] -Dcc=clang++ -Duse64bitall
  [stdio] -Dcc=clang++
  [stdio] -Dcc=clang++ DEBUGGING
  [stdio] -Dcc=clang++ -Duselongdouble
  [stdio] -Dcc=clang++ -Duselongdouble DEBUGGING
~~ ../t/io/eintr.t ............................................. FAILED Non-zero exit status: 2 No plan found in TAP output
  [stdio] -Dcc=clang++ -Duse64bitall DEBUGGING
  [stdio] -Dcc=clang++ -Duse64bitall
  [stdio] -Dcc=clang++
  [stdio] -Dcc=clang++ DEBUGGING
  [stdio] -Dcc=clang++ -Duselongdouble
  [stdio] -Dcc=clang++ -Duselongdouble DEBUGGING
~~ ../t/op/protowarn.t ......................................... FAILED Non-zero exit status: 2 No plan found in TAP output
  [stdio] -Dcc=clang++ -Duse64bitall DEBUGGING
  [stdio] -Dcc=clang++ -Duse64bitall
  [stdio] -Dcc=clang++
  [stdio] -Dcc=clang++ DEBUGGING
  [stdio] -Dcc=clang++ -Duselongdouble
  [stdio] -Dcc=clang++ -Duselongdouble DEBUGGING
~~ ../t/op/pow.t ............................................... FAILED Non-zero exit status: 2 No plan found in TAP output
  [stdio] -Dcc=clang++ -Duse64bitall DEBUGGING
  [stdio] -Dcc=clang++ -Duse64bitall
  [stdio] -Dcc=clang++
  [stdio] -Dcc=clang++ DEBUGGING
  [stdio] -Dcc=clang++ -Duselongdouble
  [stdio] -Dcc=clang++ -Duselongdouble DEBUGGING
~~ ../lib/feature/unicode_strings.t ............................ FAILED Non-zero exit status: 2 No plan found in TAP output
  [stdio] -Dcc=clang++ -Duse64bitall DEBUGGING
  [stdio] -Dcc=clang++ -Duse64bitall
  [stdio] -Dcc=clang++
  [stdio] -Dcc=clang++ DEBUGGING
  [stdio] -Dcc=clang++ -Duselongdouble
  [stdio] -Dcc=clang++ -Duselongdouble DEBUGGING
~~ ../t/mro/isarev_utf8.t ...................................... FAILED Non-zero exit status: 2 No plan found in TAP output
  [stdio] -Dcc=clang++ -Duse64bitall DEBUGGING
  [stdio] -Dcc=clang++ -Duse64bitall
  [stdio] -Dcc=clang++
  [stdio] -Dcc=clang++ DEBUGGING
  [stdio] -Dcc=clang++ -Duselongdouble
  [stdio] -Dcc=clang++ -Duselongdouble DEBUGGING
~~ ../t/op/leaky-magic.t ....................................... FAILED Non-zero exit status: 2 No plan found in TAP output
  [stdio] -Dcc=clang++ -Duse64bitall DEBUGGING
  [stdio] -Dcc=clang++ -Duse64bitall
  [stdio] -Dcc=clang++
  [stdio] -Dcc=clang++ DEBUGGING
  [stdio] -Dcc=clang++ -Duselongdouble
  [stdio] -Dcc=clang++ -Duselongdouble DEBUGGING
~~ ../t/io/eintr_print.t ....................................... FAILED Non-zero exit status: 2 No plan found in TAP output
  [stdio] -Dcc=clang++ -Duse64bitall DEBUGGING
  [stdio] -Dcc=clang++ -Duse64bitall
  [stdio] -Dcc=clang++
  [stdio] -Dcc=clang++ DEBUGGING
  [stdio] -Dcc=clang++ -Duselongdouble
  [stdio] -Dcc=clang++ -Duselongdouble DEBUGGING
~~ ../t/re/fold_grind_d.t ...................................... FAILED Non-zero exit status: 2 No plan found in TAP output
  [stdio] -Dcc=clang++ -Duse64bitall DEBUGGING
  [stdio] -Dcc=clang++ -Duse64bitall
  [stdio] -Dcc=clang++
  [stdio] -Dcc=clang++ DEBUGGING
  [stdio] -Dcc=clang++ -Duselongdouble
  [stdio] -Dcc=clang++ -Duselongdouble DEBUGGING
~~ ../t/io/pipe.t .............................................. FAILED Non-zero exit status: 2 No plan found in TAP output
  [stdio] -Dcc=clang++ -Duse64bitall DEBUGGING
  [stdio] -Dcc=clang++ -Duse64bitall
  [stdio] -Dcc=clang++
  [stdio] -Dcc=clang++ DEBUGGING
  [stdio] -Dcc=clang++ -Duselongdouble
  [stdio] -Dcc=clang++ -Duselongdouble DEBUGGING
~~ ../ext/B/t/sv_stash.t ....................................... FAILED Non-zero exit status: 2 No plan found in TAP output
  [stdio] -Dcc=clang++ -Duse64bitall DEBUGGING
  [stdio] -Dcc=clang++ -Duse64bitall
  [stdio] -Dcc=clang++
  [stdio] -Dcc=clang++ DEBUGGING
  [stdio] -Dcc=clang++ -Duselongdouble
  [stdio] -Dcc=clang++ -Duselongdouble DEBUGGING
~~ ../t/uni/eval.t ............................................. FAILED Non-zero exit status: 2 No plan found in TAP output
  [stdio] -Dcc=clang++ -Duse64bitall DEBUGGING
  [stdio] -Dcc=clang++ -Duse64bitall
  [stdio] -Dcc=clang++
  [stdio] -Dcc=clang++ DEBUGGING
  [stdio] -Dcc=clang++ -Duselongdouble
  [stdio] -Dcc=clang++ -Duselongdouble DEBUGGING
~~ ../t/op/index.t ............................................. FAILED Non-zero exit status: 2 No plan found in TAP output
  [stdio] -Dcc=clang++ -Duse64bitall DEBUGGING
  [stdio] -Dcc=clang++ -Duse64bitall
  [stdio] -Dcc=clang++
  [stdio] -Dcc=clang++ DEBUGGING
  [stdio] -Dcc=clang++ -Duselongdouble
  [stdio] -Dcc=clang++ -Duselongdouble DEBUGGING
~~ ../t/op/die_keeperr.t ....................................... FAILED Non-zero exit status: 2 No plan found in TAP output
  [stdio] -Dcc=clang++ -Duse64bitall DEBUGGING
  [stdio] -Dcc=clang++ -Duse64bitall
  [stdio] -Dcc=clang++
  [stdio] -Dcc=clang++ DEBUGGING
  [stdio] -Dcc=clang++ -Duselongdouble
  [stdio] -Dcc=clang++ -Duselongdouble DEBUGGING
~~ ../ext/FileCache/t/03append.t ............................... FAILED Non-zero exit status: 25 Bad plan.  You planned 2 tests but ran 0.
  [stdio] -Dcc=clang++ -Duse64bitall DEBUGGING
  [stdio] -Dcc=clang++ -Duse64bitall
  [stdio] -Dcc=clang++
  [stdio] -Dcc=clang++ DEBUGGING
  [stdio] -Dcc=clang++ -Duselongdouble
  [stdio] -Dcc=clang++ -Duselongdouble DEBUGGING
~~ ../t/perf/benchmarks.t ...................................... FAILED Non-zero exit status: 2 No plan found in TAP output
  [stdio] -Dcc=clang++ -Duse64bitall DEBUGGING
  [stdio] -Dcc=clang++ -Duse64bitall
  [stdio] -Dcc=clang++
  [stdio] -Dcc=clang++ DEBUGGING
  [stdio] -Dcc=clang++ -Duselongdouble
  [stdio] -Dcc=clang++ -Duselongdouble DEBUGGING
~~ ../t/op/sub_lval.t .......................................... FAILED Non-zero exit status: 2 No plan found in TAP output
  [stdio] -Dcc=clang++ -Duse64bitall DEBUGGING
  [stdio] -Dcc=clang++ -Duse64bitall
  [stdio] -Dcc=clang++
  [stdio] -Dcc=clang++ DEBUGGING
  [stdio] -Dcc=clang++ -Duselongdouble
  [stdio] -Dcc=clang++ -Duselongdouble DEBUGGING
~~ ../t/op/grent.t ............................................. FAILED Non-zero exit status: 2 No plan found in TAP output
  [stdio] -Dcc=clang++ -Duse64bitall DEBUGGING
  [stdio] -Dcc=clang++ -Duse64bitall
  [stdio] -Dcc=clang++
  [stdio] -Dcc=clang++ DEBUGGING
  [stdio] -Dcc=clang++ -Duselongdouble
  [stdio] -Dcc=clang++ -Duselongdouble DEBUGGING
~~ ../t/mro/basic.t ............................................ FAILED Non-zero exit status: 2 No plan found in TAP output
  [stdio] -Dcc=clang++ -Duse64bitall DEBUGGING
  [stdio] -Dcc=clang++ -Duse64bitall
  [stdio] -Dcc=clang++
  [stdio] -Dcc=clang++ DEBUGGING
  [stdio] -Dcc=clang++ -Duselongdouble
  [stdio] -Dcc=clang++ -Duselongdouble DEBUGGING
~~ ../t/io/binmode.t ........................................... FAILED Non-zero exit status: 2 No plan found in TAP output
  [stdio] -Dcc=clang++ -Duse64bitall DEBUGGING
  [stdio] -Dcc=clang++ -Duse64bitall
  [stdio] -Dcc=clang++
  [stdio] -Dcc=clang++ DEBUGGING
  [stdio] -Dcc=clang++ -Duselongdouble
  [stdio] -Dcc=clang++ -Duselongdouble DEBUGGING
~~ ../dist/threads/t/no_threads.t .............................. FAILED 1
  [stdio] -Dcc=clang++ -Duse64bitall DEBUGGING
  [stdio] -Dcc=clang++ -Duse64bitall
  [stdio] -Dcc=clang++
  [stdio] -Dcc=clang++ DEBUGGING
  [stdio] -Dcc=clang++ -Duselongdouble
  [stdio] -Dcc=clang++ -Duselongdouble DEBUGGING
~~ ../t/run/switchC.t .......................................... FAILED Non-zero exit status: 2 No plan found in TAP output
  [stdio] -Dcc=clang++ -Duse64bitall DEBUGGING
  [stdio] -Dcc=clang++ -Duse64bitall
  [stdio] -Dcc=clang++
  [stdio] -Dcc=clang++ DEBUGGING
  [stdio] -Dcc=clang++ -Duselongdouble
  [stdio] -Dcc=clang++ -Duselongdouble DEBUGGING
~~ ../t/io/fs.t ................................................ FAILED Non-zero exit status: 2 No plan found in TAP output
  [stdio] -Dcc=clang++ -Duse64bitall DEBUGGING
  [stdio] -Dcc=clang++ -Duse64bitall
  [stdio] -Dcc=clang++
  [stdio] -Dcc=clang++ DEBUGGING
  [stdio] -Dcc=clang++ -Duselongdouble
  [stdio] -Dcc=clang++ -Duselongdouble DEBUGGING
~~ ../t/op/while.t ............................................. FAILED Non-zero exit status: 2 No plan found in TAP output
  [stdio] -Dcc=clang++ -Duse64bitall DEBUGGING
  [stdio] -Dcc=clang++ -Duse64bitall
  [stdio] -Dcc=clang++
  [stdio] -Dcc=clang++ DEBUGGING
  [stdio] -Dcc=clang++ -Duselongdouble
  [stdio] -Dcc=clang++ -Duselongdouble DEBUGGING
~~ ../t/io/perlio_fail.t ....................................... FAILED Non-zero exit status: 2 No plan found in TAP output
  [stdio] -Dcc=clang++ -Duse64bitall DEBUGGING
  [stdio] -Dcc=clang++ -Duse64bitall
  [stdio] -Dcc=clang++
  [stdio] -Dcc=clang++ DEBUGGING
  [stdio] -Dcc=clang++ -Duselongdouble
  [stdio] -Dcc=clang++ -Duselongdouble DEBUGGING
~~ ../t/uni/stash.t ............................................ FAILED Non-zero exit status: 2 No plan found in TAP output
  [stdio] -Dcc=clang++ -Duse64bitall DEBUGGING
  [stdio] -Dcc=clang++ -Duse64bitall
  [stdio] -Dcc=clang++
  [stdio] -Dcc=clang++ DEBUGGING
  [stdio] -Dcc=clang++ -Duselongdouble
  [stdio] -Dcc=clang++ -Duselongdouble DEBUGGING
~~ ../t/op/vec.t ............................................... FAILED Non-zero exit status: 2 No plan found in TAP output
  [stdio] -Dcc=clang++ -Duse64bitall DEBUGGING
  [stdio] -Dcc=clang++ -Duse64bitall
  [stdio] -Dcc=clang++
  [stdio] -Dcc=clang++ DEBUGGING
  [stdio] -Dcc=clang++ -Duselongdouble
  [stdio] -Dcc=clang++ -Duselongdouble DEBUGGING
~~ ../t/op/sort.t .............................................. FAILED Non-zero exit status: 2 No plan found in TAP output
  [stdio] -Dcc=clang++ -Duse64bitall DEBUGGING
  [stdio] -Dcc=clang++ -Duse64bitall
  [stdio] -Dcc=clang++
  [stdio] -Dcc=clang++ DEBUGGING
  [stdio] -Dcc=clang++ -Duselongdouble
  [stdio] -Dcc=clang++ -Duselongdouble DEBUGGING
~~ ../cpan/Test-Simple/t/Legacy/harness_active.t ............... FAILED Non-zero exit status: 255 No plan found in TAP output
  [stdio] -Dcc=clang++ -Duse64bitall DEBUGGING
  [stdio] -Dcc=clang++ -Duse64bitall
  [stdio] -Dcc=clang++
  [stdio] -Dcc=clang++ DEBUGGING
  [stdio] -Dcc=clang++ -Duselongdouble
  [stdio] -Dcc=clang++ -Duselongdouble DEBUGGING
~~ ../t/op/substr_thr.t ........................................ FAILED Non-zero exit status: 2 No plan found in TAP output
  [stdio] -Dcc=clang++ -Duse64bitall DEBUGGING
  [stdio] -Dcc=clang++ -Duse64bitall
  [stdio] -Dcc=clang++
  [stdio] -Dcc=clang++ DEBUGGING
  [stdio] -Dcc=clang++ -Duselongdouble
  [stdio] -Dcc=clang++ -Duselongdouble DEBUGGING
~~ ../t/op/dump.t .............................................. FAILED Non-zero exit status: 2 No plan found in TAP output
  [stdio] -Dcc=clang++ -Duse64bitall DEBUGGING
  [stdio] -Dcc=clang++ -Duse64bitall
  [stdio] -Dcc=clang++
  [stdio] -Dcc=clang++ DEBUGGING
  [stdio] -Dcc=clang++ -Duselongdouble
  [stdio] -Dcc=clang++ -Duselongdouble DEBUGGING
~~ ../t/op/taint.t ............................................. FAILED Non-zero exit status: 2 No plan found in TAP output
  [stdio] -Dcc=clang++ -Duse64bitall DEBUGGING
  [stdio] -Dcc=clang++ -Duse64bitall
  [stdio] -Dcc=clang++
  [stdio] -Dcc=clang++ DEBUGGING
  [stdio] -Dcc=clang++ -Duselongdouble
  [stdio] -Dcc=clang++ -Duselongdouble DEBUGGING
~~ ../t/op/utf8cache.t ......................................... FAILED Non-zero exit status: 2 No plan found in TAP output
  [stdio] -Dcc=clang++ -Duse64bitall DEBUGGING
  [stdio] -Dcc=clang++ -Duse64bitall
  [stdio] -Dcc=clang++
  [stdio] -Dcc=clang++ DEBUGGING
  [stdio] -Dcc=clang++ -Duselongdouble
  [stdio] -Dcc=clang++ -Duselongdouble DEBUGGING
~~ ../t/op/split_unicode.t ..................................... FAILED Non-zero exit status: 2 No plan found in TAP output
  [stdio] -Dcc=clang++ -Duse64bitall DEBUGGING
  [stdio] -Dcc=clang++ -Duse64bitall
  [stdio] -Dcc=clang++
  [stdio] -Dcc=clang++ DEBUGGING
  [stdio] -Dcc=clang++ -Duselongdouble
  [stdio] -Dcc=clang++ -Duselongdouble DEBUGGING
~~ ../ext/B/t/optree_sort.t .................................... FAILED Non-zero exit status: 255 No plan found in TAP output
  [stdio] -Dcc=clang++ -Duse64bitall DEBUGGING
  [stdio] -Dcc=clang++ -Duse64bitall
  [stdio] -Dcc=clang++
  [stdio] -Dcc=clang++ DEBUGGING
  [stdio] -Dcc=clang++ -Duselongdouble
  [stdio] -Dcc=clang++ -Duselongdouble DEBUGGING
~~ ../t/mro/method_caching.t ................................... FAILED Non-zero exit status: 2 No plan found in TAP output
  [stdio] -Dcc=clang++ -Duse64bitall DEBUGGING
  [stdio] -Dcc=clang++ -Duse64bitall
  [stdio] -Dcc=clang++
  [stdio] -Dcc=clang++ DEBUGGING
  [stdio] -Dcc=clang++ -Duselongdouble
  [stdio] -Dcc=clang++ -Duselongdouble DEBUGGING
~~ ../t/op/not.t ............................................... FAILED Non-zero exit status: 2 No plan found in TAP output
  [stdio] -Dcc=clang++ -Duse64bitall DEBUGGING
  [stdio] -Dcc=clang++ -Duse64bitall
  [stdio] -Dcc=clang++
  [stdio] -Dcc=clang++ DEBUGGING
  [stdio] -Dcc=clang++ -Duselongdouble
  [stdio] -Dcc=clang++ -Duselongdouble DEBUGGING
~~ ../t/op/auto.t .............................................. FAILED Non-zero exit status: 2 No plan found in TAP output
  [stdio] -Dcc=clang++ -Duse64bitall DEBUGGING
  [stdio] -Dcc=clang++ -Duse64bitall
  [stdio] -Dcc=clang++
  [stdio] -Dcc=clang++ DEBUGGING
  [stdio] -Dcc=clang++ -Duselongdouble
  [stdio] -Dcc=clang++ -Duselongdouble DEBUGGING
~~ ../t/re/pat_re_eval.t ....................................... FAILED Non-zero exit status: 2 No plan found in TAP output
  [stdio] -Dcc=clang++ -Duse64bitall DEBUGGING
  [stdio] -Dcc=clang++ -Duse64bitall
  [stdio] -Dcc=clang++
  [stdio] -Dcc=clang++ DEBUGGING
  [stdio] -Dcc=clang++ -Duselongdouble
  [stdio] -Dcc=clang++ -Duselongdouble DEBUGGING
~~ ../t/re/reg_nocapture.t ..................................... FAILED Non-zero exit status: 2 No plan found in TAP output
  [stdio] -Dcc=clang++ -Duse64bitall DEBUGGING
  [stdio] -Dcc=clang++ -Duse64bitall
  [stdio] -Dcc=clang++
  [stdio] -Dcc=clang++ DEBUGGING
  [stdio] -Dcc=clang++ -Duselongdouble
  [stdio] -Dcc=clang++ -Duselongdouble DEBUGGING
~~ ../ext/File-Glob/t/global.t ................................. FAILED Non-zero exit status: 2 No plan found in TAP output
  [stdio] -Dcc=clang++ -Duse64bitall DEBUGGING
  [stdio] -Dcc=clang++ -Duse64bitall
  [stdio] -Dcc=clang++
  [stdio] -Dcc=clang++ DEBUGGING
  [stdio] -Dcc=clang++ -Duselongdouble
  [stdio] -Dcc=clang++ -Duselongdouble DEBUGGING
~~ ../cpan/Text-Balanced/t/07_exttag.t ......................... FAILED Non-zero exit status: 255 Bad plan.  You planned 53 tests but ran 0.
  [stdio] -Dcc=clang++ -Duse64bitall DEBUGGING
  [stdio] -Dcc=clang++ -Duse64bitall
  [stdio] -Dcc=clang++
  [stdio] -Dcc=clang++ DEBUGGING
  [stdio] -Dcc=clang++ -Duselongdouble
  [stdio] -Dcc=clang++ -Duselongdouble DEBUGGING
~~ ../t/op/gv.t ................................................ FAILED Non-zero exit status: 2 No plan found in TAP output
  [stdio] -Dcc=clang++ -Duse64bitall DEBUGGING
  [stdio] -Dcc=clang++ -Duse64bitall
  [stdio] -Dcc=clang++
  [stdio] -Dcc=clang++ DEBUGGING
  [stdio] -Dcc=clang++ -Duselongdouble
  [stdio] -Dcc=clang++ -Duselongdouble DEBUGGING
~~ ../cpan/ExtUtils-MakeMaker/t/split_command.t ................ FAILED Non-zero exit status: 255 Bad plan.  You planned 7 tests but ran 0.
  [stdio] -Dcc=clang++ -Duse64bitall DEBUGGING
  [stdio] -Dcc=clang++ -Duse64bitall
  [stdio] -Dcc=clang++
  [stdio] -Dcc=clang++ DEBUGGING
  [stdio] -Dcc=clang++ -Duselongdouble
  [stdio] -Dcc=clang++ -Duselongdouble DEBUGGING
~~ ../lib/Tie/Array/splice.t ................................... FAILED Non-zero exit status: 2 No plan found in TAP output
  [stdio] -Dcc=clang++ -Duse64bitall DEBUGGING
  [stdio] -Dcc=clang++ -Duse64bitall
  [stdio] -Dcc=clang++
  [stdio] -Dcc=clang++ DEBUGGING
  [stdio] -Dcc=clang++ -Duselongdouble
  [stdio] -Dcc=clang++ -Duselongdouble DEBUGGING
~~ ../dist/IO/t/io_utf8argv.t .................................. FAILED Non-zero exit status: 2 No plan found in TAP output
  [stdio] -Dcc=clang++ -Duse64bitall DEBUGGING
  [stdio] -Dcc=clang++ -Duse64bitall
  [stdio] -Dcc=clang++
  [stdio] -Dcc=clang++ DEBUGGING
  [stdio] -Dcc=clang++ -Duselongdouble
  [stdio] -Dcc=clang++ -Duselongdouble DEBUGGING
~~ ../lib/perl7db.t ............................................ FAILED Non-zero exit status: 2 No plan found in TAP output
  [stdio] -Dcc=clang++ -Duse64bitall DEBUGGING
  [stdio] -Dcc=clang++ -Duse64bitall
  [stdio] -Dcc=clang++
  [stdio] -Dcc=clang++ DEBUGGING
  [stdio] -Dcc=clang++ -Duselongdouble
  [stdio] -Dcc=clang++ -Duselongdouble DEBUGGING
~~ ../t/mro/overload_c3.t ...................................... FAILED Non-zero exit status: 2 No plan found in TAP output
  [stdio] -Dcc=clang++ -Duse64bitall DEBUGGING
  [stdio] -Dcc=clang++ -Duse64bitall
  [stdio] -Dcc=clang++
  [stdio] -Dcc=clang++ DEBUGGING
  [stdio] -Dcc=clang++ -Duselongdouble
  [stdio] -Dcc=clang++ -Duselongdouble DEBUGGING
~~ ../dist/Safe/t/safeops.t .................................... FAILED Non-zero exit status: 2 No plan found in TAP output
  [stdio] -Dcc=clang++ -Duse64bitall DEBUGGING
  [stdio] -Dcc=clang++ -Duse64bitall
  [stdio] -Dcc=clang++
  [stdio] -Dcc=clang++ DEBUGGING
  [stdio] -Dcc=clang++ -Duselongdouble
  [stdio] -Dcc=clang++ -Duselongdouble DEBUGGING
~~ ../t/io/utf8.t .............................................. FAILED Non-zero exit status: 2 No plan found in TAP output
  [stdio] -Dcc=clang++ -Duse64bitall DEBUGGING
  [stdio] -Dcc=clang++ -Duse64bitall
  [stdio] -Dcc=clang++
  [stdio] -Dcc=clang++ DEBUGGING
  [stdio] -Dcc=clang++ -Duselongdouble
  [stdio] -Dcc=clang++ -Duselongdouble DEBUGGING
~~ ../t/perf/optree.t .......................................... FAILED Non-zero exit status: 2 No plan found in TAP output
  [stdio] -Dcc=clang++ -Duse64bitall DEBUGGING
  [stdio] -Dcc=clang++ -Duse64bitall
  [stdio] -Dcc=clang++
  [stdio] -Dcc=clang++ DEBUGGING
  [stdio] -Dcc=clang++ -Duselongdouble
  [stdio] -Dcc=clang++ -Duselongdouble DEBUGGING
~~ ../t/op/list.t .............................................. FAILED Non-zero exit status: 2 No plan found in TAP output
  [stdio] -Dcc=clang++ -Duse64bitall DEBUGGING
  [stdio] -Dcc=clang++ -Duse64bitall
  [stdio] -Dcc=clang++
  [stdio] -Dcc=clang++ DEBUGGING
  [stdio] -Dcc=clang++ -Duselongdouble
  [stdio] -Dcc=clang++ -Duselongdouble DEBUGGING
~~ ../cpan/version/t/02derived.t ............................... FAILED Non-zero exit status: 255
  [stdio] -Dcc=clang++ -Duse64bitall DEBUGGING
  [stdio] -Dcc=clang++ -Duse64bitall
  [stdio] -Dcc=clang++
  [stdio] -Dcc=clang++ DEBUGGING
  [stdio] -Dcc=clang++ -Duselongdouble
  [stdio] -Dcc=clang++ -Duselongdouble DEBUGGING
~~ ../t/op/avhv.t .............................................. FAILED Non-zero exit status: 2 No plan found in TAP output
  [stdio] -Dcc=clang++ -Duse64bitall DEBUGGING
  [stdio] -Dcc=clang++ -Duse64bitall
  [stdio] -Dcc=clang++
  [stdio] -Dcc=clang++ DEBUGGING
  [stdio] -Dcc=clang++ -Duselongdouble
  [stdio] -Dcc=clang++ -Duselongdouble DEBUGGING
~~ ../t/uni/gv.t ............................................... FAILED Non-zero exit status: 2 No plan found in TAP output
  [stdio] -Dcc=clang++ -Duse64bitall DEBUGGING
  [stdio] -Dcc=clang++ -Duse64bitall
  [stdio] -Dcc=clang++
  [stdio] -Dcc=clang++ DEBUGGING
  [stdio] -Dcc=clang++ -Duselongdouble
  [stdio] -Dcc=clang++ -Duselongdouble DEBUGGING
~~ ../t/porting/extrefs.t ...................................... FAILED Non-zero exit status: 2 No plan found in TAP output
  [stdio] -Dcc=clang++ -Duse64bitall DEBUGGING
  [stdio] -Dcc=clang++ -Duse64bitall
  [stdio] -Dcc=clang++
  [stdio] -Dcc=clang++ DEBUGGING
  [stdio] -Dcc=clang++ -Duselongdouble
  [stdio] -Dcc=clang++ -Duselongdouble DEBUGGING
~~ ../cpan/Test-Simple/t/Legacy/Builder/current_test.t ......... FAILED Non-zero exit status: 255 No plan found in TAP output
  [stdio] -Dcc=clang++ -Duse64bitall DEBUGGING
  [stdio] -Dcc=clang++ -Duse64bitall
  [stdio] -Dcc=clang++
  [stdio] -Dcc=clang++ DEBUGGING
  [stdio] -Dcc=clang++ -Duselongdouble
  [stdio] -Dcc=clang++ -Duselongdouble DEBUGGING
~~ ../t/op/anonconst.t ......................................... FAILED Non-zero exit status: 2 No plan found in TAP output
  [stdio] -Dcc=clang++ -Duse64bitall DEBUGGING
  [stdio] -Dcc=clang++ -Duse64bitall
  [stdio] -Dcc=clang++
  [stdio] -Dcc=clang++ DEBUGGING
  [stdio] -Dcc=clang++ -Duselongdouble
  [stdio] -Dcc=clang++ -Duselongdouble DEBUGGING
~~ ../t/re/recompile.t ......................................... FAILED Non-zero exit status: 2 No plan found in TAP output
  [stdio] -Dcc=clang++ -Duse64bitall DEBUGGING
  [stdio] -Dcc=clang++ -Duse64bitall
  [stdio] -Dcc=clang++
  [stdio] -Dcc=clang++ DEBUGGING
  [stdio] -Dcc=clang++ -Duselongdouble
  [stdio] -Dcc=clang++ -Duselongdouble DEBUGGING
~~ ../t/op/select.t ............................................ FAILED Non-zero exit status: 2 No plan found in TAP output
  [stdio] -Dcc=clang++ -Duse64bitall DEBUGGING
  [stdio] -Dcc=clang++ -Duse64bitall
  [stdio] -Dcc=clang++
  [stdio] -Dcc=clang++ DEBUGGING
  [stdio] -Dcc=clang++ -Duselongdouble
  [stdio] -Dcc=clang++ -Duselongdouble DEBUGGING
~~ ../cpan/Test-Simple/t/Legacy/Regression/736_use_ok.t ........ FAILED Non-zero exit status: 255 No plan found in TAP output
  [stdio] -Dcc=clang++ -Duse64bitall DEBUGGING
  [stdio] -Dcc=clang++ -Duse64bitall
  [stdio] -Dcc=clang++
  [stdio] -Dcc=clang++ DEBUGGING
  [stdio] -Dcc=clang++ -Duselongdouble
  [stdio] -Dcc=clang++ -Duselongdouble DEBUGGING
~~ ../t/op/splice.t ............................................ FAILED Non-zero exit status: 2 No plan found in TAP output
  [stdio] -Dcc=clang++ -Duse64bitall DEBUGGING
  [stdio] -Dcc=clang++ -Duse64bitall
  [stdio] -Dcc=clang++
  [stdio] -Dcc=clang++ DEBUGGING
  [stdio] -Dcc=clang++ -Duselongdouble
  [stdio] -Dcc=clang++ -Duselongdouble DEBUGGING
~~ ../t/op/fh.t ................................................ FAILED Non-zero exit status: 2 No plan found in TAP output
  [stdio] -Dcc=clang++ -Duse64bitall DEBUGGING
  [stdio] -Dcc=clang++ -Duse64bitall
  [stdio] -Dcc=clang++
  [stdio] -Dcc=clang++ DEBUGGING
  [stdio] -Dcc=clang++ -Duselongdouble
  [stdio] -Dcc=clang++ -Duselongdouble DEBUGGING
~~ ../t/op/closure.t ........................................... FAILED Non-zero exit status: 2 No plan found in TAP output
  [stdio] -Dcc=clang++ -Duse64bitall DEBUGGING
  [stdio] -Dcc=clang++ -Duse64bitall
  [stdio] -Dcc=clang++
  [stdio] -Dcc=clang++ DEBUGGING
  [stdio] -Dcc=clang++ -Duselongdouble
  [stdio] -Dcc=clang++ -Duselongdouble DEBUGGING
~~ ../t/comp/hints.t ........................................... FAILED Non-zero exit status: 2 Bad plan.  You planned 31 tests but ran 30.
  [stdio] -Dcc=clang++ -Duse64bitall DEBUGGING
  [stdio] -Dcc=clang++ -Duse64bitall
  [stdio] -Dcc=clang++
  [stdio] -Dcc=clang++ DEBUGGING
  [stdio] -Dcc=clang++ -Duselongdouble
  [stdio] -Dcc=clang++ -Duselongdouble DEBUGGING
~~ ../t/op/hashwarn.t .......................................... FAILED Non-zero exit status: 2 No plan found in TAP output
  [stdio] -Dcc=clang++ -Duse64bitall DEBUGGING
  [stdio] -Dcc=clang++ -Duse64bitall
  [stdio] -Dcc=clang++
  [stdio] -Dcc=clang++ DEBUGGING
  [stdio] -Dcc=clang++ -Duselongdouble
  [stdio] -Dcc=clang++ -Duselongdouble DEBUGGING
~~ ../t/re/pos.t ............................................... FAILED Non-zero exit status: 2 No plan found in TAP output
  [stdio] -Dcc=clang++ -Duse64bitall DEBUGGING
  [stdio] -Dcc=clang++ -Duse64bitall
  [stdio] -Dcc=clang++
  [stdio] -Dcc=clang++ DEBUGGING
  [stdio] -Dcc=clang++ -Duselongdouble
  [stdio] -Dcc=clang++ -Duselongdouble DEBUGGING
~~ ../t/opbasic/arith.t ........................................ FAILED Non-zero exit status: 2 No plan found in TAP output
  [stdio] -Dcc=clang++ -Duse64bitall DEBUGGING
  [stdio] -Dcc=clang++ -Duse64bitall
  [stdio] -Dcc=clang++
  [stdio] -Dcc=clang++ DEBUGGING
  [stdio] -Dcc=clang++ -Duselongdouble
  [stdio] -Dcc=clang++ -Duselongdouble DEBUGGING
~~ ../cpan/Test-Simple/t/Legacy/is_deeply_fail.t ............... FAILED Non-zero exit status: 255 No plan found in TAP output
  [stdio] -Dcc=clang++ -Duse64bitall DEBUGGING
  [stdio] -Dcc=clang++ -Duse64bitall
  [stdio] -Dcc=clang++
  [stdio] -Dcc=clang++ DEBUGGING
  [stdio] -Dcc=clang++ -Duselongdouble
  [stdio] -Dcc=clang++ -Duselongdouble DEBUGGING
~~ ../t/op/concat2.t ........................................... FAILED Non-zero exit status: 2 No plan found in TAP output
  [stdio] -Dcc=clang++ -Duse64bitall DEBUGGING
  [stdio] -Dcc=clang++ -Duse64bitall
  [stdio] -Dcc=clang++
  [stdio] -Dcc=clang++ DEBUGGING
  [stdio] -Dcc=clang++ -Duselongdouble
  [stdio] -Dcc=clang++ -Duselongdouble DEBUGGING
~~ ../t/perf/speed.t ........................................... FAILED Non-zero exit status: 2 No plan found in TAP output
  [stdio] -Dcc=clang++ -Duse64bitall DEBUGGING
  [stdio] -Dcc=clang++ -Duse64bitall
  [stdio] -Dcc=clang++
  [stdio] -Dcc=clang++ DEBUGGING
  [stdio] -Dcc=clang++ -Duselongdouble
  [stdio] -Dcc=clang++ -Duselongdouble DEBUGGING
~~ ../t/op/substr.t ............................................ FAILED Non-zero exit status: 2 No plan found in TAP output
  [stdio] -Dcc=clang++ -Duse64bitall DEBUGGING
  [stdio] -Dcc=clang++ -Duse64bitall
  [stdio] -Dcc=clang++
  [stdio] -Dcc=clang++ DEBUGGING
  [stdio] -Dcc=clang++ -Duselongdouble
  [stdio] -Dcc=clang++ -Duselongdouble DEBUGGING
~~ ../t/mro/package_aliases_utf8.t ............................. FAILED Non-zero exit status: 2 No plan found in TAP output
  [stdio] -Dcc=clang++ -Duse64bitall DEBUGGING
  [stdio] -Dcc=clang++ -Duse64bitall
  [stdio] -Dcc=clang++
  [stdio] -Dcc=clang++ DEBUGGING
  [stdio] -Dcc=clang++ -Duselongdouble
  [stdio] -Dcc=clang++ -Duselongdouble DEBUGGING
~~ ../ext/B/t/optree_constants.t ............................... FAILED Non-zero exit status: 2 No plan found in TAP output
  [stdio] -Dcc=clang++ -Duse64bitall DEBUGGING
  [stdio] -Dcc=clang++ -Duse64bitall
  [stdio] -Dcc=clang++
  [stdio] -Dcc=clang++ DEBUGGING
  [stdio] -Dcc=clang++ -Duselongdouble
  [stdio] -Dcc=clang++ -Duselongdouble DEBUGGING
~~ ../t/mro/next_edgecases_utf8.t .............................. FAILED Non-zero exit status: 2 No plan found in TAP output
  [stdio] -Dcc=clang++ -Duse64bitall DEBUGGING
  [stdio] -Dcc=clang++ -Duse64bitall
  [stdio] -Dcc=clang++
  [stdio] -Dcc=clang++ DEBUGGING
  [stdio] -Dcc=clang++ -Duselongdouble
  [stdio] -Dcc=clang++ -Duselongdouble DEBUGGING
~~ ../t/re/bigfuzzy_not_utf8.t ................................. FAILED Non-zero exit status: 2 No plan found in TAP output
  [stdio] -Dcc=clang++ -Duse64bitall DEBUGGING
  [stdio] -Dcc=clang++ -Duse64bitall
  [stdio] -Dcc=clang++
  [stdio] -Dcc=clang++ DEBUGGING
  [stdio] -Dcc=clang++ -Duselongdouble
  [stdio] -Dcc=clang++ -Duselongdouble DEBUGGING
~~ ../cpan/Test-Simple/t/Test2/modules/API/Context.t ........... FAILED Non-zero exit status: 255 No plan found in TAP output
  [stdio] -Dcc=clang++ -Duse64bitall DEBUGGING
  [stdio] -Dcc=clang++ -Duse64bitall
  [stdio] -Dcc=clang++
  [stdio] -Dcc=clang++ DEBUGGING
  [stdio] -Dcc=clang++ -Duselongdouble
  [stdio] -Dcc=clang++ -Duselongdouble DEBUGGING
~~ ../t/op/switch.t ............................................ FAILED Non-zero exit status: 2 No plan found in TAP output
  [stdio] -Dcc=clang++ -Duse64bitall DEBUGGING
  [stdio] -Dcc=clang++ -Duse64bitall
  [stdio] -Dcc=clang++
  [stdio] -Dcc=clang++ DEBUGGING
  [stdio] -Dcc=clang++ -Duselongdouble
  [stdio] -Dcc=clang++ -Duselongdouble DEBUGGING
~~ ../ext/B/t/optree_misc.t .................................... FAILED Non-zero exit status: 255 No plan found in TAP output
  [stdio] -Dcc=clang++ -Duse64bitall DEBUGGING
  [stdio] -Dcc=clang++ -Duse64bitall
  [stdio] -Dcc=clang++
  [stdio] -Dcc=clang++ DEBUGGING
  [stdio] -Dcc=clang++ -Duselongdouble
  [stdio] -Dcc=clang++ -Duselongdouble DEBUGGING
~~ ../t/re/pat_advanced_thr.t .................................. FAILED Non-zero exit status: 2 No plan found in TAP output
  [stdio] -Dcc=clang++ -Duse64bitall DEBUGGING
  [stdio] -Dcc=clang++ -Duse64bitall
  [stdio] -Dcc=clang++
  [stdio] -Dcc=clang++ DEBUGGING
  [stdio] -Dcc=clang++ -Duselongdouble
  [stdio] -Dcc=clang++ -Duselongdouble DEBUGGING
~~ ../t/mro/next_edgecases.t ................................... FAILED Non-zero exit status: 2 No plan found in TAP output
  [stdio] -Dcc=clang++ -Duse64bitall DEBUGGING
  [stdio] -Dcc=clang++ -Duse64bitall
  [stdio] -Dcc=clang++
  [stdio] -Dcc=clang++ DEBUGGING
  [stdio] -Dcc=clang++ -Duselongdouble
  [stdio] -Dcc=clang++ -Duselongdouble DEBUGGING
~~ ../t/op/eval.t .............................................. FAILED Non-zero exit status: 2 No plan found in TAP output
  [stdio] -Dcc=clang++ -Duse64bitall DEBUGGING
  [stdio] -Dcc=clang++ -Duse64bitall
  [stdio] -Dcc=clang++
  [stdio] -Dcc=clang++ DEBUGGING
  [stdio] -Dcc=clang++ -Duselongdouble
  [stdio] -Dcc=clang++ -Duselongdouble DEBUGGING
~~ ../ext/Fcntl/t/mode.t ....................................... FAILED Non-zero exit status: 255 No plan found in TAP output
  [stdio] -Dcc=clang++ -Duse64bitall DEBUGGING
  [stdio] -Dcc=clang++ -Duse64bitall
  [stdio] -Dcc=clang++
  [stdio] -Dcc=clang++ DEBUGGING
  [stdio] -Dcc=clang++ -Duselongdouble
  [stdio] -Dcc=clang++ -Duselongdouble DEBUGGING
~~ ../dist/IO/t/io_utf8.t ...................................... FAILED Non-zero exit status: 2 No plan found in TAP output
  [stdio] -Dcc=clang++ -Duse64bitall DEBUGGING
  [stdio] -Dcc=clang++ -Duse64bitall
  [stdio] -Dcc=clang++
  [stdio] -Dcc=clang++ DEBUGGING
  [stdio] -Dcc=clang++ -Duselongdouble
  [stdio] -Dcc=clang++ -Duselongdouble DEBUGGING
~~ ../t/re/fold_grind_T.t ...................................... FAILED Non-zero exit status: 2 No plan found in TAP output
  [stdio] -Dcc=clang++ -Duse64bitall DEBUGGING
  [stdio] -Dcc=clang++ -Duse64bitall
  [stdio] -Dcc=clang++
  [stdio] -Dcc=clang++ DEBUGGING
  [stdio] -Dcc=clang++ -Duselongdouble
  [stdio] -Dcc=clang++ -Duselongdouble DEBUGGING
~~ ../t/re/qrstack.t ........................................... FAILED Non-zero exit status: 2 No plan found in TAP output
  [stdio] -Dcc=clang++ -Duse64bitall DEBUGGING
  [stdio] -Dcc=clang++ -Duse64bitall
  [stdio] -Dcc=clang++
  [stdio] -Dcc=clang++ DEBUGGING
  [stdio] -Dcc=clang++ -Duselongdouble
  [stdio] -Dcc=clang++ -Duselongdouble DEBUGGING
~~ ../dist/IO/t/io_udp.t ....................................... FAILED Non-zero exit status: 2 No plan found in TAP output
  [stdio] -Dcc=clang++ -Duse64bitall DEBUGGING
  [stdio] -Dcc=clang++ -Duse64bitall
  [stdio] -Dcc=clang++
  [stdio] -Dcc=clang++ DEBUGGING
  [stdio] -Dcc=clang++ -Duselongdouble
  [stdio] -Dcc=clang++ -Duselongdouble DEBUGGING
~~ ../cpan/Pod-Checker/t/pod/poderrs.t ......................... FAILED Non-zero exit status: 255 No plan found in TAP output
  [stdio] -Dcc=clang++ -Duse64bitall DEBUGGING
  [stdio] -Dcc=clang++ -Duse64bitall
  [stdio] -Dcc=clang++
  [stdio] -Dcc=clang++ DEBUGGING
  [stdio] -Dcc=clang++ -Duselongdouble
  [stdio] -Dcc=clang++ -Duselongdouble DEBUGGING
~~ ../t/re/rt122747.t .......................................... FAILED Non-zero exit status: 2 No plan found in TAP output
  [stdio] -Dcc=clang++ -Duse64bitall DEBUGGING
  [stdio] -Dcc=clang++ -Duse64bitall
  [stdio] -Dcc=clang++
  [stdio] -Dcc=clang++ DEBUGGING
  [stdio] -Dcc=clang++ -Duselongdouble
  [stdio] -Dcc=clang++ -Duselongdouble DEBUGGING
~~ ../t/op/my_stash.t .......................................... FAILED Non-zero exit status: 2 No plan found in TAP output
  [stdio] -Dcc=clang++ -Duse64bitall DEBUGGING
  [stdio] -Dcc=clang++ -Duse64bitall
  [stdio] -Dcc=clang++
  [stdio] -Dcc=clang++ DEBUGGING
  [stdio] -Dcc=clang++ -Duselongdouble
  [stdio] -Dcc=clang++ -Duselongdouble DEBUGGING
~~ ../t/op/lock.t .............................................. FAILED Non-zero exit status: 2 No plan found in TAP output
  [stdio] -Dcc=clang++ -Duse64bitall DEBUGGING
  [stdio] -Dcc=clang++ -Duse64bitall
  [stdio] -Dcc=clang++
  [stdio] -Dcc=clang++ DEBUGGING
  [stdio] -Dcc=clang++ -Duselongdouble
  [stdio] -Dcc=clang++ -Duselongdouble DEBUGGING
~~ ../dist/ExtUtils-CBuilder/t/00-have-compiler.t .............. FAILED Non-zero exit status: 255 No plan found in TAP output
  [stdio] -Dcc=clang++ -Duse64bitall DEBUGGING
  [stdio] -Dcc=clang++ -Duse64bitall
  [stdio] -Dcc=clang++
  [stdio] -Dcc=clang++ DEBUGGING
  [stdio] -Dcc=clang++ -Duselongdouble
  [stdio] -Dcc=clang++ -Duselongdouble DEBUGGING
~~ ../t/re/reg_nc_tie.t ........................................ FAILED Non-zero exit status: 2 No plan found in TAP output
  [stdio] -Dcc=clang++ -Duse64bitall DEBUGGING
  [stdio] -Dcc=clang++ -Duse64bitall
  [stdio] -Dcc=clang++
  [stdio] -Dcc=clang++ DEBUGGING
  [stdio] -Dcc=clang++ -Duselongdouble
  [stdio] -Dcc=clang++ -Duselongdouble DEBUGGING
~~ ../t/perf/opcount.t ......................................... FAILED Non-zero exit status: 2 No plan found in TAP output
  [stdio] -Dcc=clang++ -Duse64bitall DEBUGGING
  [stdio] -Dcc=clang++ -Duse64bitall
  [stdio] -Dcc=clang++
  [stdio] -Dcc=clang++ DEBUGGING
  [stdio] -Dcc=clang++ -Duselongdouble
  [stdio] -Dcc=clang++ -Duselongdouble DEBUGGING
~~ ../cpan/version/t/01base.t .................................. FAILED Non-zero exit status: 255
  [stdio] -Dcc=clang++ -Duse64bitall DEBUGGING
  [stdio] -Dcc=clang++ -Duse64bitall
  [stdio] -Dcc=clang++
  [stdio] -Dcc=clang++ DEBUGGING
  [stdio] -Dcc=clang++ -Duselongdouble
  [stdio] -Dcc=clang++ -Duselongdouble DEBUGGING
~~ ../t/porting/FindExt.t ...................................... FAILED Non-zero exit status: 2 No plan found in TAP output
  [stdio] -Dcc=clang++ -Duse64bitall DEBUGGING
  [stdio] -Dcc=clang++ -Duse64bitall
  [stdio] -Dcc=clang++
  [stdio] -Dcc=clang++ DEBUGGING
  [stdio] -Dcc=clang++ -Duselongdouble
  [stdio] -Dcc=clang++ -Duselongdouble DEBUGGING
~~ ../t/op/pack.t .............................................. FAILED Non-zero exit status: 2 No plan found in TAP output
  [stdio] -Dcc=clang++ -Duse64bitall DEBUGGING
  [stdio] -Dcc=clang++ -Duse64bitall
  [stdio] -Dcc=clang++
  [stdio] -Dcc=clang++ DEBUGGING
  [stdio] -Dcc=clang++ -Duselongdouble
  [stdio] -Dcc=clang++ -Duselongdouble DEBUGGING
~~ ../t/op/range.t ............................................. FAILED Non-zero exit status: 2 No plan found in TAP output
  [stdio] -Dcc=clang++ -Duse64bitall DEBUGGING
  [stdio] -Dcc=clang++ -Duse64bitall
  [stdio] -Dcc=clang++
  [stdio] -Dcc=clang++ DEBUGGING
  [stdio] -Dcc=clang++ -Duselongdouble
  [stdio] -Dcc=clang++ -Duselongdouble DEBUGGING
~~ ../lib/perlbug.t ............................................ FAILED Non-zero exit status: 2 No plan found in TAP output
  [stdio] -Dcc=clang++ -Duse64bitall DEBUGGING
  [stdio] -Dcc=clang++ -Duse64bitall
  [stdio] -Dcc=clang++
  [stdio] -Dcc=clang++ DEBUGGING
  [stdio] -Dcc=clang++ -Duselongdouble
  [stdio] -Dcc=clang++ -Duselongdouble DEBUGGING
~~ ../t/op/append.t ............................................ FAILED Non-zero exit status: 2 No plan found in TAP output
  [stdio] -Dcc=clang++ -Duse64bitall DEBUGGING
  [stdio] -Dcc=clang++ -Duse64bitall
  [stdio] -Dcc=clang++
  [stdio] -Dcc=clang++ DEBUGGING
  [stdio] -Dcc=clang++ -Duselongdouble
  [stdio] -Dcc=clang++ -Duselongdouble DEBUGGING
~~ ../t/op/unlink.t ............................................ FAILED Non-zero exit status: 2 No plan found in TAP output
  [stdio] -Dcc=clang++ -Duse64bitall DEBUGGING
  [stdio] -Dcc=clang++ -Duse64bitall
  [stdio] -Dcc=clang++
  [stdio] -Dcc=clang++ DEBUGGING
  [stdio] -Dcc=clang++ -Duselongdouble
  [stdio] -Dcc=clang++ -Duselongdouble DEBUGGING
~~ ../cpan/Test-Simple/t/Legacy/exit.t ......................... FAILED 1-261
  [stdio] -Dcc=clang++ -Duse64bitall
~~ ../t/re/qr-72922.t .......................................... FAILED Non-zero exit status: 2 No plan found in TAP output
  [stdio] -Dcc=clang++ -Duse64bitall DEBUGGING
  [stdio] -Dcc=clang++ -Duse64bitall
  [stdio] -Dcc=clang++
  [stdio] -Dcc=clang++ DEBUGGING
  [stdio] -Dcc=clang++ -Duselongdouble
  [stdio] -Dcc=clang++ -Duselongdouble DEBUGGING
~~ ../t/re/subst_wamp.t ........................................ FAILED No plan found in TAP output
  [stdio] -Dcc=clang++ -Duse64bitall DEBUGGING
  [stdio] -Dcc=clang++ -Duse64bitall
  [stdio] -Dcc=clang++
  [stdio] -Dcc=clang++ DEBUGGING
  [stdio] -Dcc=clang++ -Duselongdouble
  [stdio] -Dcc=clang++ -Duselongdouble DEBUGGING
~~ ../t/op/universal.t ......................................... FAILED Non-zero exit status: 2 No plan found in TAP output
  [stdio] -Dcc=clang++ -Duse64bitall DEBUGGING
  [stdio] -Dcc=clang++ -Duse64bitall
  [stdio] -Dcc=clang++
  [stdio] -Dcc=clang++ DEBUGGING
  [stdio] -Dcc=clang++ -Duselongdouble
  [stdio] -Dcc=clang++ -Duselongdouble DEBUGGING
~~ ../t/comp/parser_run.t ...................................... FAILED Non-zero exit status: 2 No plan found in TAP output
  [stdio] -Dcc=clang++ -Duse64bitall DEBUGGING
  [stdio] -Dcc=clang++ -Duse64bitall
  [stdio] -Dcc=clang++
  [stdio] -Dcc=clang++ DEBUGGING
  [stdio] -Dcc=clang++ -Duselongdouble
  [stdio] -Dcc=clang++ -Duselongdouble DEBUGGING
~~ ../t/op/groups.t ............................................ FAILED Non-zero exit status: 2 No plan found in TAP output
  [stdio] -Dcc=clang++ -Duse64bitall DEBUGGING
  [stdio] -Dcc=clang++ -Duse64bitall
  [stdio] -Dcc=clang++
  [stdio] -Dcc=clang++ DEBUGGING
  [stdio] -Dcc=clang++ -Duselongdouble
  [stdio] -Dcc=clang++ -Duselongdouble DEBUGGING
~~ ../dist/Storable/t/downgrade.t .............................. FAILED 13 66-67 114-115 Non-zero exit status: 35
  [stdio] -Dcc=clang++ -Duselongdouble DEBUGGING
~~ ../cpan/Compress-Raw-Zlib/t/19nonpv.t ....................... FAILED Non-zero exit status: 255 No plan found in TAP output
  [stdio] -Dcc=clang++ -Duse64bitall DEBUGGING
  [stdio] -Dcc=clang++ -Duse64bitall
  [stdio] -Dcc=clang++
  [stdio] -Dcc=clang++ DEBUGGING
  [stdio] -Dcc=clang++ -Duselongdouble
  [stdio] -Dcc=clang++ -Duselongdouble DEBUGGING
~~ ../t/run/exit.t ............................................. FAILED Non-zero exit status: 2 No plan found in TAP output
  [stdio] -Dcc=clang++ -Duse64bitall DEBUGGING
  [stdio] -Dcc=clang++ -Duse64bitall
  [stdio] -Dcc=clang++
  [stdio] -Dcc=clang++ DEBUGGING
  [stdio] -Dcc=clang++ -Duselongdouble
  [stdio] -Dcc=clang++ -Duselongdouble DEBUGGING
~~ ../t/io/openpid.t ........................................... FAILED Non-zero exit status: 2 No plan found in TAP output
  [stdio] -Dcc=clang++ -Duse64bitall DEBUGGING
  [stdio] -Dcc=clang++ -Duse64bitall
  [stdio] -Dcc=clang++
  [stdio] -Dcc=clang++ DEBUGGING
  [stdio] -Dcc=clang++ -Duselongdouble
  [stdio] -Dcc=clang++ -Duselongdouble DEBUGGING
~~ ../cpan/ExtUtils-MakeMaker/t/MM_VMS.t ....................... FAILED Non-zero exit status: 255 No plan found in TAP output
  [stdio] -Dcc=clang++ -Duse64bitall DEBUGGING
  [stdio] -Dcc=clang++ -Duse64bitall
  [stdio] -Dcc=clang++
  [stdio] -Dcc=clang++ DEBUGGING
  [stdio] -Dcc=clang++ -Duselongdouble
  [stdio] -Dcc=clang++ -Duselongdouble DEBUGGING
~~ ../t/re/begin-once.t ........................................ FAILED Non-zero exit status: 2 No plan found in TAP output
  [stdio] -Dcc=clang++ -Duse64bitall DEBUGGING
  [stdio] -Dcc=clang++ -Duse64bitall
  [stdio] -Dcc=clang++
  [stdio] -Dcc=clang++ DEBUGGING
  [stdio] -Dcc=clang++ -Duselongdouble
  [stdio] -Dcc=clang++ -Duselongdouble DEBUGGING
~~ ../t/op/split.t ............................................. FAILED Non-zero exit status: 2 No plan found in TAP output
  [stdio] -Dcc=clang++ -Duse64bitall DEBUGGING
  [stdio] -Dcc=clang++ -Duse64bitall
  [stdio] -Dcc=clang++
  [stdio] -Dcc=clang++ DEBUGGING
  [stdio] -Dcc=clang++ -Duselongdouble
  [stdio] -Dcc=clang++ -Duselongdouble DEBUGGING
~~ ../lib/cygwin.t ............................................. FAILED Non-zero exit status: 2 No plan found in TAP output
  [stdio] -Dcc=clang++ -Duse64bitall DEBUGGING
  [stdio] -Dcc=clang++ -Duse64bitall
  [stdio] -Dcc=clang++
  [stdio] -Dcc=clang++ DEBUGGING
  [stdio] -Dcc=clang++ -Duselongdouble
  [stdio] -Dcc=clang++ -Duselongdouble DEBUGGING
~~ ../ext/Fcntl/t/syslfs.t ..................................... FAILED Non-zero exit status: 255 No plan found in TAP output
  [stdio] -Dcc=clang++ -Duse64bitall DEBUGGING
  [stdio] -Dcc=clang++ -Duse64bitall
  [stdio] -Dcc=clang++
  [stdio] -Dcc=clang++ DEBUGGING
  [stdio] -Dcc=clang++ -Duselongdouble
  [stdio] -Dcc=clang++ -Duselongdouble DEBUGGING
~~ ../cpan/Test-Simple/t/Legacy/exit.t ......................... FAILED 1-262
  [stdio] -Dcc=clang++ -Duse64bitall DEBUGGING
~~ ../t/op/goto_xs.t ........................................... FAILED Non-zero exit status: 2 No plan found in TAP output
  [stdio] -Dcc=clang++ -Duse64bitall DEBUGGING
  [stdio] -Dcc=clang++ -Duse64bitall
  [stdio] -Dcc=clang++
  [stdio] -Dcc=clang++ DEBUGGING
  [stdio] -Dcc=clang++ -Duselongdouble
  [stdio] -Dcc=clang++ -Duselongdouble DEBUGGING
~~ ../ext/FileCache/t/01open.t ................................. FAILED Non-zero exit status: 25 Bad plan.  You planned 1 tests but ran 0.
  [stdio] -Dcc=clang++ -Duse64bitall DEBUGGING
  [stdio] -Dcc=clang++ -Duse64bitall
  [stdio] -Dcc=clang++
  [stdio] -Dcc=clang++ DEBUGGING
  [stdio] -Dcc=clang++ -Duselongdouble
  [stdio] -Dcc=clang++ -Duselongdouble DEBUGGING
~~ ../t/uni/upper.t ............................................ FAILED Non-zero exit status: 2 No plan found in TAP output
  [stdio] -Dcc=clang++ -Duse64bitall DEBUGGING
  [stdio] -Dcc=clang++ -Duse64bitall
  [stdio] -Dcc=clang++
  [stdio] -Dcc=clang++ DEBUGGING
  [stdio] -Dcc=clang++ -Duselongdouble
  [stdio] -Dcc=clang++ -Duselongdouble DEBUGGING
~~ ../t/op/undef.t ............................................. FAILED Non-zero exit status: 2 No plan found in TAP output
  [stdio] -Dcc=clang++ -Duse64bitall DEBUGGING
  [stdio] -Dcc=clang++ -Duse64bitall
  [stdio] -Dcc=clang++
  [stdio] -Dcc=clang++ DEBUGGING
  [stdio] -Dcc=clang++ -Duselongdouble
  [stdio] -Dcc=clang++ -Duselongdouble DEBUGGING
~~ ../t/op/tie.t ............................................... FAILED Non-zero exit status: 2 No plan found in TAP output
  [stdio] -Dcc=clang++ -Duse64bitall DEBUGGING
  [stdio] -Dcc=clang++ -Duse64bitall
  [stdio] -Dcc=clang++
  [stdio] -Dcc=clang++ DEBUGGING
  [stdio] -Dcc=clang++ -Duselongdouble
  [stdio] -Dcc=clang++ -Duselongdouble DEBUGGING
~~ ../cpan/Digest-MD5/t/files.t ................................ FAILED 2
  [stdio] -Dcc=clang++ -Duse64bitall DEBUGGING
  [stdio] -Dcc=clang++ -Duse64bitall
  [stdio] -Dcc=clang++
  [stdio] -Dcc=clang++ DEBUGGING
  [stdio] -Dcc=clang++ -Duselongdouble
  [stdio] -Dcc=clang++ -Duselongdouble DEBUGGING
~~ ../dist/threads-shared/t/waithires.t ........................ FAILED Non-zero exit status: 2 No plan found in TAP output
  [stdio] -Dcc=clang++ -Duse64bitall DEBUGGING
  [stdio] -Dcc=clang++ -Duse64bitall
  [stdio] -Dcc=clang++
  [stdio] -Dcc=clang++ DEBUGGING
  [stdio] -Dcc=clang++ -Duselongdouble
  [stdio] -Dcc=clang++ -Duselongdouble DEBUGGING
~~ ../t/run/script.t ........................................... FAILED Non-zero exit status: 2 No plan found in TAP output
  [stdio] -Dcc=clang++ -Duse64bitall DEBUGGING
  [stdio] -Dcc=clang++ -Duse64bitall
  [stdio] -Dcc=clang++
  [stdio] -Dcc=clang++ DEBUGGING
  [stdio] -Dcc=clang++ -Duselongdouble
  [stdio] -Dcc=clang++ -Duselongdouble DEBUGGING
~~ ../t/io/socket.t ............................................ FAILED Non-zero exit status: 2 No plan found in TAP output
  [stdio] -Dcc=clang++ -Duse64bitall DEBUGGING
  [stdio] -Dcc=clang++ -Duse64bitall
  [stdio] -Dcc=clang++
  [stdio] -Dcc=clang++ DEBUGGING
  [stdio] -Dcc=clang++ -Duselongdouble
  [stdio] -Dcc=clang++ -Duselongdouble DEBUGGING
~~ ../lib/open.t ............................................... FAILED Non-zero exit status: 2 No plan found in TAP output
  [stdio] -Dcc=clang++ -Duse64bitall DEBUGGING
  [stdio] -Dcc=clang++ -Duse64bitall
  [stdio] -Dcc=clang++
  [stdio] -Dcc=clang++ DEBUGGING
  [stdio] -Dcc=clang++ -Duselongdouble
  [stdio] -Dcc=clang++ -Duselongdouble DEBUGGING
~~ ../ext/File-Glob/t/taint.t .................................. FAILED Non-zero exit status: 2 No plan found in TAP output
  [stdio] -Dcc=clang++ -Duse64bitall DEBUGGING
  [stdio] -Dcc=clang++ -Duse64bitall
  [stdio] -Dcc=clang++
  [stdio] -Dcc=clang++ DEBUGGING
  [stdio] -Dcc=clang++ -Duselongdouble
  [stdio] -Dcc=clang++ -Duselongdouble DEBUGGING
~~ ../t/re/pat_special_cc_thr.t ................................ FAILED Non-zero exit status: 2 No plan found in TAP output
  [stdio] -Dcc=clang++ -Duse64bitall DEBUGGING
  [stdio] -Dcc=clang++ -Duse64bitall
  [stdio] -Dcc=clang++
  [stdio] -Dcc=clang++ DEBUGGING
  [stdio] -Dcc=clang++ -Duselongdouble
  [stdio] -Dcc=clang++ -Duselongdouble DEBUGGING
~~ ../t/re/reg_email.t ......................................... FAILED Non-zero exit status: 2 No plan found in TAP output
  [stdio] -Dcc=clang++ -Duse64bitall DEBUGGING
  [stdio] -Dcc=clang++ -Duse64bitall
  [stdio] -Dcc=clang++
  [stdio] -Dcc=clang++ DEBUGGING
  [stdio] -Dcc=clang++ -Duselongdouble
  [stdio] -Dcc=clang++ -Duselongdouble DEBUGGING
~~ ../t/op/require_errors.t .................................... FAILED Non-zero exit status: 2 No plan found in TAP output
  [stdio] -Dcc=clang++ -Duse64bitall DEBUGGING
  [stdio] -Dcc=clang++ -Duse64bitall
  [stdio] -Dcc=clang++
  [stdio] -Dcc=clang++ DEBUGGING
  [stdio] -Dcc=clang++ -Duselongdouble
  [stdio] -Dcc=clang++ -Duselongdouble DEBUGGING
~~ ../t/op/push.t .............................................. FAILED Non-zero exit status: 2 No plan found in TAP output
  [stdio] -Dcc=clang++ -Duse64bitall DEBUGGING
  [stdio] -Dcc=clang++ -Duse64bitall
  [stdio] -Dcc=clang++
  [stdio] -Dcc=clang++ DEBUGGING
  [stdio] -Dcc=clang++ -Duselongdouble
  [stdio] -Dcc=clang++ -Duselongdouble DEBUGGING
~~ ../lib/universal.t .......................................... FAILED Non-zero exit status: 2 No plan found in TAP output
  [stdio] -Dcc=clang++ -Duse64bitall DEBUGGING
  [stdio] -Dcc=clang++ -Duse64bitall
  [stdio] -Dcc=clang++
  [stdio] -Dcc=clang++ DEBUGGING
  [stdio] -Dcc=clang++ -Duselongdouble
  [stdio] -Dcc=clang++ -Duselongdouble DEBUGGING
~~ ../t/op/sprintf2.t .......................................... FAILED Non-zero exit status: 2 No plan found in TAP output
  [stdio] -Dcc=clang++ -Duse64bitall DEBUGGING
  [stdio] -Dcc=clang++ -Duse64bitall
  [stdio] -Dcc=clang++
  [stdio] -Dcc=clang++ DEBUGGING
  [stdio] -Dcc=clang++ -Duselongdouble
  [stdio] -Dcc=clang++ -Duselongdouble DEBUGGING
~~ ../t/op/utf8magic.t ......................................... FAILED Non-zero exit status: 2 No plan found in TAP output
  [stdio] -Dcc=clang++ -Duse64bitall DEBUGGING
  [stdio] -Dcc=clang++ -Duse64bitall
  [stdio] -Dcc=clang++
  [stdio] -Dcc=clang++ DEBUGGING
  [stdio] -Dcc=clang++ -Duselongdouble
  [stdio] -Dcc=clang++ -Duselongdouble DEBUGGING
~~ ../cpan/Compress-Raw-Bzip2/t/01bzip2.t ...................... FAILED Non-zero exit status: 2 Bad plan.  You planned 173 tests but ran 1.
  [stdio] -Dcc=clang++ -Duse64bitall DEBUGGING
  [stdio] -Dcc=clang++ -Duse64bitall
  [stdio] -Dcc=clang++
  [stdio] -Dcc=clang++ DEBUGGING
  [stdio] -Dcc=clang++ -Duselongdouble
  [stdio] -Dcc=clang++ -Duselongdouble DEBUGGING
~~ ../dist/Devel-PPPort/t/warn.t ............................... FAILED 4
  [stdio] -Dcc=clang++ -Duse64bitall DEBUGGING
  [stdio] -Dcc=clang++ -Duse64bitall
  [stdio] -Dcc=clang++
  [stdio] -Dcc=clang++ DEBUGGING
  [stdio] -Dcc=clang++ -Duselongdouble
  [stdio] -Dcc=clang++ -Duselongdouble DEBUGGING
~~ ../t/op/state.t ............................................. FAILED Non-zero exit status: 2 No plan found in TAP output
  [stdio] -Dcc=clang++ -Duse64bitall DEBUGGING
  [stdio] -Dcc=clang++ -Duse64bitall
  [stdio] -Dcc=clang++
  [stdio] -Dcc=clang++ DEBUGGING
  [stdio] -Dcc=clang++ -Duselongdouble
  [stdio] -Dcc=clang++ -Duselongdouble DEBUGGING
~~ ../t/op/coresubs.t .......................................... FAILED Non-zero exit status: 2 No plan found in TAP output
  [stdio] -Dcc=clang++ -Duse64bitall DEBUGGING
  [stdio] -Dcc=clang++ -Duse64bitall
  [stdio] -Dcc=clang++
  [stdio] -Dcc=clang++ DEBUGGING
  [stdio] -Dcc=clang++ -Duselongdouble
  [stdio] -Dcc=clang++ -Duselongdouble DEBUGGING
~~ ../dist/Exporter/t/Exporter.t ............................... FAILED Non-zero exit status: 255 No plan found in TAP output
  [stdio] -Dcc=clang++ -Duse64bitall DEBUGGING
  [stdio] -Dcc=clang++ -Duse64bitall
  [stdio] -Dcc=clang++
  [stdio] -Dcc=clang++ DEBUGGING
  [stdio] -Dcc=clang++ -Duselongdouble
  [stdio] -Dcc=clang++ -Duselongdouble DEBUGGING
~~ ../dist/Storable/t/weak.t ................................... FAILED Non-zero exit status: 25
  [stdio] -Dcc=clang++ -Duse64bitall
  [stdio] -Dcc=clang++
  [stdio] -Dcc=clang++ -Duselongdouble
~~ ../t/mro/inconsistent_c3_utf8.t ............................. FAILED Non-zero exit status: 2 No plan found in TAP output
  [stdio] -Dcc=clang++ -Duse64bitall DEBUGGING
  [stdio] -Dcc=clang++ -Duse64bitall
  [stdio] -Dcc=clang++
  [stdio] -Dcc=clang++ DEBUGGING
  [stdio] -Dcc=clang++ -Duselongdouble
  [stdio] -Dcc=clang++ -Duselongdouble DEBUGGING
~~ ../ext/B/t/optree_check.t ................................... FAILED Non-zero exit status: 255 No plan found in TAP output
  [stdio] -Dcc=clang++ -Duse64bitall DEBUGGING
  [stdio] -Dcc=clang++ -Duse64bitall
  [stdio] -Dcc=clang++
  [stdio] -Dcc=clang++ DEBUGGING
  [stdio] -Dcc=clang++ -Duselongdouble
  [stdio] -Dcc=clang++ -Duselongdouble DEBUGGING
~~ ../lib/overload.t ........................................... FAILED Non-zero exit status: 255 Bad plan.  You planned 5363 tests but ran 137.
  [stdio] -Dcc=clang++ -Duse64bitall DEBUGGING
  [stdio] -Dcc=clang++ -Duse64bitall
  [stdio] -Dcc=clang++
  [stdio] -Dcc=clang++ DEBUGGING
  [stdio] -Dcc=clang++ -Duselongdouble
  [stdio] -Dcc=clang++ -Duselongdouble DEBUGGING
~~ ../t/op/utftaint.t .......................................... FAILED Non-zero exit status: 2 No plan found in TAP output
  [stdio] -Dcc=clang++ -Duse64bitall DEBUGGING
  [stdio] -Dcc=clang++ -Duse64bitall
  [stdio] -Dcc=clang++
  [stdio] -Dcc=clang++ DEBUGGING
  [stdio] -Dcc=clang++ -Duselongdouble
  [stdio] -Dcc=clang++ -Duselongdouble DEBUGGING
~~ ../t/uni/goto.t ............................................. FAILED Non-zero exit status: 2 No plan found in TAP output
  [stdio] -Dcc=clang++ -Duse64bitall DEBUGGING
  [stdio] -Dcc=clang++ -Duse64bitall
  [stdio] -Dcc=clang++
  [stdio] -Dcc=clang++ DEBUGGING
  [stdio] -Dcc=clang++ -Duselongdouble
  [stdio] -Dcc=clang++ -Duselongdouble DEBUGGING
~~ ../t/op/lop.t ............................................... FAILED Non-zero exit status: 2 No plan found in TAP output
  [stdio] -Dcc=clang++ -Duse64bitall DEBUGGING
  [stdio] -Dcc=clang++ -Duse64bitall
  [stdio] -Dcc=clang++
  [stdio] -Dcc=clang++ DEBUGGING
  [stdio] -Dcc=clang++ -Duselongdouble
  [stdio] -Dcc=clang++ -Duselongdouble DEBUGGING
~~ ../lib/locale_threads.t ..................................... FAILED Non-zero exit status: 2 No plan found in TAP output
  [stdio] -Dcc=clang++ -Duse64bitall DEBUGGING
  [stdio] -Dcc=clang++ -Duse64bitall
  [stdio] -Dcc=clang++
  [stdio] -Dcc=clang++ DEBUGGING
  [stdio] -Dcc=clang++ -Duselongdouble
  [stdio] -Dcc=clang++ -Duselongdouble DEBUGGING
~~ ../t/op/kvhslice.t .......................................... FAILED Non-zero exit status: 2 No plan found in TAP output
  [stdio] -Dcc=clang++ -Duse64bitall DEBUGGING
  [stdio] -Dcc=clang++ -Duse64bitall
  [stdio] -Dcc=clang++
  [stdio] -Dcc=clang++ DEBUGGING
  [stdio] -Dcc=clang++ -Duselongdouble
  [stdio] -Dcc=clang++ -Duselongdouble DEBUGGING
~~ ../t/io/semctl.t ............................................ FAILED Non-zero exit status: 2 No plan found in TAP output
  [stdio] -Dcc=clang++ -Duse64bitall DEBUGGING
  [stdio] -Dcc=clang++ -Duse64bitall
  [stdio] -Dcc=clang++
  [stdio] -Dcc=clang++ DEBUGGING
  [stdio] -Dcc=clang++ -Duselongdouble
  [stdio] -Dcc=clang++ -Duselongdouble DEBUGGING
~~ ../t/re/regexp_unicode_prop_thr.t ........................... FAILED Non-zero exit status: 2 No plan found in TAP output
  [stdio] -Dcc=clang++ -Duse64bitall DEBUGGING
  [stdio] -Dcc=clang++ -Duse64bitall
  [stdio] -Dcc=clang++
  [stdio] -Dcc=clang++ DEBUGGING
  [stdio] -Dcc=clang++ -Duselongdouble
  [stdio] -Dcc=clang++ -Duselongdouble DEBUGGING
~~ ../dist/Storable/t/restrict.t ............................... FAILED 1 79 115 131 147 163 179 195 211 227 243 259 275 291 Non-zero exit status: 176
  [stdio] -Dcc=clang++ -Duse64bitall DEBUGGING
  [stdio] -Dcc=clang++ -Duse64bitall
  [stdio] -Dcc=clang++
  [stdio] -Dcc=clang++ DEBUGGING
  [stdio] -Dcc=clang++ -Duselongdouble
  [stdio] -Dcc=clang++ -Duselongdouble DEBUGGING
~~ ../t/run/noswitch.t ......................................... FAILED Non-zero exit status: 2 No plan found in TAP output
  [stdio] -Dcc=clang++ -Duse64bitall DEBUGGING
  [stdio] -Dcc=clang++ -Duse64bitall
  [stdio] -Dcc=clang++
  [stdio] -Dcc=clang++ DEBUGGING
  [stdio] -Dcc=clang++ -Duselongdouble
  [stdio] -Dcc=clang++ -Duselongdouble DEBUGGING
~~ ../t/op/aassign.t ........................................... FAILED Non-zero exit status: 2 No plan found in TAP output
  [stdio] -Dcc=clang++ -Duse64bitall DEBUGGING
  [stdio] -Dcc=clang++ -Duse64bitall
  [stdio] -Dcc=clang++
  [stdio] -Dcc=clang++ DEBUGGING
  [stdio] -Dcc=clang++ -Duselongdouble
  [stdio] -Dcc=clang++ -Duselongdouble DEBUGGING
~~ ../lib/commonsense.t ........................................ FAILED Non-zero exit status: 2 No plan found in TAP output
  [stdio] -Dcc=clang++ -Duse64bitall DEBUGGING
  [stdio] -Dcc=clang++ -Duse64bitall
  [stdio] -Dcc=clang++
  [stdio] -Dcc=clang++ DEBUGGING
  [stdio] -Dcc=clang++ -Duselongdouble
  [stdio] -Dcc=clang++ -Duselongdouble DEBUGGING
~~ ../lib/Tie/Array/push.t ..................................... FAILED Non-zero exit status: 2 No plan found in TAP output
  [stdio] -Dcc=clang++ -Duse64bitall DEBUGGING
  [stdio] -Dcc=clang++ -Duse64bitall
  [stdio] -Dcc=clang++
  [stdio] -Dcc=clang++ DEBUGGING
  [stdio] -Dcc=clang++ -Duselongdouble
  [stdio] -Dcc=clang++ -Duselongdouble DEBUGGING
~~ ../t/run/switchI.t .......................................... FAILED Non-zero exit status: 2 No plan found in TAP output
  [stdio] -Dcc=clang++ -Duse64bitall DEBUGGING
  [stdio] -Dcc=clang++ -Duse64bitall
  [stdio] -Dcc=clang++
  [stdio] -Dcc=clang++ DEBUGGING
  [stdio] -Dcc=clang++ -Duselongdouble
  [stdio] -Dcc=clang++ -Duselongdouble DEBUGGING
~~ ../t/op/heredoc.t ........................................... FAILED Non-zero exit status: 2 No plan found in TAP output
  [stdio] -Dcc=clang++ -Duse64bitall DEBUGGING
  [stdio] -Dcc=clang++ -Duse64bitall
  [stdio] -Dcc=clang++
  [stdio] -Dcc=clang++ DEBUGGING
  [stdio] -Dcc=clang++ -Duselongdouble
  [stdio] -Dcc=clang++ -Duselongdouble DEBUGGING
~~ ../t/re/pat_re_eval_thr.t ................................... FAILED Non-zero exit status: 2 No plan found in TAP output
  [stdio] -Dcc=clang++ -Duse64bitall DEBUGGING
  [stdio] -Dcc=clang++ -Duse64bitall
  [stdio] -Dcc=clang++
  [stdio] -Dcc=clang++ DEBUGGING
  [stdio] -Dcc=clang++ -Duselongdouble
  [stdio] -Dcc=clang++ -Duselongdouble DEBUGGING
~~ ../t/uni/bless.t ............................................ FAILED Non-zero exit status: 2 No plan found in TAP output
  [stdio] -Dcc=clang++ -Duse64bitall DEBUGGING
  [stdio] -Dcc=clang++ -Duse64bitall
  [stdio] -Dcc=clang++
  [stdio] -Dcc=clang++ DEBUGGING
  [stdio] -Dcc=clang++ -Duselongdouble
  [stdio] -Dcc=clang++ -Duselongdouble DEBUGGING
~~ ../ext/B/t/optree_varinit.t ................................. FAILED 3 30
  [stdio] -Dcc=clang++ -Duse64bitall DEBUGGING
  [stdio] -Dcc=clang++ -Duse64bitall
  [stdio] -Dcc=clang++
  [stdio] -Dcc=clang++ DEBUGGING
  [stdio] -Dcc=clang++ -Duselongdouble
  [stdio] -Dcc=clang++ -Duselongdouble DEBUGGING
~~ ../dist/Storable/t/regexp.t ................................. FAILED Bad plan.  You planned 64 tests but ran 4.
  [stdio] -Dcc=clang++ -Duse64bitall DEBUGGING
  [stdio] -Dcc=clang++ DEBUGGING
  [stdio] -Dcc=clang++ -Duselongdouble DEBUGGING
~~ ../dist/Attribute-Handlers/t/multi.t ........................ FAILED Non-zero exit status: 255 No plan found in TAP output
  [stdio] -Dcc=clang++ -Duse64bitall DEBUGGING
  [stdio] -Dcc=clang++ -Duse64bitall
  [stdio] -Dcc=clang++
  [stdio] -Dcc=clang++ DEBUGGING
  [stdio] -Dcc=clang++ -Duselongdouble
  [stdio] -Dcc=clang++ -Duselongdouble DEBUGGING
~~ ../t/re/pat_thr.t ........................................... FAILED Non-zero exit status: 2 No plan found in TAP output
  [stdio] -Dcc=clang++ -Duse64bitall DEBUGGING
  [stdio] -Dcc=clang++ -Duse64bitall
  [stdio] -Dcc=clang++
  [stdio] -Dcc=clang++ DEBUGGING
  [stdio] -Dcc=clang++ -Duselongdouble
  [stdio] -Dcc=clang++ -Duselongdouble DEBUGGING
~~ ../t/io/shm.t ............................................... FAILED Non-zero exit status: 2 No plan found in TAP output
  [stdio] -Dcc=clang++ -Duse64bitall DEBUGGING
  [stdio] -Dcc=clang++ -Duse64bitall
  [stdio] -Dcc=clang++
  [stdio] -Dcc=clang++ DEBUGGING
  [stdio] -Dcc=clang++ -Duselongdouble
  [stdio] -Dcc=clang++ -Duselongdouble DEBUGGING
~~ ../ext/XS-APItest/t/locale.t ................................ FAILED Non-zero exit status: 2 No plan found in TAP output
  [stdio] -Dcc=clang++ -Duse64bitall DEBUGGING
  [stdio] -Dcc=clang++ -Duse64bitall
  [stdio] -Dcc=clang++
  [stdio] -Dcc=clang++ DEBUGGING
  [stdio] -Dcc=clang++ -Duselongdouble
  [stdio] -Dcc=clang++ -Duselongdouble DEBUGGING
~~ ../t/io/fflush.t ............................................ FAILED Non-zero exit status: 2 No plan found in TAP output
  [stdio] -Dcc=clang++ -Duse64bitall DEBUGGING
  [stdio] -Dcc=clang++ -Duse64bitall
  [stdio] -Dcc=clang++
  [stdio] -Dcc=clang++ DEBUGGING
  [stdio] -Dcc=clang++ -Duselongdouble
  [stdio] -Dcc=clang++ -Duselongdouble DEBUGGING
~~ ../t/op/die.t ............................................... FAILED Non-zero exit status: 2 No plan found in TAP output
  [stdio] -Dcc=clang++ -Duse64bitall DEBUGGING
  [stdio] -Dcc=clang++ -Duse64bitall
  [stdio] -Dcc=clang++
  [stdio] -Dcc=clang++ DEBUGGING
  [stdio] -Dcc=clang++ -Duselongdouble
  [stdio] -Dcc=clang++ -Duselongdouble DEBUGGING
~~ ../t/op/yadayada.t .......................................... FAILED Non-zero exit status: 2 No plan found in TAP output
  [stdio] -Dcc=clang++ -Duse64bitall DEBUGGING
  [stdio] -Dcc=clang++ -Duse64bitall
  [stdio] -Dcc=clang++
  [stdio] -Dcc=clang++ DEBUGGING
  [stdio] -Dcc=clang++ -Duselongdouble
  [stdio] -Dcc=clang++ -Duselongdouble DEBUGGING
~~ ../t/op/lexsub.t ............................................ FAILED Non-zero exit status: 2 No plan found in TAP output
  [stdio] -Dcc=clang++ -Duse64bitall DEBUGGING
  [stdio] -Dcc=clang++ -Duse64bitall
  [stdio] -Dcc=clang++
  [stdio] -Dcc=clang++ DEBUGGING
  [stdio] -Dcc=clang++ -Duselongdouble
  [stdio] -Dcc=clang++ -Duselongdouble DEBUGGING
~~ ../t/op/readdir.t ........................................... FAILED Non-zero exit status: 2 No plan found in TAP output
  [stdio] -Dcc=clang++ -Duse64bitall DEBUGGING
  [stdio] -Dcc=clang++ -Duse64bitall
  [stdio] -Dcc=clang++
  [stdio] -Dcc=clang++ DEBUGGING
  [stdio] -Dcc=clang++ -Duselongdouble
  [stdio] -Dcc=clang++ -Duselongdouble DEBUGGING
~~ ../t/mro/isa_aliases.t ...................................... FAILED Non-zero exit status: 2 No plan found in TAP output
  [stdio] -Dcc=clang++ -Duse64bitall DEBUGGING
  [stdio] -Dcc=clang++ -Duse64bitall
  [stdio] -Dcc=clang++
  [stdio] -Dcc=clang++ DEBUGGING
  [stdio] -Dcc=clang++ -Duselongdouble
  [stdio] -Dcc=clang++ -Duselongdouble DEBUGGING
~~ ../t/op/symbolcache.t ....................................... FAILED Non-zero exit status: 2 No plan found in TAP output
  [stdio] -Dcc=clang++ -Duse64bitall DEBUGGING
  [stdio] -Dcc=clang++ -Duse64bitall
  [stdio] -Dcc=clang++
  [stdio] -Dcc=clang++ DEBUGGING
  [stdio] -Dcc=clang++ -Duselongdouble
  [stdio] -Dcc=clang++ -Duselongdouble DEBUGGING
~~ ../t/run/fresh_perl.t ....................................... FAILED Non-zero exit status: 2 No plan found in TAP output
  [stdio] -Dcc=clang++ -Duse64bitall DEBUGGING
  [stdio] -Dcc=clang++ -Duse64bitall
  [stdio] -Dcc=clang++
  [stdio] -Dcc=clang++ DEBUGGING
  [stdio] -Dcc=clang++ -Duselongdouble
  [stdio] -Dcc=clang++ -Duselongdouble DEBUGGING
~~ ../t/op/threads.t ........................................... FAILED Non-zero exit status: 2 No plan found in TAP output
  [stdio] -Dcc=clang++ -Duse64bitall DEBUGGING
  [stdio] -Dcc=clang++ -Duse64bitall
  [stdio] -Dcc=clang++
  [stdio] -Dcc=clang++ DEBUGGING
  [stdio] -Dcc=clang++ -Duselongdouble
  [stdio] -Dcc=clang++ -Duselongdouble DEBUGGING
~~ ../t/op/negate.t ............................................ FAILED Non-zero exit status: 2 No plan found in TAP output
  [stdio] -Dcc=clang++ -Duse64bitall DEBUGGING
  [stdio] -Dcc=clang++ -Duse64bitall
  [stdio] -Dcc=clang++
  [stdio] -Dcc=clang++ DEBUGGING
  [stdio] -Dcc=clang++ -Duselongdouble
  [stdio] -Dcc=clang++ -Duselongdouble DEBUGGING
~~ ../t/op/infnan.t ............................................ FAILED Non-zero exit status: 2 No plan found in TAP output
  [stdio] -Dcc=clang++ -Duse64bitall DEBUGGING
  [stdio] -Dcc=clang++ -Duse64bitall
  [stdio] -Dcc=clang++
  [stdio] -Dcc=clang++ DEBUGGING
  [stdio] -Dcc=clang++ -Duselongdouble
  [stdio] -Dcc=clang++ -Duselongdouble DEBUGGING
~~ ../ext/Hash-Util/t/Util.t ................................... FAILED Non-zero exit status: 255 No plan found in TAP output
  [stdio] -Dcc=clang++ -Duse64bitall DEBUGGING
  [stdio] -Dcc=clang++ -Duse64bitall
  [stdio] -Dcc=clang++
  [stdio] -Dcc=clang++ DEBUGGING
  [stdio] -Dcc=clang++ -Duselongdouble
  [stdio] -Dcc=clang++ -Duselongdouble DEBUGGING
~~ ../t/op/warn.t .............................................. FAILED Non-zero exit status: 2 No plan found in TAP output
  [stdio] -Dcc=clang++ -Duse64bitall DEBUGGING
  [stdio] -Dcc=clang++ -Duse64bitall
  [stdio] -Dcc=clang++
  [stdio] -Dcc=clang++ DEBUGGING
  [stdio] -Dcc=clang++ -Duselongdouble
  [stdio] -Dcc=clang++ -Duselongdouble DEBUGGING
~~ ../t/op/reverse.t ........................................... FAILED Non-zero exit status: 2 No plan found in TAP output
  [stdio] -Dcc=clang++ -Duse64bitall DEBUGGING
  [stdio] -Dcc=clang++ -Duse64bitall
  [stdio] -Dcc=clang++
  [stdio] -Dcc=clang++ DEBUGGING
  [stdio] -Dcc=clang++ -Duselongdouble
  [stdio] -Dcc=clang++ -Duselongdouble DEBUGGING
~~ ../ext/XS-APItest/t/call.t .................................. FAILED Non-zero exit status: 2 No plan found in TAP output
  [stdio] -Dcc=clang++ -Duse64bitall DEBUGGING
  [stdio] -Dcc=clang++ -Duse64bitall
  [stdio] -Dcc=clang++
  [stdio] -Dcc=clang++ DEBUGGING
  [stdio] -Dcc=clang++ -Duselongdouble
  [stdio] -Dcc=clang++ -Duselongdouble DEBUGGING
~~ ../t/run/switchF2.t ......................................... FAILED Non-zero exit status: 2 No plan found in TAP output
  [stdio] -Dcc=clang++ -Duse64bitall DEBUGGING
  [stdio] -Dcc=clang++ -Duse64bitall
  [stdio] -Dcc=clang++
  [stdio] -Dcc=clang++ DEBUGGING
  [stdio] -Dcc=clang++ -Duselongdouble
  [stdio] -Dcc=clang++ -Duselongdouble DEBUGGING
~~ ../cpan/Test-Simple/t/Test2/acceptance/try_it_fork.t ........ FAILED Non-zero exit status: 255 No plan found in TAP output
  [stdio] -Dcc=clang++ -Duse64bitall DEBUGGING
  [stdio] -Dcc=clang++ -Duse64bitall
  [stdio] -Dcc=clang++
  [stdio] -Dcc=clang++ DEBUGGING
  [stdio] -Dcc=clang++ -Duselongdouble
  [stdio] -Dcc=clang++ -Duselongdouble DEBUGGING
~~ ../lib/Tie/Array/stdpush.t .................................. FAILED Non-zero exit status: 2 No plan found in TAP output
  [stdio] -Dcc=clang++ -Duse64bitall DEBUGGING
  [stdio] -Dcc=clang++ -Duse64bitall
  [stdio] -Dcc=clang++
  [stdio] -Dcc=clang++ DEBUGGING
  [stdio] -Dcc=clang++ -Duselongdouble
  [stdio] -Dcc=clang++ -Duselongdouble DEBUGGING
~~ ../t/op/mydef.t ............................................. FAILED Non-zero exit status: 2 No plan found in TAP output
  [stdio] -Dcc=clang++ -Duse64bitall DEBUGGING
  [stdio] -Dcc=clang++ -Duse64bitall
  [stdio] -Dcc=clang++
  [stdio] -Dcc=clang++ DEBUGGING
  [stdio] -Dcc=clang++ -Duselongdouble
  [stdio] -Dcc=clang++ -Duselongdouble DEBUGGING
~~ ../cpan/Text-ParseWords/t/ParseWords.t ...................... FAILED Non-zero exit status: 255 Bad plan.  You planned 27 tests but ran 0.
  [stdio] -Dcc=clang++ -Duse64bitall DEBUGGING
  [stdio] -Dcc=clang++ -Duse64bitall
  [stdio] -Dcc=clang++
  [stdio] -Dcc=clang++ DEBUGGING
  [stdio] -Dcc=clang++ -Duselongdouble
  [stdio] -Dcc=clang++ -Duselongdouble DEBUGGING
~~ ../t/op/threads-dirh.t ...................................... FAILED Non-zero exit status: 2 No plan found in TAP output
  [stdio] -Dcc=clang++ -Duse64bitall DEBUGGING
  [stdio] -Dcc=clang++ -Duse64bitall
  [stdio] -Dcc=clang++
  [stdio] -Dcc=clang++ DEBUGGING
  [stdio] -Dcc=clang++ -Duselongdouble
  [stdio] -Dcc=clang++ -Duselongdouble DEBUGGING
~~ ../t/re/reg_eval_scope.t .................................... FAILED Non-zero exit status: 2 No plan found in TAP output
  [stdio] -Dcc=clang++ -Duse64bitall DEBUGGING
  [stdio] -Dcc=clang++ -Duse64bitall
  [stdio] -Dcc=clang++
  [stdio] -Dcc=clang++ DEBUGGING
  [stdio] -Dcc=clang++ -Duselongdouble
  [stdio] -Dcc=clang++ -Duselongdouble DEBUGGING
~~ ../t/porting/utils.t ........................................ FAILED 17
  [stdio] -Dcc=clang++ -Duse64bitall DEBUGGING
  [stdio] -Dcc=clang++ -Duse64bitall
  [stdio] -Dcc=clang++
  [stdio] -Dcc=clang++ DEBUGGING
  [stdio] -Dcc=clang++ -Duselongdouble
  [stdio] -Dcc=clang++ -Duselongdouble DEBUGGING
~~ ../cpan/ExtUtils-MakeMaker/t/cd.t ........................... FAILED Non-zero exit status: 255 Bad plan.  You planned 4 tests but ran 0.
  [stdio] -Dcc=clang++ -Duse64bitall DEBUGGING
  [stdio] -Dcc=clang++ -Duse64bitall
  [stdio] -Dcc=clang++
  [stdio] -Dcc=clang++ DEBUGGING
  [stdio] -Dcc=clang++ -Duselongdouble
  [stdio] -Dcc=clang++ -Duselongdouble DEBUGGING
~~ ../dist/IO/t/io_file_export.t ............................... FAILED Non-zero exit status: 2 No plan found in TAP output
  [stdio] -Dcc=clang++ -Duse64bitall DEBUGGING
  [stdio] -Dcc=clang++ -Duse64bitall
  [stdio] -Dcc=clang++
  [stdio] -Dcc=clang++ DEBUGGING
  [stdio] -Dcc=clang++ -Duselongdouble
  [stdio] -Dcc=clang++ -Duselongdouble DEBUGGING
~~ ../t/op/chop.t .............................................. FAILED Non-zero exit status: 2 No plan found in TAP output
  [stdio] -Dcc=clang++ -Duse64bitall DEBUGGING
  [stdio] -Dcc=clang++ -Duse64bitall
  [stdio] -Dcc=clang++
  [stdio] -Dcc=clang++ DEBUGGING
  [stdio] -Dcc=clang++ -Duselongdouble
  [stdio] -Dcc=clang++ -Duselongdouble DEBUGGING
~~ ../t/porting/checkcfgvar.t .................................. FAILED Non-zero exit status: 2 No plan found in TAP output
  [stdio] -Dcc=clang++ -Duse64bitall DEBUGGING
  [stdio] -Dcc=clang++ -Duse64bitall
  [stdio] -Dcc=clang++
  [stdio] -Dcc=clang++ DEBUGGING
  [stdio] -Dcc=clang++ -Duselongdouble
  [stdio] -Dcc=clang++ -Duselongdouble DEBUGGING
~~ ../cpan/Pod-Checker/t/pod/selfcheck.t ....................... FAILED Non-zero exit status: 255 No plan found in TAP output
  [stdio] -Dcc=clang++ -Duse64bitall DEBUGGING
  [stdio] -Dcc=clang++ -Duse64bitall
  [stdio] -Dcc=clang++
  [stdio] -Dcc=clang++ DEBUGGING
  [stdio] -Dcc=clang++ -Duselongdouble
  [stdio] -Dcc=clang++ -Duselongdouble DEBUGGING
~~ ../lib/locale.t ............................................. FAILED Non-zero exit status: 255 No plan found in TAP output
  [stdio] -Dcc=clang++ -Duse64bitall DEBUGGING
  [stdio] -Dcc=clang++ -Duse64bitall
  [stdio] -Dcc=clang++
  [stdio] -Dcc=clang++ DEBUGGING
  [stdio] -Dcc=clang++ -Duselongdouble
  [stdio] -Dcc=clang++ -Duselongdouble DEBUGGING
~~ ../dist/Storable/t/regexp.t ................................. FAILED Non-zero exit status: 255 Bad plan.  You planned 64 tests but ran 4.
  [stdio] -Dcc=clang++ -Duse64bitall
  [stdio] -Dcc=clang++
  [stdio] -Dcc=clang++ -Duselongdouble
~~ ../t/re/pat_advanced.t ...................................... FAILED Non-zero exit status: 2 No plan found in TAP output
  [stdio] -Dcc=clang++ -Duse64bitall DEBUGGING
  [stdio] -Dcc=clang++ -Duse64bitall
  [stdio] -Dcc=clang++
  [stdio] -Dcc=clang++ DEBUGGING
  [stdio] -Dcc=clang++ -Duselongdouble
  [stdio] -Dcc=clang++ -Duselongdouble DEBUGGING
~~ ../t/io/dup.t ............................................... FAILED Non-zero exit status: 2 No plan found in TAP output
  [stdio] -Dcc=clang++ -Duse64bitall DEBUGGING
  [stdio] -Dcc=clang++ -Duse64bitall
  [stdio] -Dcc=clang++
  [stdio] -Dcc=clang++ DEBUGGING
  [stdio] -Dcc=clang++ -Duselongdouble
  [stdio] -Dcc=clang++ -Duselongdouble DEBUGGING
~~ ../t/op/alarm.t ............................................. FAILED Non-zero exit status: 2 No plan found in TAP output
  [stdio] -Dcc=clang++ -Duse64bitall DEBUGGING
  [stdio] -Dcc=clang++ -Duse64bitall
  [stdio] -Dcc=clang++
  [stdio] -Dcc=clang++ DEBUGGING
  [stdio] -Dcc=clang++ -Duselongdouble
  [stdio] -Dcc=clang++ -Duselongdouble DEBUGGING
~~ ../ext/B/t/optree_specials.t ................................ FAILED 3
  [stdio] -Dcc=clang++ -Duse64bitall DEBUGGING
  [stdio] -Dcc=clang++ -Duse64bitall
  [stdio] -Dcc=clang++
  [stdio] -Dcc=clang++ DEBUGGING
  [stdio] -Dcc=clang++ -Duselongdouble
  [stdio] -Dcc=clang++ -Duselongdouble DEBUGGING
~~ ../lib/meta_notation.t ...................................... FAILED Non-zero exit status: 2 No plan found in TAP output
  [stdio] -Dcc=clang++ -Duse64bitall DEBUGGING
  [stdio] -Dcc=clang++ -Duse64bitall
  [stdio] -Dcc=clang++
  [stdio] -Dcc=clang++ DEBUGGING
  [stdio] -Dcc=clang++ -Duselongdouble
  [stdio] -Dcc=clang++ -Duselongdouble DEBUGGING
~~ ../t/mro/package_aliases.t .................................. FAILED Non-zero exit status: 2 No plan found in TAP output
  [stdio] -Dcc=clang++ -Duse64bitall DEBUGGING
  [stdio] -Dcc=clang++ -Duse64bitall
  [stdio] -Dcc=clang++
  [stdio] -Dcc=clang++ DEBUGGING
  [stdio] -Dcc=clang++ -Duselongdouble
  [stdio] -Dcc=clang++ -Duselongdouble DEBUGGING
~~ ../ext/FileCache/t/05override.t ............................. FAILED Non-zero exit status: 25 Bad plan.  You planned 1 tests but ran 0.
  [stdio] -Dcc=clang++ -Duse64bitall DEBUGGING
  [stdio] -Dcc=clang++ -Duse64bitall
  [stdio] -Dcc=clang++
  [stdio] -Dcc=clang++ DEBUGGING
  [stdio] -Dcc=clang++ -Duselongdouble
  [stdio] -Dcc=clang++ -Duselongdouble DEBUGGING
~~ ../cpan/Compress-Raw-Zlib/t/18lvalue.t ...................... FAILED Non-zero exit status: 255 No plan found in TAP output
  [stdio] -Dcc=clang++ -Duse64bitall DEBUGGING
  [stdio] -Dcc=clang++ -Duse64bitall
  [stdio] -Dcc=clang++
  [stdio] -Dcc=clang++ DEBUGGING
  [stdio] -Dcc=clang++ -Duselongdouble
  [stdio] -Dcc=clang++ -Duselongdouble DEBUGGING
~~ ../t/op/sleep.t ............................................. FAILED Non-zero exit status: 2 No plan found in TAP output
  [stdio] -Dcc=clang++ -Duse64bitall DEBUGGING
  [stdio] -Dcc=clang++ -Duse64bitall
  [stdio] -Dcc=clang++
  [stdio] -Dcc=clang++ DEBUGGING
  [stdio] -Dcc=clang++ -Duselongdouble
  [stdio] -Dcc=clang++ -Duselongdouble DEBUGGING
~~ ../t/re/script_run.t ........................................ FAILED Non-zero exit status: 2 No plan found in TAP output
  [stdio] -Dcc=clang++ -Duse64bitall DEBUGGING
  [stdio] -Dcc=clang++ -Duse64bitall
  [stdio] -Dcc=clang++
  [stdio] -Dcc=clang++ DEBUGGING
  [stdio] -Dcc=clang++ -Duselongdouble
  [stdio] -Dcc=clang++ -Duselongdouble DEBUGGING
~~ ../lib/warnings.t ........................................... FAILED Non-zero exit status: 2 No plan found in TAP output
  [stdio] -Dcc=clang++ -Duse64bitall DEBUGGING
  [stdio] -Dcc=clang++ -Duse64bitall
  [stdio] -Dcc=clang++
  [stdio] -Dcc=clang++ DEBUGGING
  [stdio] -Dcc=clang++ -Duselongdouble
  [stdio] -Dcc=clang++ -Duselongdouble DEBUGGING
~~ ../t/op/tr_latin1.t ......................................... FAILED Non-zero exit status: 2 No plan found in TAP output
  [stdio] -Dcc=clang++ -Duse64bitall DEBUGGING
  [stdio] -Dcc=clang++ -Duse64bitall
  [stdio] -Dcc=clang++
  [stdio] -Dcc=clang++ DEBUGGING
  [stdio] -Dcc=clang++ -Duselongdouble
  [stdio] -Dcc=clang++ -Duselongdouble DEBUGGING
~~ ../t/re/pat_rt_report_thr.t ................................. FAILED Non-zero exit status: 2 No plan found in TAP output
  [stdio] -Dcc=clang++ -Duse64bitall DEBUGGING
  [stdio] -Dcc=clang++ -Duse64bitall
  [stdio] -Dcc=clang++
  [stdio] -Dcc=clang++ DEBUGGING
  [stdio] -Dcc=clang++ -Duselongdouble
  [stdio] -Dcc=clang++ -Duselongdouble DEBUGGING
~~ ../t/op/override.t .......................................... FAILED Non-zero exit status: 2 No plan found in TAP output
  [stdio] -Dcc=clang++ -Duse64bitall DEBUGGING
  [stdio] -Dcc=clang++ -Duse64bitall
  [stdio] -Dcc=clang++
  [stdio] -Dcc=clang++ DEBUGGING
  [stdio] -Dcc=clang++ -Duselongdouble
  [stdio] -Dcc=clang++ -Duselongdouble DEBUGGING
~~ ../t/op/context.t ........................................... FAILED Non-zero exit status: 2 No plan found in TAP output
  [stdio] -Dcc=clang++ -Duse64bitall DEBUGGING
  [stdio] -Dcc=clang++ -Duse64bitall
  [stdio] -Dcc=clang++
  [stdio] -Dcc=clang++ DEBUGGING
  [stdio] -Dcc=clang++ -Duselongdouble
  [stdio] -Dcc=clang++ -Duselongdouble DEBUGGING
~~ ../dist/threads/t/err.t ..................................... FAILED Non-zero exit status: 2 No plan found in TAP output
  [stdio] -Dcc=clang++ -Duse64bitall DEBUGGING
  [stdio] -Dcc=clang++ -Duse64bitall
  [stdio] -Dcc=clang++
  [stdio] -Dcc=clang++ DEBUGGING
  [stdio] -Dcc=clang++ -Duselongdouble
  [stdio] -Dcc=clang++ -Duselongdouble DEBUGGING
~~ ../t/op/pos.t ............................................... FAILED Non-zero exit status: 2 No plan found in TAP output
  [stdio] -Dcc=clang++ -Duse64bitall DEBUGGING
  [stdio] -Dcc=clang++ -Duse64bitall
  [stdio] -Dcc=clang++
  [stdio] -Dcc=clang++ DEBUGGING
  [stdio] -Dcc=clang++ -Duselongdouble
  [stdio] -Dcc=clang++ -Duselongdouble DEBUGGING
~~ ../t/op/lc.t ................................................ FAILED Non-zero exit status: 2 No plan found in TAP output
  [stdio] -Dcc=clang++ -Duse64bitall DEBUGGING
  [stdio] -Dcc=clang++ -Duse64bitall
  [stdio] -Dcc=clang++
  [stdio] -Dcc=clang++ DEBUGGING
  [stdio] -Dcc=clang++ -Duselongdouble
  [stdio] -Dcc=clang++ -Duselongdouble DEBUGGING
~~ ../t/op/chr.t ............................................... FAILED Non-zero exit status: 2 No plan found in TAP output
  [stdio] -Dcc=clang++ -Duse64bitall DEBUGGING
  [stdio] -Dcc=clang++ -Duse64bitall
  [stdio] -Dcc=clang++
  [stdio] -Dcc=clang++ DEBUGGING
  [stdio] -Dcc=clang++ -Duselongdouble
  [stdio] -Dcc=clang++ -Duselongdouble DEBUGGING
~~ ../dist/Exporter/t/warn.t ................................... FAILED Non-zero exit status: 255 No plan found in TAP output
  [stdio] -Dcc=clang++ -Duse64bitall DEBUGGING
  [stdio] -Dcc=clang++ -Duse64bitall
  [stdio] -Dcc=clang++
  [stdio] -Dcc=clang++ DEBUGGING
  [stdio] -Dcc=clang++ -Duselongdouble
  [stdio] -Dcc=clang++ -Duselongdouble DEBUGGING
~~ ../t/re/pat_rt_report.t ..................................... FAILED Non-zero exit status: 2 No plan found in TAP output
  [stdio] -Dcc=clang++ -Duse64bitall DEBUGGING
  [stdio] -Dcc=clang++ -Duse64bitall
  [stdio] -Dcc=clang++
  [stdio] -Dcc=clang++ DEBUGGING
  [stdio] -Dcc=clang++ -Duselongdouble
  [stdio] -Dcc=clang++ -Duselongdouble DEBUGGING
~~ ../ext/POSIX/t/sigaction.t .................................. FAILED Non-zero exit status: 255 Bad plan.  You planned 36 tests but ran 0.
  [stdio] -Dcc=clang++ -Duse64bitall DEBUGGING
  [stdio] -Dcc=clang++ -Duse64bitall
  [stdio] -Dcc=clang++
  [stdio] -Dcc=clang++ DEBUGGING
  [stdio] -Dcc=clang++ -Duselongdouble
  [stdio] -Dcc=clang++ -Duselongdouble DEBUGGING
~~ ../t/op/bop.t ............................................... FAILED Non-zero exit status: 2 No plan found in TAP output
  [stdio] -Dcc=clang++ -Duse64bitall DEBUGGING
  [stdio] -Dcc=clang++ -Duse64bitall
  [stdio] -Dcc=clang++
  [stdio] -Dcc=clang++ DEBUGGING
  [stdio] -Dcc=clang++ -Duselongdouble
  [stdio] -Dcc=clang++ -Duselongdouble DEBUGGING
~~ ../t/uni/caller.t ........................................... FAILED Non-zero exit status: 2 No plan found in TAP output
  [stdio] -Dcc=clang++ -Duse64bitall DEBUGGING
  [stdio] -Dcc=clang++ -Duse64bitall
  [stdio] -Dcc=clang++
  [stdio] -Dcc=clang++ DEBUGGING
  [stdio] -Dcc=clang++ -Duselongdouble
  [stdio] -Dcc=clang++ -Duselongdouble DEBUGGING
~~ ../dist/threads-shared/t/wait.t ............................. FAILED Non-zero exit status: 2 No plan found in TAP output
  [stdio] -Dcc=clang++ -Duse64bitall DEBUGGING
  [stdio] -Dcc=clang++ -Duse64bitall
  [stdio] -Dcc=clang++
  [stdio] -Dcc=clang++ DEBUGGING
  [stdio] -Dcc=clang++ -Duselongdouble
  [stdio] -Dcc=clang++ -Duselongdouble DEBUGGING
~~ ../t/run/switchd.t .......................................... FAILED Non-zero exit status: 2 No plan found in TAP output
  [stdio] -Dcc=clang++ -Duse64bitall DEBUGGING
  [stdio] -Dcc=clang++ -Duse64bitall
  [stdio] -Dcc=clang++
  [stdio] -Dcc=clang++ DEBUGGING
  [stdio] -Dcc=clang++ -Duselongdouble
  [stdio] -Dcc=clang++ -Duselongdouble DEBUGGING
~~ ../t/re/reg_posixcc.t ....................................... FAILED Non-zero exit status: 2 No plan found in TAP output
  [stdio] -Dcc=clang++ -Duse64bitall DEBUGGING
  [stdio] -Dcc=clang++ -Duse64bitall
  [stdio] -Dcc=clang++
  [stdio] -Dcc=clang++ DEBUGGING
  [stdio] -Dcc=clang++ -Duselongdouble
  [stdio] -Dcc=clang++ -Duselongdouble DEBUGGING
~~ ../cpan/Test-Simple/t/Legacy/buffer.t ....................... FAILED Non-zero exit status: 255 Bad plan.  You planned 20 tests but ran 0.
  [stdio] -Dcc=clang++ -Duse64bitall DEBUGGING
  [stdio] -Dcc=clang++ -Duse64bitall
  [stdio] -Dcc=clang++
  [stdio] -Dcc=clang++ DEBUGGING
  [stdio] -Dcc=clang++ -Duselongdouble
  [stdio] -Dcc=clang++ -Duselongdouble DEBUGGING
~~ ../t/op/inc.t ............................................... FAILED Non-zero exit status: 2 No plan found in TAP output
  [stdio] -Dcc=clang++ -Duse64bitall DEBUGGING
  [stdio] -Dcc=clang++ -Duse64bitall
  [stdio] -Dcc=clang++
  [stdio] -Dcc=clang++ DEBUGGING
  [stdio] -Dcc=clang++ -Duselongdouble
  [stdio] -Dcc=clang++ -Duselongdouble DEBUGGING
~~ ../ext/POSIX/t/mb.t ......................................... FAILED Non-zero exit status: 255 No plan found in TAP output
  [stdio] -Dcc=clang++ -Duse64bitall DEBUGGING
  [stdio] -Dcc=clang++ -Duse64bitall
  [stdio] -Dcc=clang++
  [stdio] -Dcc=clang++ DEBUGGING
  [stdio] -Dcc=clang++ -Duselongdouble
  [stdio] -Dcc=clang++ -Duselongdouble DEBUGGING
~~ ../t/op/read.t .............................................. FAILED Non-zero exit status: 2 No plan found in TAP output
  [stdio] -Dcc=clang++ -Duse64bitall DEBUGGING
  [stdio] -Dcc=clang++ -Duse64bitall
  [stdio] -Dcc=clang++
  [stdio] -Dcc=clang++ DEBUGGING
  [stdio] -Dcc=clang++ -Duselongdouble
  [stdio] -Dcc=clang++ -Duselongdouble DEBUGGING
~~ ../t/porting/authors.t ...................................... FAILED Non-zero exit status: 2 No plan found in TAP output
  [stdio] -Dcc=clang++ -Duse64bitall DEBUGGING
  [stdio] -Dcc=clang++ -Duse64bitall
  [stdio] -Dcc=clang++
  [stdio] -Dcc=clang++ DEBUGGING
  [stdio] -Dcc=clang++ -Duselongdouble
  [stdio] -Dcc=clang++ -Duselongdouble DEBUGGING
~~ ../t/re/fold_grind_l.t ...................................... FAILED Non-zero exit status: 2 No plan found in TAP output
  [stdio] -Dcc=clang++ -Duse64bitall DEBUGGING
  [stdio] -Dcc=clang++ -Duse64bitall
  [stdio] -Dcc=clang++
  [stdio] -Dcc=clang++ DEBUGGING
  [stdio] -Dcc=clang++ -Duselongdouble
  [stdio] -Dcc=clang++ -Duselongdouble DEBUGGING
~~ ../ext/POSIX/t/taint.t ...................................... FAILED Non-zero exit status: 255 No plan found in TAP output
  [stdio] -Dcc=clang++ -Duse64bitall DEBUGGING
  [stdio] -Dcc=clang++ -Duse64bitall
  [stdio] -Dcc=clang++
  [stdio] -Dcc=clang++ DEBUGGING
  [stdio] -Dcc=clang++ -Duselongdouble
  [stdio] -Dcc=clang++ -Duselongdouble DEBUGGING
~~ ../t/re/pat_psycho_thr.t .................................... FAILED Non-zero exit status: 2 No plan found in TAP output
  [stdio] -Dcc=clang++ -Duse64bitall DEBUGGING
  [stdio] -Dcc=clang++ -Duse64bitall
  [stdio] -Dcc=clang++
  [stdio] -Dcc=clang++ DEBUGGING
  [stdio] -Dcc=clang++ -Duselongdouble
  [stdio] -Dcc=clang++ -Duselongdouble DEBUGGING
~~ ../t/op/setpgrpstack.t ...................................... FAILED Non-zero exit status: 2 No plan found in TAP output
  [stdio] -Dcc=clang++ -Duse64bitall DEBUGGING
  [stdio] -Dcc=clang++ -Duse64bitall
  [stdio] -Dcc=clang++
  [stdio] -Dcc=clang++ DEBUGGING
  [stdio] -Dcc=clang++ -Duselongdouble
  [stdio] -Dcc=clang++ -Duselongdouble DEBUGGING
~~ ../t/run/switchx.t .......................................... FAILED Non-zero exit status: 2 No plan found in TAP output
  [stdio] -Dcc=clang++ -Duse64bitall DEBUGGING
  [stdio] -Dcc=clang++ -Duse64bitall
  [stdio] -Dcc=clang++
  [stdio] -Dcc=clang++ DEBUGGING
  [stdio] -Dcc=clang++ -Duselongdouble
  [stdio] -Dcc=clang++ -Duselongdouble DEBUGGING
~~ ../t/op/print.t ............................................. FAILED Non-zero exit status: 2 No plan found in TAP output
  [stdio] -Dcc=clang++ -Duse64bitall DEBUGGING
  [stdio] -Dcc=clang++ -Duse64bitall
  [stdio] -Dcc=clang++
  [stdio] -Dcc=clang++ DEBUGGING
  [stdio] -Dcc=clang++ -Duselongdouble
  [stdio] -Dcc=clang++ -Duselongdouble DEBUGGING
~~ ../dist/Data-Dumper/t/qr.t .................................. FAILED 1-2 Non-zero exit status: 2
  [stdio] -Dcc=clang++ -Duse64bitall DEBUGGING
  [stdio] -Dcc=clang++ -Duse64bitall
  [stdio] -Dcc=clang++
  [stdio] -Dcc=clang++ DEBUGGING
  [stdio] -Dcc=clang++ -Duselongdouble
  [stdio] -Dcc=clang++ -Duselongdouble DEBUGGING
~~ ../cpan/Compress-Raw-Zlib/t/09limitoutput.t ................. FAILED Non-zero exit status: 255 No plan found in TAP output
  [stdio] -Dcc=clang++ -Duse64bitall DEBUGGING
  [stdio] -Dcc=clang++ -Duse64bitall
  [stdio] -Dcc=clang++
  [stdio] -Dcc=clang++ DEBUGGING
  [stdio] -Dcc=clang++ -Duselongdouble
  [stdio] -Dcc=clang++ -Duselongdouble DEBUGGING
~~ ../t/op/glob.t .............................................. FAILED Non-zero exit status: 2 No plan found in TAP output
  [stdio] -Dcc=clang++ -Duse64bitall DEBUGGING
  [stdio] -Dcc=clang++ -Duse64bitall
  [stdio] -Dcc=clang++
  [stdio] -Dcc=clang++ DEBUGGING
  [stdio] -Dcc=clang++ -Duselongdouble
  [stdio] -Dcc=clang++ -Duselongdouble DEBUGGING
~~ ../t/op/getpid.t ............................................ FAILED Non-zero exit status: 2 No plan found in TAP output
  [stdio] -Dcc=clang++ -Duse64bitall DEBUGGING
  [stdio] -Dcc=clang++ -Duse64bitall
  [stdio] -Dcc=clang++
  [stdio] -Dcc=clang++ DEBUGGING
  [stdio] -Dcc=clang++ -Duselongdouble
  [stdio] -Dcc=clang++ -Duselongdouble DEBUGGING
~~ ../t/re/qr.t ................................................ FAILED Non-zero exit status: 2 No plan found in TAP output
  [stdio] -Dcc=clang++ -Duse64bitall DEBUGGING
  [stdio] -Dcc=clang++ -Duse64bitall
  [stdio] -Dcc=clang++
  [stdio] -Dcc=clang++ DEBUGGING
  [stdio] -Dcc=clang++ -Duselongdouble
  [stdio] -Dcc=clang++ -Duselongdouble DEBUGGING
~~ ../t/re/regex_sets.t ........................................ FAILED Non-zero exit status: 2 No plan found in TAP output
  [stdio] -Dcc=clang++ -Duse64bitall DEBUGGING
  [stdio] -Dcc=clang++ -Duse64bitall
  [stdio] -Dcc=clang++
  [stdio] -Dcc=clang++ DEBUGGING
  [stdio] -Dcc=clang++ -Duselongdouble
  [stdio] -Dcc=clang++ -Duselongdouble DEBUGGING
~~ ../t/op/blocks.t ............................................ FAILED Non-zero exit status: 2 No plan found in TAP output
  [stdio] -Dcc=clang++ -Duse64bitall DEBUGGING
  [stdio] -Dcc=clang++ -Duse64bitall
  [stdio] -Dcc=clang++
  [stdio] -Dcc=clang++ DEBUGGING
  [stdio] -Dcc=clang++ -Duselongdouble
  [stdio] -Dcc=clang++ -Duselongdouble DEBUGGING
~~ ../t/op/hexfp.t ............................................. FAILED Non-zero exit status: 2 No plan found in TAP output
  [stdio] -Dcc=clang++ -Duse64bitall DEBUGGING
  [stdio] -Dcc=clang++ -Duse64bitall
  [stdio] -Dcc=clang++
  [stdio] -Dcc=clang++ DEBUGGING
  [stdio] -Dcc=clang++ -Duselongdouble
  [stdio] -Dcc=clang++ -Duselongdouble DEBUGGING
~~ ../t/io/errnosig.t .......................................... FAILED Non-zero exit status: 2 No plan found in TAP output
  [stdio] -Dcc=clang++ -Duse64bitall DEBUGGING
  [stdio] -Dcc=clang++ -Duse64bitall
  [stdio] -Dcc=clang++
  [stdio] -Dcc=clang++ DEBUGGING
  [stdio] -Dcc=clang++ -Duselongdouble
  [stdio] -Dcc=clang++ -Duselongdouble DEBUGGING
~~ ../t/io/defout.t ............................................ FAILED Non-zero exit status: 2 No plan found in TAP output
  [stdio] -Dcc=clang++ -Duse64bitall DEBUGGING
  [stdio] -Dcc=clang++ -Duse64bitall
  [stdio] -Dcc=clang++
  [stdio] -Dcc=clang++ DEBUGGING
  [stdio] -Dcc=clang++ -Duselongdouble
  [stdio] -Dcc=clang++ -Duselongdouble DEBUGGING
~~ ../t/re/pat_psycho.t ........................................ FAILED Non-zero exit status: 2 No plan found in TAP output
  [stdio] -Dcc=clang++ -Duse64bitall DEBUGGING
  [stdio] -Dcc=clang++ -Duse64bitall
  [stdio] -Dcc=clang++
  [stdio] -Dcc=clang++ DEBUGGING
  [stdio] -Dcc=clang++ -Duselongdouble
  [stdio] -Dcc=clang++ -Duselongdouble DEBUGGING
~~ ../t/re/pat.t ............................................... FAILED Non-zero exit status: 2 No plan found in TAP output
  [stdio] -Dcc=clang++ -Duse64bitall DEBUGGING
  [stdio] -Dcc=clang++ -Duse64bitall
  [stdio] -Dcc=clang++
  [stdio] -Dcc=clang++ DEBUGGING
  [stdio] -Dcc=clang++ -Duselongdouble
  [stdio] -Dcc=clang++ -Duselongdouble DEBUGGING
~~ ../t/io/closepid.t .......................................... FAILED Non-zero exit status: 2 No plan found in TAP output
  [stdio] -Dcc=clang++ -Duse64bitall DEBUGGING
  [stdio] -Dcc=clang++ -Duse64bitall
  [stdio] -Dcc=clang++
  [stdio] -Dcc=clang++ DEBUGGING
  [stdio] -Dcc=clang++ -Duselongdouble
  [stdio] -Dcc=clang++ -Duselongdouble DEBUGGING
~~ ../ext/B/t/concise-xs.t ..................................... FAILED Non-zero exit status: 255
  [stdio] -Dcc=clang++ -Duse64bitall DEBUGGING
  [stdio] -Dcc=clang++ -Duse64bitall
  [stdio] -Dcc=clang++
  [stdio] -Dcc=clang++ DEBUGGING
  [stdio] -Dcc=clang++ -Duselongdouble
  [stdio] -Dcc=clang++ -Duselongdouble DEBUGGING
~~ ../t/op/coreamp.t ........................................... FAILED Non-zero exit status: 2 No plan found in TAP output
  [stdio] -Dcc=clang++ -Duse64bitall DEBUGGING
  [stdio] -Dcc=clang++ -Duse64bitall
  [stdio] -Dcc=clang++
  [stdio] -Dcc=clang++ DEBUGGING
  [stdio] -Dcc=clang++ -Duselongdouble
  [stdio] -Dcc=clang++ -Duselongdouble DEBUGGING
~~ ../t/porting/re_context.t ................................... FAILED Non-zero exit status: 2 No plan found in TAP output
  [stdio] -Dcc=clang++ -Duse64bitall DEBUGGING
  [stdio] -Dcc=clang++ -Duse64bitall
  [stdio] -Dcc=clang++
  [stdio] -Dcc=clang++ DEBUGGING
  [stdio] -Dcc=clang++ -Duselongdouble
  [stdio] -Dcc=clang++ -Duselongdouble DEBUGGING
~~ ../ext/re/t/re_funcs_u.t .................................... FAILED Non-zero exit status: 2 No plan found in TAP output
  [stdio] -Dcc=clang++ -Duse64bitall DEBUGGING
  [stdio] -Dcc=clang++ -Duse64bitall
  [stdio] -Dcc=clang++
  [stdio] -Dcc=clang++ DEBUGGING
  [stdio] -Dcc=clang++ -Duselongdouble
  [stdio] -Dcc=clang++ -Duselongdouble DEBUGGING
~~ ../t/op/overload_integer.t .................................. FAILED Non-zero exit status: 2 No plan found in TAP output
  [stdio] -Dcc=clang++ -Duse64bitall DEBUGGING
  [stdio] -Dcc=clang++ -Duse64bitall
  [stdio] -Dcc=clang++
  [stdio] -Dcc=clang++ DEBUGGING
  [stdio] -Dcc=clang++ -Duselongdouble
  [stdio] -Dcc=clang++ -Duselongdouble DEBUGGING
~~ ../t/op/int.t ............................................... FAILED Non-zero exit status: 2 No plan found in TAP output
  [stdio] -Dcc=clang++ -Duse64bitall DEBUGGING
  [stdio] -Dcc=clang++ -Duse64bitall
  [stdio] -Dcc=clang++
  [stdio] -Dcc=clang++ DEBUGGING
  [stdio] -Dcc=clang++ -Duselongdouble
  [stdio] -Dcc=clang++ -Duselongdouble DEBUGGING
~~ ../t/op/tiearray.t .......................................... FAILED Non-zero exit status: 2 No plan found in TAP output
  [stdio] -Dcc=clang++ -Duse64bitall DEBUGGING
  [stdio] -Dcc=clang++ -Duse64bitall
  [stdio] -Dcc=clang++
  [stdio] -Dcc=clang++ DEBUGGING
  [stdio] -Dcc=clang++ -Duselongdouble
  [stdio] -Dcc=clang++ -Duselongdouble DEBUGGING
~~ ../t/op/defined.t ........................................... FAILED Non-zero exit status: 2 No plan found in TAP output
  [stdio] -Dcc=clang++ -Duse64bitall DEBUGGING
  [stdio] -Dcc=clang++ -Duse64bitall
  [stdio] -Dcc=clang++
  [stdio] -Dcc=clang++ DEBUGGING
  [stdio] -Dcc=clang++ -Duselongdouble
  [stdio] -Dcc=clang++ -Duselongdouble DEBUGGING
~~ ../ext/re/t/lexical_debug.t ................................. FAILED Non-zero exit status: 2 No plan found in TAP output
  [stdio] -Dcc=clang++ -Duse64bitall DEBUGGING
  [stdio] -Dcc=clang++ -Duse64bitall
  [stdio] -Dcc=clang++
  [stdio] -Dcc=clang++ DEBUGGING
  [stdio] -Dcc=clang++ -Duselongdouble
  [stdio] -Dcc=clang++ -Duselongdouble DEBUGGING
~~ ../t/op/quotemeta.t ......................................... FAILED Non-zero exit status: 2 No plan found in TAP output
  [stdio] -Dcc=clang++ -Duse64bitall DEBUGGING
  [stdio] -Dcc=clang++ -Duse64bitall
  [stdio] -Dcc=clang++
  [stdio] -Dcc=clang++ DEBUGGING
  [stdio] -Dcc=clang++ -Duselongdouble
  [stdio] -Dcc=clang++ -Duselongdouble DEBUGGING
~~ ../t/re/reg_pmod.t .......................................... FAILED Non-zero exit status: 2 No plan found in TAP output
  [stdio] -Dcc=clang++ -Duse64bitall DEBUGGING
  [stdio] -Dcc=clang++ -Duse64bitall
  [stdio] -Dcc=clang++
  [stdio] -Dcc=clang++ DEBUGGING
  [stdio] -Dcc=clang++ -Duselongdouble
  [stdio] -Dcc=clang++ -Duselongdouble DEBUGGING
~~ ../t/op/for.t ............................................... FAILED Non-zero exit status: 2 No plan found in TAP output
  [stdio] -Dcc=clang++ -Duse64bitall DEBUGGING
  [stdio] -Dcc=clang++ -Duse64bitall
  [stdio] -Dcc=clang++
  [stdio] -Dcc=clang++ DEBUGGING
  [stdio] -Dcc=clang++ -Duselongdouble
  [stdio] -Dcc=clang++ -Duselongdouble DEBUGGING
~~ ../cpan/Test-Simple/t/Legacy/exit.t ......................... FAILED 1-257
  [stdio] -Dcc=clang++ DEBUGGING
~~ ../t/re/speed.t ............................................. FAILED Non-zero exit status: 2 No plan found in TAP output
  [stdio] -Dcc=clang++ -Duse64bitall DEBUGGING
  [stdio] -Dcc=clang++ -Duse64bitall
  [stdio] -Dcc=clang++
  [stdio] -Dcc=clang++ DEBUGGING
  [stdio] -Dcc=clang++ -Duselongdouble
  [stdio] -Dcc=clang++ -Duselongdouble DEBUGGING
~~ ../t/op/mkdir.t ............................................. FAILED Non-zero exit status: 2 No plan found in TAP output
  [stdio] -Dcc=clang++ -Duse64bitall DEBUGGING
  [stdio] -Dcc=clang++ -Duse64bitall
  [stdio] -Dcc=clang++
  [stdio] -Dcc=clang++ DEBUGGING
  [stdio] -Dcc=clang++ -Duselongdouble
  [stdio] -Dcc=clang++ -Duselongdouble DEBUGGING
~~ ../cpan/ExtUtils-MakeMaker/t/oneliner.t ..................... FAILED 5 Non-zero exit status: 1
  [stdio] -Dcc=clang++ -Duse64bitall DEBUGGING
  [stdio] -Dcc=clang++ -Duse64bitall
  [stdio] -Dcc=clang++
  [stdio] -Dcc=clang++ DEBUGGING
  [stdio] -Dcc=clang++ -Duselongdouble
  [stdio] -Dcc=clang++ -Duselongdouble DEBUGGING
~~ ../lib/feature.t ............................................ FAILED Non-zero exit status: 2 No plan found in TAP output
  [stdio] -Dcc=clang++ -Duse64bitall DEBUGGING
  [stdio] -Dcc=clang++ -Duse64bitall
  [stdio] -Dcc=clang++
  [stdio] -Dcc=clang++ DEBUGGING
  [stdio] -Dcc=clang++ -Duselongdouble
  [stdio] -Dcc=clang++ -Duselongdouble DEBUGGING
~~ ../t/io/through.t ........................................... FAILED Non-zero exit status: 2 No plan found in TAP output
  [stdio] -Dcc=clang++ -Duse64bitall DEBUGGING
  [stdio] -Dcc=clang++ -Duse64bitall
  [stdio] -Dcc=clang++
  [stdio] -Dcc=clang++ DEBUGGING
  [stdio] -Dcc=clang++ -Duselongdouble
  [stdio] -Dcc=clang++ -Duselongdouble DEBUGGING
~~ ../t/op/sysio.t ............................................. FAILED Non-zero exit status: 2 No plan found in TAP output
  [stdio] -Dcc=clang++ -Duse64bitall DEBUGGING
  [stdio] -Dcc=clang++ -Duse64bitall
  [stdio] -Dcc=clang++
  [stdio] -Dcc=clang++ DEBUGGING
  [stdio] -Dcc=clang++ -Duselongdouble
  [stdio] -Dcc=clang++ -Duselongdouble DEBUGGING
~~ ../t/op/or.t ................................................ FAILED Non-zero exit status: 2 No plan found in TAP output
  [stdio] -Dcc=clang++ -Duse64bitall DEBUGGING
  [stdio] -Dcc=clang++ -Duse64bitall
  [stdio] -Dcc=clang++
  [stdio] -Dcc=clang++ DEBUGGING
  [stdio] -Dcc=clang++ -Duselongdouble
  [stdio] -Dcc=clang++ -Duselongdouble DEBUGGING
~~ ../t/op/local.t ............................................. FAILED Non-zero exit status: 2 No plan found in TAP output
  [stdio] -Dcc=clang++ -Duse64bitall DEBUGGING
  [stdio] -Dcc=clang++ -Duse64bitall
  [stdio] -Dcc=clang++
  [stdio] -Dcc=clang++ DEBUGGING
  [stdio] -Dcc=clang++ -Duselongdouble
  [stdio] -Dcc=clang++ -Duselongdouble DEBUGGING
~~ ../t/io/pvbm.t .............................................. FAILED Non-zero exit status: 2 No plan found in TAP output
  [stdio] -Dcc=clang++ -Duse64bitall DEBUGGING
  [stdio] -Dcc=clang++ -Duse64bitall
  [stdio] -Dcc=clang++
  [stdio] -Dcc=clang++ DEBUGGING
  [stdio] -Dcc=clang++ -Duselongdouble
  [stdio] -Dcc=clang++ -Duselongdouble DEBUGGING
~~ ../t/op/smartkve.t .......................................... FAILED Non-zero exit status: 2 No plan found in TAP output
  [stdio] -Dcc=clang++ -Duse64bitall DEBUGGING
  [stdio] -Dcc=clang++ -Duse64bitall
  [stdio] -Dcc=clang++
  [stdio] -Dcc=clang++ DEBUGGING
  [stdio] -Dcc=clang++ -Duselongdouble
  [stdio] -Dcc=clang++ -Duselongdouble DEBUGGING
~~ ../t/io/layers.t ............................................ FAILED Non-zero exit status: 2 No plan found in TAP output
  [stdio] -Dcc=clang++ -Duse64bitall DEBUGGING
  [stdio] -Dcc=clang++ -Duse64bitall
  [stdio] -Dcc=clang++
  [stdio] -Dcc=clang++ DEBUGGING
  [stdio] -Dcc=clang++ -Duselongdouble
  [stdio] -Dcc=clang++ -Duselongdouble DEBUGGING
~~ ../t/op/oct.t ............................................... FAILED Non-zero exit status: 2 No plan found in TAP output
  [stdio] -Dcc=clang++ -Duse64bitall DEBUGGING
  [stdio] -Dcc=clang++ -Duse64bitall
  [stdio] -Dcc=clang++
  [stdio] -Dcc=clang++ DEBUGGING
  [stdio] -Dcc=clang++ -Duselongdouble
  [stdio] -Dcc=clang++ -Duselongdouble DEBUGGING
~~ ../t/porting/checkcase.t .................................... FAILED Non-zero exit status: 2 No plan found in TAP output
  [stdio] -Dcc=clang++ -Duse64bitall DEBUGGING
  [stdio] -Dcc=clang++ -Duse64bitall
  [stdio] -Dcc=clang++
  [stdio] -Dcc=clang++ DEBUGGING
  [stdio] -Dcc=clang++ -Duselongdouble
  [stdio] -Dcc=clang++ -Duselongdouble DEBUGGING
~~ ../dist/constant/t/constant.t ............................... FAILED Non-zero exit status: 7 Bad plan.  You planned 109 tests but ran 1.
  [stdio] -Dcc=clang++ -Duse64bitall DEBUGGING
  [stdio] -Dcc=clang++ -Duse64bitall
  [stdio] -Dcc=clang++
  [stdio] -Dcc=clang++ DEBUGGING
  [stdio] -Dcc=clang++ -Duselongdouble
  [stdio] -Dcc=clang++ -Duselongdouble DEBUGGING
~~ ../cpan/Test-Simple/t/Test2/acceptance/try_it_todo.t ........ FAILED Non-zero exit status: 255 No plan found in TAP output
  [stdio] -Dcc=clang++ -Duse64bitall DEBUGGING
  [stdio] -Dcc=clang++ -Duse64bitall
  [stdio] -Dcc=clang++
  [stdio] -Dcc=clang++ DEBUGGING
  [stdio] -Dcc=clang++ -Duselongdouble
  [stdio] -Dcc=clang++ -Duselongdouble DEBUGGING
~~ ../t/io/data.t .............................................. FAILED Non-zero exit status: 2 No plan found in TAP output
  [stdio] -Dcc=clang++ -Duse64bitall DEBUGGING
  [stdio] -Dcc=clang++ -Duse64bitall
  [stdio] -Dcc=clang++
  [stdio] -Dcc=clang++ DEBUGGING
  [stdio] -Dcc=clang++ -Duselongdouble
  [stdio] -Dcc=clang++ -Duselongdouble DEBUGGING
~~ ../t/mro/recursion_dfs_utf8.t ............................... FAILED Non-zero exit status: 2 No plan found in TAP output
  [stdio] -Dcc=clang++ -Duse64bitall DEBUGGING
  [stdio] -Dcc=clang++ -Duse64bitall
  [stdio] -Dcc=clang++
  [stdio] -Dcc=clang++ DEBUGGING
  [stdio] -Dcc=clang++ -Duselongdouble
  [stdio] -Dcc=clang++ -Duselongdouble DEBUGGING
~~ ../lib/subs.t ............................................... FAILED Non-zero exit status: 2 No plan found in TAP output
  [stdio] -Dcc=clang++ -Duse64bitall DEBUGGING
  [stdio] -Dcc=clang++ -Duse64bitall
  [stdio] -Dcc=clang++
  [stdio] -Dcc=clang++ DEBUGGING
  [stdio] -Dcc=clang++ -Duselongdouble
  [stdio] -Dcc=clang++ -Duselongdouble DEBUGGING
~~ ../lib/B/Deparse.t .......................................... FAILED 69 279 303 Bad plan.  You planned 315 tests but ran 314.
  [stdio] -Dcc=clang++ -Duse64bitall DEBUGGING
  [stdio] -Dcc=clang++ -Duse64bitall
  [stdio] -Dcc=clang++
  [stdio] -Dcc=clang++ DEBUGGING
  [stdio] -Dcc=clang++ -Duselongdouble
  [stdio] -Dcc=clang++ -Duselongdouble DEBUGGING
~~ ../t/op/attrproto.t ......................................... FAILED Non-zero exit status: 2 No plan found in TAP output
  [stdio] -Dcc=clang++ -Duse64bitall DEBUGGING
  [stdio] -Dcc=clang++ -Duse64bitall
  [stdio] -Dcc=clang++
  [stdio] -Dcc=clang++ DEBUGGING
  [stdio] -Dcc=clang++ -Duselongdouble
  [stdio] -Dcc=clang++ -Duselongdouble DEBUGGING
~~ ../t/uni/readline.t ......................................... FAILED Non-zero exit status: 2 No plan found in TAP output
  [stdio] -Dcc=clang++ -Duse64bitall DEBUGGING
  [stdio] -Dcc=clang++ -Duse64bitall
  [stdio] -Dcc=clang++
  [stdio] -Dcc=clang++ DEBUGGING
  [stdio] -Dcc=clang++ -Duselongdouble
  [stdio] -Dcc=clang++ -Duselongdouble DEBUGGING
~~ ../ext/Hash-Util/t/builtin.t ................................ FAILED 8 Non-zero exit status: 3
  [stdio] -Dcc=clang++ -Duse64bitall DEBUGGING
  [stdio] -Dcc=clang++ -Duse64bitall
  [stdio] -Dcc=clang++
  [stdio] -Dcc=clang++ DEBUGGING
  [stdio] -Dcc=clang++ -Duselongdouble
  [stdio] -Dcc=clang++ -Duselongdouble DEBUGGING
~~ ../t/op/filetest_stack_ok.t ................................. FAILED Non-zero exit status: 2 No plan found in TAP output
  [stdio] -Dcc=clang++ -Duse64bitall DEBUGGING
  [stdio] -Dcc=clang++ -Duse64bitall
  [stdio] -Dcc=clang++
  [stdio] -Dcc=clang++ DEBUGGING
  [stdio] -Dcc=clang++ -Duselongdouble
  [stdio] -Dcc=clang++ -Duselongdouble DEBUGGING
~~ ../cpan/version/t/04strict_lax.t ............................ FAILED Non-zero exit status: 255
  [stdio] -Dcc=clang++ -Duse64bitall DEBUGGING
  [stdio] -Dcc=clang++ -Duse64bitall
  [stdio] -Dcc=clang++
  [stdio] -Dcc=clang++ DEBUGGING
  [stdio] -Dcc=clang++ -Duselongdouble
  [stdio] -Dcc=clang++ -Duselongdouble DEBUGGING
~~ ../t/uni/method.t ........................................... FAILED Non-zero exit status: 2 No plan found in TAP output
  [stdio] -Dcc=clang++ -Duse64bitall DEBUGGING
  [stdio] -Dcc=clang++ -Duse64bitall
  [stdio] -Dcc=clang++
  [stdio] -Dcc=clang++ DEBUGGING
  [stdio] -Dcc=clang++ -Duselongdouble
  [stdio] -Dcc=clang++ -Duselongdouble DEBUGGING
~~ ../cpan/Text-Balanced/t/06_extqlk.t ......................... FAILED Non-zero exit status: 255 Bad plan.  You planned 95 tests but ran 0.
  [stdio] -Dcc=clang++ -Duse64bitall DEBUGGING
  [stdio] -Dcc=clang++ -Duse64bitall
  [stdio] -Dcc=clang++
  [stdio] -Dcc=clang++ DEBUGGING
  [stdio] -Dcc=clang++ -Duselongdouble
  [stdio] -Dcc=clang++ -Duselongdouble DEBUGGING
~~ ../t/op/time.t .............................................. FAILED Non-zero exit status: 2 No plan found in TAP output
  [stdio] -Dcc=clang++ -Duse64bitall DEBUGGING
  [stdio] -Dcc=clang++ -Duse64bitall
  [stdio] -Dcc=clang++
  [stdio] -Dcc=clang++ DEBUGGING
  [stdio] -Dcc=clang++ -Duselongdouble
  [stdio] -Dcc=clang++ -Duselongdouble DEBUGGING
~~ ../t/io/inplace.t ........................................... FAILED Non-zero exit status: 22 No plan found in TAP output
  [stdio] -Dcc=clang++ -Duse64bitall DEBUGGING
  [stdio] -Dcc=clang++ -Duse64bitall
  [stdio] -Dcc=clang++
  [stdio] -Dcc=clang++ DEBUGGING
  [stdio] -Dcc=clang++ -Duselongdouble
  [stdio] -Dcc=clang++ -Duselongdouble DEBUGGING
~~ ../lib/Tie/Array/std.t ...................................... FAILED Non-zero exit status: 2 No plan found in TAP output
  [stdio] -Dcc=clang++ -Duse64bitall DEBUGGING
  [stdio] -Dcc=clang++ -Duse64bitall
  [stdio] -Dcc=clang++
  [stdio] -Dcc=clang++ DEBUGGING
  [stdio] -Dcc=clang++ -Duselongdouble
  [stdio] -Dcc=clang++ -Duselongdouble DEBUGGING
~~ ../t/op/rand.t .............................................. FAILED Non-zero exit status: 2 No plan found in TAP output
  [stdio] -Dcc=clang++ -Duse64bitall DEBUGGING
  [stdio] -Dcc=clang++ -Duse64bitall
  [stdio] -Dcc=clang++
  [stdio] -Dcc=clang++ DEBUGGING
  [stdio] -Dcc=clang++ -Duselongdouble
  [stdio] -Dcc=clang++ -Duselongdouble DEBUGGING
~~ ../ext/XS-APItest/t/xsub_h.t ................................ FAILED Non-zero exit status: 255 No plan found in TAP output
  [stdio] -Dcc=clang++ -Duse64bitall DEBUGGING
  [stdio] -Dcc=clang++ -Duse64bitall
  [stdio] -Dcc=clang++
  [stdio] -Dcc=clang++ DEBUGGING
  [stdio] -Dcc=clang++ -Duselongdouble
  [stdio] -Dcc=clang++ -Duselongdouble DEBUGGING
~~ ../t/run/switchDx.t ......................................... FAILED Non-zero exit status: 2 No plan found in TAP output
  [stdio] -Dcc=clang++ -Duse64bitall DEBUGGING
  [stdio] -Dcc=clang++ -Duse64bitall
  [stdio] -Dcc=clang++
  [stdio] -Dcc=clang++ DEBUGGING
  [stdio] -Dcc=clang++ -Duselongdouble
  [stdio] -Dcc=clang++ -Duselongdouble DEBUGGING
~~ ../t/uni/lower.t ............................................ FAILED Non-zero exit status: 2 No plan found in TAP output
  [stdio] -Dcc=clang++ -Duse64bitall DEBUGGING
  [stdio] -Dcc=clang++ -Duse64bitall
  [stdio] -Dcc=clang++
  [stdio] -Dcc=clang++ DEBUGGING
  [stdio] -Dcc=clang++ -Duselongdouble
  [stdio] -Dcc=clang++ -Duselongdouble DEBUGGING
~~ ../t/re/pat_special_cc.t .................................... FAILED Non-zero exit status: 2 No plan found in TAP output
  [stdio] -Dcc=clang++ -Duse64bitall DEBUGGING
  [stdio] -Dcc=clang++ -Duse64bitall
  [stdio] -Dcc=clang++
  [stdio] -Dcc=clang++ DEBUGGING
  [stdio] -Dcc=clang++ -Duselongdouble
  [stdio] -Dcc=clang++ -Duselongdouble DEBUGGING
~~ ../dist/Storable/t/malice.t ................................. FAILED 8 249 414 Non-zero exit status: 20
  [stdio] -Dcc=clang++ -Duse64bitall DEBUGGING
  [stdio] -Dcc=clang++ -Duse64bitall
  [stdio] -Dcc=clang++
  [stdio] -Dcc=clang++ DEBUGGING
  [stdio] -Dcc=clang++ -Duselongdouble
  [stdio] -Dcc=clang++ -Duselongdouble DEBUGGING
~~ ../t/porting/podcheck.t ..................................... FAILED 299
  [stdio] -Dcc=clang++ -Duse64bitall DEBUGGING
  [stdio] -Dcc=clang++ -Duse64bitall
  [stdio] -Dcc=clang++
  [stdio] -Dcc=clang++ DEBUGGING
  [stdio] -Dcc=clang++ -Duselongdouble
  [stdio] -Dcc=clang++ -Duselongdouble DEBUGGING
~~ ../t/porting/cmp_version.t .................................. FAILED 1-68 162-175 200
  [stdio] -Dcc=clang++ -Duse64bitall DEBUGGING
  [stdio] -Dcc=clang++ -Duse64bitall
  [stdio] -Dcc=clang++
  [stdio] -Dcc=clang++ DEBUGGING
  [stdio] -Dcc=clang++ -Duselongdouble
  [stdio] -Dcc=clang++ -Duselongdouble DEBUGGING
~~ ../t/op/goto.t .............................................. FAILED Non-zero exit status: 2 No plan found in TAP output
  [stdio] -Dcc=clang++ -Duse64bitall DEBUGGING
  [stdio] -Dcc=clang++ -Duse64bitall
  [stdio] -Dcc=clang++
  [stdio] -Dcc=clang++ DEBUGGING
  [stdio] -Dcc=clang++ -Duselongdouble
  [stdio] -Dcc=clang++ -Duselongdouble DEBUGGING
~~ ../t/op/packagev.t .......................................... FAILED Non-zero exit status: 2 No plan found in TAP output
  [stdio] -Dcc=clang++ -Duse64bitall DEBUGGING
  [stdio] -Dcc=clang++ -Duse64bitall
  [stdio] -Dcc=clang++
  [stdio] -Dcc=clang++ DEBUGGING
  [stdio] -Dcc=clang++ -Duselongdouble
  [stdio] -Dcc=clang++ -Duselongdouble DEBUGGING
~~ ../t/op/numconvert.t ........................................ FAILED Non-zero exit status: 2 No plan found in TAP output
  [stdio] -Dcc=clang++ -Duse64bitall DEBUGGING
  [stdio] -Dcc=clang++ -Duse64bitall
  [stdio] -Dcc=clang++
  [stdio] -Dcc=clang++ DEBUGGING
  [stdio] -Dcc=clang++ -Duselongdouble
  [stdio] -Dcc=clang++ -Duselongdouble DEBUGGING
~~ ../cpan/Text-Balanced/t/09_gentag.t ......................... FAILED Non-zero exit status: 255 Bad plan.  You planned 37 tests but ran 0.
  [stdio] -Dcc=clang++ -Duse64bitall DEBUGGING
  [stdio] -Dcc=clang++ -Duse64bitall
  [stdio] -Dcc=clang++
  [stdio] -Dcc=clang++ DEBUGGING
  [stdio] -Dcc=clang++ -Duselongdouble
  [stdio] -Dcc=clang++ -Duselongdouble DEBUGGING
~~ ../t/op/assignwarn.t ........................................ FAILED Non-zero exit status: 2 No plan found in TAP output
  [stdio] -Dcc=clang++ -Duse64bitall DEBUGGING
  [stdio] -Dcc=clang++ -Duse64bitall
  [stdio] -Dcc=clang++
  [stdio] -Dcc=clang++ DEBUGGING
  [stdio] -Dcc=clang++ -Duselongdouble
  [stdio] -Dcc=clang++ -Duselongdouble DEBUGGING
~~ ../lib/B/Deparse-core.t ..................................... FAILED 3823-3840 Non-zero exit status: 18
  [stdio] -Dcc=clang++ -Duse64bitall DEBUGGING
  [stdio] -Dcc=clang++ -Duse64bitall
  [stdio] -Dcc=clang++
  [stdio] -Dcc=clang++ DEBUGGING
  [stdio] -Dcc=clang++ -Duselongdouble
  [stdio] -Dcc=clang++ -Duselongdouble DEBUGGING
~~ ../t/re/subst_amp.t ......................................... FAILED Non-zero exit status: 2 No plan found in TAP output
  [stdio] -Dcc=clang++ -Duse64bitall DEBUGGING
  [stdio] -Dcc=clang++ -Duse64bitall
  [stdio] -Dcc=clang++
  [stdio] -Dcc=clang++ DEBUGGING
  [stdio] -Dcc=clang++ -Duselongdouble
  [stdio] -Dcc=clang++ -Duselongdouble DEBUGGING
~~ ../t/op/cmpchain.t .......................................... FAILED Non-zero exit status: 2 No plan found in TAP output
  [stdio] -Dcc=clang++ -Duse64bitall DEBUGGING
  [stdio] -Dcc=clang++ -Duse64bitall
  [stdio] -Dcc=clang++
  [stdio] -Dcc=clang++ DEBUGGING
  [stdio] -Dcc=clang++ -Duselongdouble
  [stdio] -Dcc=clang++ -Duselongdouble DEBUGGING
~~ ../cpan/Test-Simple/t/Test2/modules/API.t ................... FAILED Non-zero exit status: 255 No plan found in TAP output
  [stdio] -Dcc=clang++ -Duse64bitall DEBUGGING
  [stdio] -Dcc=clang++ -Duse64bitall
  [stdio] -Dcc=clang++
  [stdio] -Dcc=clang++ DEBUGGING
  [stdio] -Dcc=clang++ -Duselongdouble
  [stdio] -Dcc=clang++ -Duselongdouble DEBUGGING
~~ ../t/op/attrhand.t .......................................... FAILED Non-zero exit status: 2 No plan found in TAP output
  [stdio] -Dcc=clang++ -Duse64bitall DEBUGGING
  [stdio] -Dcc=clang++ -Duse64bitall
  [stdio] -Dcc=clang++
  [stdio] -Dcc=clang++ DEBUGGING
  [stdio] -Dcc=clang++ -Duselongdouble
  [stdio] -Dcc=clang++ -Duselongdouble DEBUGGING
~~ ../t/op/join.t .............................................. FAILED Non-zero exit status: 2 No plan found in TAP output
  [stdio] -Dcc=clang++ -Duse64bitall DEBUGGING
  [stdio] -Dcc=clang++ -Duse64bitall
  [stdio] -Dcc=clang++
  [stdio] -Dcc=clang++ DEBUGGING
  [stdio] -Dcc=clang++ -Duselongdouble
  [stdio] -Dcc=clang++ -Duselongdouble DEBUGGING
~~ ../dist/ExtUtils-CBuilder/t/03-cplusplus.t .................. FAILED Non-zero exit status: 255 No plan found in TAP output
  [stdio] -Dcc=clang++ -Duse64bitall DEBUGGING
  [stdio] -Dcc=clang++ -Duse64bitall
  [stdio] -Dcc=clang++
  [stdio] -Dcc=clang++ DEBUGGING
  [stdio] -Dcc=clang++ -Duselongdouble
  [stdio] -Dcc=clang++ -Duselongdouble DEBUGGING
~~ ../t/op/filetest_t.t ........................................ FAILED Non-zero exit status: 2 No plan found in TAP output
  [stdio] -Dcc=clang++ -Duse64bitall DEBUGGING
  [stdio] -Dcc=clang++ -Duse64bitall
  [stdio] -Dcc=clang++
  [stdio] -Dcc=clang++ DEBUGGING
  [stdio] -Dcc=clang++ -Duselongdouble
  [stdio] -Dcc=clang++ -Duselongdouble DEBUGGING
~~ ../t/op/filetest.t .......................................... FAILED Non-zero exit status: 2 No plan found in TAP output
  [stdio] -Dcc=clang++ -Duse64bitall DEBUGGING
  [stdio] -Dcc=clang++ -Duse64bitall
  [stdio] -Dcc=clang++
  [stdio] -Dcc=clang++ DEBUGGING
  [stdio] -Dcc=clang++ -Duselongdouble
  [stdio] -Dcc=clang++ -Duselongdouble DEBUGGING
~~ ../t/mro/recursion_dfs.t .................................... FAILED Non-zero exit status: 2 No plan found in TAP output
  [stdio] -Dcc=clang++ -Duse64bitall DEBUGGING
  [stdio] -Dcc=clang++ -Duse64bitall
  [stdio] -Dcc=clang++
  [stdio] -Dcc=clang++ DEBUGGING
  [stdio] -Dcc=clang++ -Duselongdouble
  [stdio] -Dcc=clang++ -Duselongdouble DEBUGGING
~~ ../t/op/smartmatch.t ........................................ FAILED Non-zero exit status: 2 No plan found in TAP output
  [stdio] -Dcc=clang++ -Duse64bitall DEBUGGING
  [stdio] -Dcc=clang++ -Duse64bitall
  [stdio] -Dcc=clang++
  [stdio] -Dcc=clang++ DEBUGGING
  [stdio] -Dcc=clang++ -Duselongdouble
  [stdio] -Dcc=clang++ -Duselongdouble DEBUGGING
~~ ../dist/Storable/t/downgrade.t .............................. FAILED 13 66-67 125-127 Non-zero exit status: 28
  [stdio] -Dcc=clang++
~~ ../dist/IO/t/io_multihomed.t ................................ FAILED Non-zero exit status: 2 No plan found in TAP output
  [stdio] -Dcc=clang++ -Duse64bitall DEBUGGING
  [stdio] -Dcc=clang++ -Duse64bitall
  [stdio] -Dcc=clang++
  [stdio] -Dcc=clang++ DEBUGGING
  [stdio] -Dcc=clang++ -Duselongdouble
  [stdio] -Dcc=clang++ -Duselongdouble DEBUGGING
~~ ../t/comp/filter_exception.t ................................ FAILED Non-zero exit status: 2 No plan found in TAP output
  [stdio] -Dcc=clang++ -Duse64bitall DEBUGGING
  [stdio] -Dcc=clang++ -Duse64bitall
  [stdio] -Dcc=clang++
  [stdio] -Dcc=clang++ DEBUGGING
  [stdio] -Dcc=clang++ -Duselongdouble
  [stdio] -Dcc=clang++ -Duselongdouble DEBUGGING
~~ ../ext/Sys-Hostname/t/Hostname.t ............................ FAILED Non-zero exit status: 255 No plan found in TAP output
  [stdio] -Dcc=clang++ -Duse64bitall DEBUGGING
  [stdio] -Dcc=clang++ -Duse64bitall
  [stdio] -Dcc=clang++
  [stdio] -Dcc=clang++ DEBUGGING
  [stdio] -Dcc=clang++ -Duselongdouble
  [stdio] -Dcc=clang++ -Duselongdouble DEBUGGING
~~ ../lib/strict.t ............................................. FAILED Non-zero exit status: 2 No plan found in TAP output
  [stdio] -Dcc=clang++ -Duse64bitall DEBUGGING
  [stdio] -Dcc=clang++ -Duse64bitall
  [stdio] -Dcc=clang++
  [stdio] -Dcc=clang++ DEBUGGING
  [stdio] -Dcc=clang++ -Duselongdouble
  [stdio] -Dcc=clang++ -Duselongdouble DEBUGGING
~~ ../ext/Fcntl/t/fcntl.t ...................................... FAILED Non-zero exit status: 2 No plan found in TAP output
  [stdio] -Dcc=clang++ -Duse64bitall DEBUGGING
  [stdio] -Dcc=clang++ -Duse64bitall
  [stdio] -Dcc=clang++
  [stdio] -Dcc=clang++ DEBUGGING
  [stdio] -Dcc=clang++ -Duselongdouble
  [stdio] -Dcc=clang++ -Duselongdouble DEBUGGING
~~ ../cpan/Test-Simple/t/Legacy/subtest/predicate.t ............ FAILED Non-zero exit status: 255 Bad plan.  You planned 5 tests but ran 0.
  [stdio] -Dcc=clang++ -Duse64bitall DEBUGGING
  [stdio] -Dcc=clang++ -Duse64bitall
  [stdio] -Dcc=clang++
  [stdio] -Dcc=clang++ DEBUGGING
  [stdio] -Dcc=clang++ -Duselongdouble
  [stdio] -Dcc=clang++ -Duselongdouble DEBUGGING
~~ ../t/op/filehandle.t ........................................ FAILED Non-zero exit status: 2 No plan found in TAP output
  [stdio] -Dcc=clang++ -Duse64bitall DEBUGGING
  [stdio] -Dcc=clang++ -Duse64bitall
  [stdio] -Dcc=clang++
  [stdio] -Dcc=clang++ DEBUGGING
  [stdio] -Dcc=clang++ -Duselongdouble
  [stdio] -Dcc=clang++ -Duselongdouble DEBUGGING
~~ ../t/mro/pkg_gen.t .......................................... FAILED Non-zero exit status: 2 No plan found in TAP output
  [stdio] -Dcc=clang++ -Duse64bitall DEBUGGING
  [stdio] -Dcc=clang++ -Duse64bitall
  [stdio] -Dcc=clang++
  [stdio] -Dcc=clang++ DEBUGGING
  [stdio] -Dcc=clang++ -Duselongdouble
  [stdio] -Dcc=clang++ -Duselongdouble DEBUGGING
~~ ../t/op/multideref.t ........................................ FAILED Non-zero exit status: 2 No plan found in TAP output
  [stdio] -Dcc=clang++ -Duse64bitall DEBUGGING
  [stdio] -Dcc=clang++ -Duse64bitall
  [stdio] -Dcc=clang++
  [stdio] -Dcc=clang++ DEBUGGING
  [stdio] -Dcc=clang++ -Duselongdouble
  [stdio] -Dcc=clang++ -Duselongdouble DEBUGGING
~~ ../t/op/catch.t ............................................. FAILED Non-zero exit status: 2 No plan found in TAP output
  [stdio] -Dcc=clang++ -Duse64bitall DEBUGGING
  [stdio] -Dcc=clang++ -Duse64bitall
  [stdio] -Dcc=clang++
  [stdio] -Dcc=clang++ DEBUGGING
  [stdio] -Dcc=clang++ -Duselongdouble
  [stdio] -Dcc=clang++ -Duselongdouble DEBUGGING
~~ ../t/op/hashassign.t ........................................ FAILED Non-zero exit status: 2 No plan found in TAP output
  [stdio] -Dcc=clang++ -Duse64bitall DEBUGGING
  [stdio] -Dcc=clang++ -Duse64bitall
  [stdio] -Dcc=clang++
  [stdio] -Dcc=clang++ DEBUGGING
  [stdio] -Dcc=clang++ -Duselongdouble
  [stdio] -Dcc=clang++ -Duselongdouble DEBUGGING
~~ ../t/run/switches.t ......................................... FAILED Non-zero exit status: 2 No plan found in TAP output
  [stdio] -Dcc=clang++ -Duse64bitall DEBUGGING
  [stdio] -Dcc=clang++ -Duse64bitall
  [stdio] -Dcc=clang++
  [stdio] -Dcc=clang++ DEBUGGING
  [stdio] -Dcc=clang++ -Duselongdouble
  [stdio] -Dcc=clang++ -Duselongdouble DEBUGGING
~~ ../t/op/require_override.t .................................. FAILED Non-zero exit status: 2 No plan found in TAP output
  [stdio] -Dcc=clang++ -Duse64bitall DEBUGGING
  [stdio] -Dcc=clang++ -Duse64bitall
  [stdio] -Dcc=clang++
  [stdio] -Dcc=clang++ DEBUGGING
  [stdio] -Dcc=clang++ -Duselongdouble
  [stdio] -Dcc=clang++ -Duselongdouble DEBUGGING
~~ ../ext/File-Glob/t/threads.t ................................ FAILED Non-zero exit status: 2 No plan found in TAP output
  [stdio] -Dcc=clang++ -Duse64bitall DEBUGGING
  [stdio] -Dcc=clang++ -Duse64bitall
  [stdio] -Dcc=clang++
  [stdio] -Dcc=clang++ DEBUGGING
  [stdio] -Dcc=clang++ -Duselongdouble
  [stdio] -Dcc=clang++ -Duselongdouble DEBUGGING
~~ ../t/uni/lex_utf8.t ......................................... FAILED Non-zero exit status: 2 No plan found in TAP output
  [stdio] -Dcc=clang++ -Duse64bitall DEBUGGING
  [stdio] -Dcc=clang++ -Duse64bitall
  [stdio] -Dcc=clang++
  [stdio] -Dcc=clang++ DEBUGGING
  [stdio] -Dcc=clang++ -Duselongdouble
  [stdio] -Dcc=clang++ -Duselongdouble DEBUGGING
~~ ../t/run/switchF.t .......................................... FAILED Non-zero exit status: 2 No plan found in TAP output
  [stdio] -Dcc=clang++ -Duse64bitall DEBUGGING
  [stdio] -Dcc=clang++ -Duse64bitall
  [stdio] -Dcc=clang++
  [stdio] -Dcc=clang++ DEBUGGING
  [stdio] -Dcc=clang++ -Duselongdouble
  [stdio] -Dcc=clang++ -Duselongdouble DEBUGGING
~~ ../t/op/fresh_perl_utf8.t ................................... FAILED Non-zero exit status: 2 No plan found in TAP output
  [stdio] -Dcc=clang++ -Duse64bitall DEBUGGING
  [stdio] -Dcc=clang++ -Duse64bitall
  [stdio] -Dcc=clang++
  [stdio] -Dcc=clang++ DEBUGGING
  [stdio] -Dcc=clang++ -Duselongdouble
  [stdio] -Dcc=clang++ -Duselongdouble DEBUGGING
~~ ../cpan/Test-Simple/t/Test2/legacy/TAP.t .................... FAILED Non-zero exit status: 255 No plan found in TAP output
  [stdio] -Dcc=clang++ -Duse64bitall DEBUGGING
  [stdio] -Dcc=clang++ -Duse64bitall
  [stdio] -Dcc=clang++
  [stdio] -Dcc=clang++ DEBUGGING
  [stdio] -Dcc=clang++ -Duselongdouble
  [stdio] -Dcc=clang++ -Duselongdouble DEBUGGING
~~ ../ext/File-Glob/t/basic.t .................................. FAILED Non-zero exit status: 2 No plan found in TAP output
  [stdio] -Dcc=clang++ -Duse64bitall DEBUGGING
  [stdio] -Dcc=clang++ -Duse64bitall
  [stdio] -Dcc=clang++
  [stdio] -Dcc=clang++ DEBUGGING
  [stdio] -Dcc=clang++ -Duselongdouble
  [stdio] -Dcc=clang++ -Duselongdouble DEBUGGING
~~ ../t/re/speed_thr.t ......................................... FAILED Non-zero exit status: 2 No plan found in TAP output
  [stdio] -Dcc=clang++ -Duse64bitall DEBUGGING
  [stdio] -Dcc=clang++ -Duse64bitall
  [stdio] -Dcc=clang++
  [stdio] -Dcc=clang++ DEBUGGING
  [stdio] -Dcc=clang++ -Duselongdouble
  [stdio] -Dcc=clang++ -Duselongdouble DEBUGGING
~~ ../t/op/qr.t ................................................ FAILED Non-zero exit status: 2 No plan found in TAP output
  [stdio] -Dcc=clang++ -Duse64bitall DEBUGGING
  [stdio] -Dcc=clang++ -Duse64bitall
  [stdio] -Dcc=clang++
  [stdio] -Dcc=clang++ DEBUGGING
  [stdio] -Dcc=clang++ -Duselongdouble
  [stdio] -Dcc=clang++ -Duselongdouble DEBUGGING
~~ ../t/io/tell.t .............................................. FAILED Non-zero exit status: 2 No plan found in TAP output
  [stdio] -Dcc=clang++ -Duse64bitall DEBUGGING
  [stdio] -Dcc=clang++ -Duse64bitall
  [stdio] -Dcc=clang++
  [stdio] -Dcc=clang++ DEBUGGING
  [stdio] -Dcc=clang++ -Duselongdouble
  [stdio] -Dcc=clang++ -Duselongdouble DEBUGGING
~~ ../dist/autouse/t/autouse.t ................................. FAILED Non-zero exit status: 255 Bad plan.  You planned 15 tests but ran 0.
  [stdio] -Dcc=clang++ -Duse64bitall DEBUGGING
  [stdio] -Dcc=clang++ -Duse64bitall
  [stdio] -Dcc=clang++
  [stdio] -Dcc=clang++ DEBUGGING
  [stdio] -Dcc=clang++ -Duselongdouble
  [stdio] -Dcc=clang++ -Duselongdouble DEBUGGING
~~ ../t/op/const-optree.t ...................................... FAILED Non-zero exit status: 2 No plan found in TAP output
  [stdio] -Dcc=clang++ -Duse64bitall DEBUGGING
  [stdio] -Dcc=clang++ -Duse64bitall
  [stdio] -Dcc=clang++
  [stdio] -Dcc=clang++ DEBUGGING
  [stdio] -Dcc=clang++ -Duselongdouble
  [stdio] -Dcc=clang++ -Duselongdouble DEBUGGING
~~ ../t/uni/parser.t ........................................... FAILED Non-zero exit status: 2 No plan found in TAP output
  [stdio] -Dcc=clang++ -Duse64bitall DEBUGGING
  [stdio] -Dcc=clang++ -Duse64bitall
  [stdio] -Dcc=clang++
  [stdio] -Dcc=clang++ DEBUGGING
  [stdio] -Dcc=clang++ -Duselongdouble
  [stdio] -Dcc=clang++ -Duselongdouble DEBUGGING
~~ ../t/op/index_thr.t ......................................... FAILED Non-zero exit status: 2 No plan found in TAP output
  [stdio] -Dcc=clang++ -Duse64bitall DEBUGGING
  [stdio] -Dcc=clang++ -Duse64bitall
  [stdio] -Dcc=clang++
  [stdio] -Dcc=clang++ DEBUGGING
  [stdio] -Dcc=clang++ -Duselongdouble
  [stdio] -Dcc=clang++ -Duselongdouble DEBUGGING
~~ ../cpan/Test-Simple/t/Legacy/exit.t ......................... FAILED 1-258
  [stdio] -Dcc=clang++
  [stdio] -Dcc=clang++ -Duselongdouble
~~ ../t/op/current_sub.t ....................................... FAILED Non-zero exit status: 2 No plan found in TAP output
  [stdio] -Dcc=clang++ -Duse64bitall DEBUGGING
  [stdio] -Dcc=clang++ -Duse64bitall
  [stdio] -Dcc=clang++
  [stdio] -Dcc=clang++ DEBUGGING
  [stdio] -Dcc=clang++ -Duselongdouble
  [stdio] -Dcc=clang++ -Duselongdouble DEBUGGING
~~ ../lib/proxy_constant_subs.t ................................ FAILED Non-zero exit status: 2 No plan found in TAP output
  [stdio] -Dcc=clang++ -Duse64bitall DEBUGGING
  [stdio] -Dcc=clang++ -Duse64bitall
  [stdio] -Dcc=clang++
  [stdio] -Dcc=clang++ DEBUGGING
  [stdio] -Dcc=clang++ -Duselongdouble
  [stdio] -Dcc=clang++ -Duselongdouble DEBUGGING
~~ ../t/io/nargv.t ............................................. FAILED Non-zero exit status: 2 No plan found in TAP output
  [stdio] -Dcc=clang++ -Duse64bitall DEBUGGING
  [stdio] -Dcc=clang++ -Duse64bitall
  [stdio] -Dcc=clang++
  [stdio] -Dcc=clang++ DEBUGGING
  [stdio] -Dcc=clang++ -Duselongdouble
  [stdio] -Dcc=clang++ -Duselongdouble DEBUGGING
~~ ../cpan/Test-Simple/t/Legacy/exit.t ......................... FAILED 1-260
  [stdio] -Dcc=clang++ -Duselongdouble DEBUGGING
~~ ../t/uni/opcroak.t .......................................... FAILED Non-zero exit status: 2 No plan found in TAP output
  [stdio] -Dcc=clang++ -Duse64bitall DEBUGGING
  [stdio] -Dcc=clang++ -Duse64bitall
  [stdio] -Dcc=clang++
  [stdio] -Dcc=clang++ DEBUGGING
  [stdio] -Dcc=clang++ -Duselongdouble
  [stdio] -Dcc=clang++ -Duselongdouble DEBUGGING
~~ ../lib/no_load.t ............................................ FAILED Non-zero exit status: 2 No plan found in TAP output
  [stdio] -Dcc=clang++ -Duse64bitall DEBUGGING
  [stdio] -Dcc=clang++ -Duse64bitall
  [stdio] -Dcc=clang++
  [stdio] -Dcc=clang++ DEBUGGING
  [stdio] -Dcc=clang++ -Duselongdouble
  [stdio] -Dcc=clang++ -Duselongdouble DEBUGGING
~~ ../t/uni/class.t ............................................ FAILED Non-zero exit status: 2 No plan found in TAP output
  [stdio] -Dcc=clang++ -Duse64bitall DEBUGGING
  [stdio] -Dcc=clang++ -Duse64bitall
  [stdio] -Dcc=clang++
  [stdio] -Dcc=clang++ DEBUGGING
  [stdio] -Dcc=clang++ -Duselongdouble
  [stdio] -Dcc=clang++ -Duselongdouble DEBUGGING
~~ ../t/io/perlio.t ............................................ FAILED Non-zero exit status: 2 No plan found in TAP output
  [stdio] -Dcc=clang++ -Duse64bitall DEBUGGING
  [stdio] -Dcc=clang++ -Duse64bitall
  [stdio] -Dcc=clang++
  [stdio] -Dcc=clang++ DEBUGGING
  [stdio] -Dcc=clang++ -Duselongdouble
  [stdio] -Dcc=clang++ -Duselongdouble DEBUGGING
~~ ../t/op/inccode-tie.t ....................................... FAILED Non-zero exit status: 2 No plan found in TAP output
  [stdio] -Dcc=clang++ -Duse64bitall DEBUGGING
  [stdio] -Dcc=clang++ -Duse64bitall
  [stdio] -Dcc=clang++
  [stdio] -Dcc=clang++ DEBUGGING
  [stdio] -Dcc=clang++ -Duselongdouble
  [stdio] -Dcc=clang++ -Duselongdouble DEBUGGING
~~ ../cpan/Test-Simple/t/Test2/acceptance/try_it_no_plan.t ..... FAILED Non-zero exit status: 255 No plan found in TAP output
  [stdio] -Dcc=clang++ -Duse64bitall DEBUGGING
  [stdio] -Dcc=clang++ -Duse64bitall
  [stdio] -Dcc=clang++
  [stdio] -Dcc=clang++ DEBUGGING
  [stdio] -Dcc=clang++ -Duselongdouble
  [stdio] -Dcc=clang++ -Duselongdouble DEBUGGING
~~ ../t/op/decl-refs.t ......................................... FAILED Non-zero exit status: 2 No plan found in TAP output
  [stdio] -Dcc=clang++ -Duse64bitall DEBUGGING
  [stdio] -Dcc=clang++ -Duse64bitall
  [stdio] -Dcc=clang++
  [stdio] -Dcc=clang++ DEBUGGING
  [stdio] -Dcc=clang++ -Duselongdouble
  [stdio] -Dcc=clang++ -Duselongdouble DEBUGGING
~~ ../t/op/hash.t .............................................. FAILED Non-zero exit status: 2 No plan found in TAP output
  [stdio] -Dcc=clang++ -Duse64bitall DEBUGGING
  [stdio] -Dcc=clang++ -Duse64bitall
  [stdio] -Dcc=clang++
  [stdio] -Dcc=clang++ DEBUGGING
  [stdio] -Dcc=clang++ -Duselongdouble
  [stdio] -Dcc=clang++ -Duselongdouble DEBUGGING
~~ ../ext/File-DosGlob/t/DosGlob.t ............................. FAILED Non-zero exit status: 255 Bad plan.  You planned 21 tests but ran 0.
  [stdio] -Dcc=clang++ -Duse64bitall DEBUGGING
  [stdio] -Dcc=clang++ -Duse64bitall
  [stdio] -Dcc=clang++
  [stdio] -Dcc=clang++ DEBUGGING
  [stdio] -Dcc=clang++ -Duselongdouble
  [stdio] -Dcc=clang++ -Duselongdouble DEBUGGING

Test todo-passed:
~~ ../dist/Safe/t/safesort.t ................................... PASSED 10
  [stdio] -Dcc=clang++ -Duse64bitall DEBUGGING
  [stdio] -Dcc=clang++ -Duse64bitall
  [stdio] -Dcc=clang++
  [stdio] -Dcc=clang++ DEBUGGING
  [stdio] -Dcc=clang++ -Duselongdouble
  [stdio] -Dcc=clang++ -Duselongdouble DEBUGGING

MANIFEST messages:
  MANIFEST did not declare '.mailmap'

Compiler messages:
  sv.c:12559:41: warning: adding 'int' to a string does not append to the string [-Wstring-plus-int]
  ./handy.h:545:37: note: expanded from macro 'strnEQ'
  sv.c:12559:41: note: use array indexing to silence this warning
  locale.c:1748:27: warning: array subscript is of type 'char' [-Wchar-subscripts]
  locale.c:1749:27: warning: array subscript is of type 'char' [-Wchar-subscripts]
  DynaLoader.c:547:1: warning: duplicate 'extern' declaration specifier [-Wduplicate-decl-specifier]
  ../../XSUB.h:134:29: note: expanded from macro 'XS_EXTERNAL'
  B.c:3518:1: warning: duplicate 'extern' declaration specifier [-Wduplicate-decl-specifier]
  Bzip2.c:1669:1: warning: duplicate 'extern' declaration specifier [-Wduplicate-decl-specifier]
  compress.c:190:13: warning: 'register' storage class specifier is deprecated and incompatible with C++17 [-Wdeprecated-register]
  compress.c:191:13: warning: 'register' storage class specifier is deprecated and incompatible with C++17 [-Wdeprecated-register]
  compress.c:192:13: warning: 'register' storage class specifier is deprecated and incompatible with C++17 [-Wdeprecated-register]
  compress.c:198:16: warning: 'register' storage class specifier is deprecated and incompatible with C++17 [-Wdeprecated-register]
  compress.c:361:13: warning: 'register' storage class specifier is deprecated and incompatible with C++17 [-Wdeprecated-register]
  compress.c:362:13: warning: 'register' storage class specifier is deprecated and incompatible with C++17 [-Wdeprecated-register]
  Zlib.c:3713:1: warning: duplicate 'extern' declaration specifier [-Wduplicate-decl-specifier]
  deflate.c:1243:5: warning: 'register' storage class specifier is deprecated and incompatible with C++17 [-Wdeprecated-register]
  deflate.c:1244:5: warning: 'register' storage class specifier is deprecated and incompatible with C++17 [-Wdeprecated-register]
  deflate.c:1245:5: warning: 'register' storage class specifier is deprecated and incompatible with C++17 [-Wdeprecated-register]
  deflate.c:1264:5: warning: 'register' storage class specifier is deprecated and incompatible with C++17 [-Wdeprecated-register]
  deflate.c:1265:5: warning: 'register' storage class specifier is deprecated and incompatible with C++17 [-Wdeprecated-register]
  deflate.c:1266:5: warning: 'register' storage class specifier is deprecated and incompatible with C++17 [-Wdeprecated-register]
  deflate.c:54:12: warning: unused variable 'deflate_copyright' [-Wunused-const-variable]
  inftrees.c:11:12: warning: unused variable 'inflate_copyright' [-Wunused-const-variable]
  trees.c:1164:5: warning: 'register' storage class specifier is deprecated and incompatible with C++17 [-Wdeprecated-register]
  Cwd.c:1079:1: warning: duplicate 'extern' declaration specifier [-Wduplicate-decl-specifier]
  DB_File.c:3067:1: warning: duplicate 'extern' declaration specifier [-Wduplicate-decl-specifier]
  Dumper.c:1930:1: warning: duplicate 'extern' declaration specifier [-Wduplicate-decl-specifier]
  RealPPPort.c:8185:1: warning: duplicate 'extern' declaration specifier [-Wduplicate-decl-specifier]
  Peek.c:840:1: warning: duplicate 'extern' declaration specifier [-Wduplicate-decl-specifier]
  MD5.c:1054:1: warning: duplicate 'extern' declaration specifier [-Wduplicate-decl-specifier]
  SHA.c:723:1: warning: duplicate 'extern' declaration specifier [-Wduplicate-decl-specifier]
  Encode.c:1581:1: warning: duplicate 'extern' declaration specifier [-Wduplicate-decl-specifier]
  Byte.c:187:1: warning: duplicate 'extern' declaration specifier [-Wduplicate-decl-specifier]
  ../../../XSUB.h:134:29: note: expanded from macro 'XS_EXTERNAL'
  CN.c:192:1: warning: duplicate 'extern' declaration specifier [-Wduplicate-decl-specifier]
  EBCDIC.c:187:1: warning: duplicate 'extern' declaration specifier [-Wduplicate-decl-specifier]
  JP.c:193:1: warning: duplicate 'extern' declaration specifier [-Wduplicate-decl-specifier]
  KR.c:191:1: warning: duplicate 'extern' declaration specifier [-Wduplicate-decl-specifier]
  Symbol.c:187:1: warning: duplicate 'extern' declaration specifier [-Wduplicate-decl-specifier]
  TW.c:190:1: warning: duplicate 'extern' declaration specifier [-Wduplicate-decl-specifier]
  Unicode.c:704:1: warning: duplicate 'extern' declaration specifier [-Wduplicate-decl-specifier]
  Fcntl.c:316:1: warning: duplicate 'extern' declaration specifier [-Wduplicate-decl-specifier]
  DosGlob.c:208:1: warning: duplicate 'extern' declaration specifier [-Wduplicate-decl-specifier]
  Glob.c:706:1: warning: duplicate 'extern' declaration specifier [-Wduplicate-decl-specifier]
  Call.c:464:1: warning: duplicate 'extern' declaration specifier [-Wduplicate-decl-specifier]
  Util.c:720:1: warning: duplicate 'extern' declaration specifier [-Wduplicate-decl-specifier]
  FieldHash.c:718:1: warning: duplicate 'extern' declaration specifier [-Wduplicate-decl-specifier]
  Langinfo.c:313:1: warning: duplicate 'extern' declaration specifier [-Wduplicate-decl-specifier]
  IO.c:1000:1: warning: duplicate 'extern' declaration specifier [-Wduplicate-decl-specifier]
  SysV.c:829:1: warning: duplicate 'extern' declaration specifier [-Wduplicate-decl-specifier]
  ListUtil.c:2512:1: warning: duplicate 'extern' declaration specifier [-Wduplicate-decl-specifier]
  Base64.xs:189:2: warning: 'register' storage class specifier is deprecated and incompatible with C++17 [-Wdeprecated-register]
  Base64.xs:285:2: warning: 'register' storage class specifier is deprecated and incompatible with C++17 [-Wdeprecated-register]
  Base64.c:728:1: warning: duplicate 'extern' declaration specifier [-Wduplicate-decl-specifier]
  FastCalc.c:628:1: warning: duplicate 'extern' declaration specifier [-Wduplicate-decl-specifier]
  NDBM_File.c:601:1: warning: duplicate 'extern' declaration specifier [-Wduplicate-decl-specifier]
  Opcode.c:867:1: warning: duplicate 'extern' declaration specifier [-Wduplicate-decl-specifier]
  POSIX.c:5685:1: warning: duplicate 'extern' declaration specifier [-Wduplicate-decl-specifier]
  encoding.c:792:1: warning: duplicate 'extern' declaration specifier [-Wduplicate-decl-specifier]
  mmap.c:449:1: warning: duplicate 'extern' declaration specifier [-Wduplicate-decl-specifier]
  scalar.c:601:1: warning: duplicate 'extern' declaration specifier [-Wduplicate-decl-specifier]
  via.c:843:1: warning: duplicate 'extern' declaration specifier [-Wduplicate-decl-specifier]
  SDBM_File.c:583:1: warning: duplicate 'extern' declaration specifier [-Wduplicate-decl-specifier]
  Socket.c:1848:1: warning: duplicate 'extern' declaration specifier [-Wduplicate-decl-specifier]
  Storable.c:8166:1: warning: duplicate 'extern' declaration specifier [-Wduplicate-decl-specifier]
  Hostname.c:243:1: warning: duplicate 'extern' declaration specifier [-Wduplicate-decl-specifier]
  Syslog.c:532:1: warning: duplicate 'extern' declaration specifier [-Wduplicate-decl-specifier]
  ./const-c.inc:351:42: warning: unused parameter 'iv_return' [-Wunused-parameter]
  HiRes.c:2370:1: warning: duplicate 'extern' declaration specifier [-Wduplicate-decl-specifier]
  Piece.c:1424:1: warning: duplicate 'extern' declaration specifier [-Wduplicate-decl-specifier]
  Collate.c:1048:1: warning: duplicate 'extern' declaration specifier [-Wduplicate-decl-specifier]
  Normalize.c:1289:1: warning: duplicate 'extern' declaration specifier [-Wduplicate-decl-specifier]
  APItest.c:3281:2: warning: 'Perl_ptr_table_clear' is deprecated [-Wdeprecated-declarations]
  ../../embed.h:444:28: note: expanded from macro 'ptr_table_clear'
  ../../proto.h:2736:4: note: 'Perl_ptr_table_clear' has been explicitly marked deprecated here
  ../../perl.h:356:60: note: expanded from macro '__attribute__deprecated__'
  APItest.c:13869:1: warning: duplicate 'extern' declaration specifier [-Wduplicate-decl-specifier]
  XSUB-undef-XS_VERSION.c:194:1: warning: duplicate 'extern' declaration specifier [-Wduplicate-decl-specifier]
  XSUB-redefined-macros.c:216:1: warning: duplicate 'extern' declaration specifier [-Wduplicate-decl-specifier]
  Typemap.c:1919:1: warning: duplicate 'extern' declaration specifier [-Wduplicate-decl-specifier]
  attributes.c:465:1: warning: duplicate 'extern' declaration specifier [-Wduplicate-decl-specifier]
  mro.c:928:1: warning: duplicate 'extern' declaration specifier [-Wduplicate-decl-specifier]
  re.c:328:1: warning: duplicate 'extern' declaration specifier [-Wduplicate-decl-specifier]
  threads.c:2195:1: warning: duplicate 'extern' declaration specifier [-Wduplicate-decl-specifier]
  shared.c:2147:1: warning: duplicate 'extern' declaration specifier [-Wduplicate-decl-specifier]
  ExtTest.c:660:1: warning: duplicate 'extern' declaration specifier [-Wduplicate-decl-specifier]
  ../../../../XSUB.h:134:29: note: expanded from macro 'XS_EXTERNAL'
  ExtTest.c:356:1: warning: duplicate 'extern' declaration specifier [-Wduplicate-decl-specifier]
  ExtTest.c:442:1: warning: duplicate 'extern' declaration specifier [-Wduplicate-decl-specifier]
  ExtTest.c:376:1: warning: duplicate 'extern' declaration specifier [-Wduplicate-decl-specifier]
  ExtTest.c:460:1: warning: duplicate 'extern' declaration specifier [-Wduplicate-decl-specifier]
  ExtTest.c:441:1: warning: duplicate 'extern' declaration specifier [-Wduplicate-decl-specifier]
  ExtTest.c:417:1: warning: duplicate 'extern' declaration specifier [-Wduplicate-decl-specifier]
  XSTest.c:340:1: warning: duplicate 'extern' declaration specifier [-Wduplicate-decl-specifier]
  /home/core/smoke/perl-current/XSUB.h:134:29: note: expanded from macro 'XS_EXTERNAL'
  XSMore.c:525:1: warning: duplicate 'extern' declaration specifier [-Wduplicate-decl-specifier]
  XSUsage.c:301:1: warning: duplicate 'extern' declaration specifier [-Wduplicate-decl-specifier]
  Storable.xs:2585:69: warning: format specifies type 'double' but the argument has type 'NV_bytes' [-Wformat]
  Storable.xs:131:30: note: expanded from macro 'TRACEME'
  Storable.xs:2585:69: warning: format specifies type 'long double' but the argument has type 'NV_bytes' [-Wformat]
  Storable.xs:2921:9: error: cannot initialize a variable of type 'PerlInterpreter *' (aka 'interpreter *') with an rvalue of type 'void *'
  Storable.xs:1363:26: note: expanded from macro 'STORE_HASH_SORT'

About this smoke:
    smoking-perl: 5.30.2
  smoker-version: 1.71/0.046
       timestamp: 2020-07-11 20:05:43+00
          tester: core

-- 
Report generated by Test::Smoke::Gateway v0.09_01