Show logfile
Automated smoke report for branch smoke-me/jkeenan/sugar-magnolia 7.0.0 patch 39568decb91df7e01426bdd32a20f626e3953186 v5.32.0-586-g39568decb9
remote.local: ARMv7 Processor rev 3 (v7l) (300 MHz) (armv7l/4 cpus)
    on        linux 4.19.97-v7l+ [Raspbian GNU/Linux 10.3]
    using     ccache gcc version 8.3.0 (*1)
    smoketime 5 hours 44 minutes (average 1 hour 26 minutes)

Summary: FAIL(F)

O = OK  F = Failure(s), extended report at the bottom
X = Failure(s) under TEST but not under harness
? = still running or test results not (yet) available
Build failures during:       - = unknown or N/A
c = Configure, m = make, M = make (after miniperl), t = make test-prep

v5.32.0-586-g39568decb9
---------------------- ----------------------------------------------------
F  F                    -Dcc="ccache gcc" -Accflags="-Werror=declaration-after-statement" (*1)
F  F                    -Dcc="ccache gcc" -Accflags="-Werror=declaration-after-statement" -Duseithreads (*1)
|  |
|  +------------------  stdio DEBUGGING
+---------------------  stdio

Applied patches:
  SMOKE39568decb91df7e01426bdd32a20f626e3953186

Skipped tests:
  None

Test failures:
~~ ../cpan/Pod-Usage/t/pod/selectsections.t .................... FAILED 1-2 Non-zero exit status: 2
  [stdio] -Dcc="ccache gcc" -Accflags="-Werror=declaration-after-statement" -Duseithreads
  [stdio] -Dcc="ccache gcc" -Accflags="-Werror=declaration-after-statement" -Duseithreads DEBUGGING
~~ ../cpan/Tie-RefHash/t/storable.t ............................ FAILED Non-zero exit status: 255 No plan found in TAP output
  [stdio] -Dcc="ccache gcc" -Accflags="-Werror=declaration-after-statement" DEBUGGING
  [stdio] -Dcc="ccache gcc" -Accflags="-Werror=declaration-after-statement"
~~ ../cpan/Test-Simple/t/Legacy/Builder/current_test.t ......... FAILED Non-zero exit status: 255 No plan found in TAP output
  [stdio] -Dcc="ccache gcc" -Accflags="-Werror=declaration-after-statement" -Duseithreads
  [stdio] -Dcc="ccache gcc" -Accflags="-Werror=declaration-after-statement" DEBUGGING
  [stdio] -Dcc="ccache gcc" -Accflags="-Werror=declaration-after-statement"
  [stdio] -Dcc="ccache gcc" -Accflags="-Werror=declaration-after-statement" -Duseithreads DEBUGGING
~~ ../t/re/pat_special_cc_thr.t ................................ FAILED Non-zero exit status: 255 No plan found in TAP output
  [stdio] -Dcc="ccache gcc" -Accflags="-Werror=declaration-after-statement" -Duseithreads
  [stdio] -Dcc="ccache gcc" -Accflags="-Werror=declaration-after-statement" -Duseithreads DEBUGGING
~~ ../cpan/Test-Simple/t/Legacy/Regression/736_use_ok.t ........ FAILED Non-zero exit status: 255 No plan found in TAP output
  [stdio] -Dcc="ccache gcc" -Accflags="-Werror=declaration-after-statement" -Duseithreads
  [stdio] -Dcc="ccache gcc" -Accflags="-Werror=declaration-after-statement" DEBUGGING
  [stdio] -Dcc="ccache gcc" -Accflags="-Werror=declaration-after-statement"
  [stdio] -Dcc="ccache gcc" -Accflags="-Werror=declaration-after-statement" -Duseithreads DEBUGGING
~~ ../dist/Thread-Semaphore/t/06_timed.t ....................... FAILED Non-zero exit status: 255 No plan found in TAP output
  [stdio] -Dcc="ccache gcc" -Accflags="-Werror=declaration-after-statement" -Duseithreads
  [stdio] -Dcc="ccache gcc" -Accflags="-Werror=declaration-after-statement" -Duseithreads DEBUGGING
~~ ../cpan/Test-Simple/t/Test2/behavior/err_var.t .............. FAILED No plan found in TAP output
  [stdio] -Dcc="ccache gcc" -Accflags="-Werror=declaration-after-statement" -Duseithreads
  [stdio] -Dcc="ccache gcc" -Accflags="-Werror=declaration-after-statement" -Duseithreads DEBUGGING
~~ ../dist/Storable/t/restrict.t ............................... FAILED No plan found in TAP output
  [stdio] -Dcc="ccache gcc" -Accflags="-Werror=declaration-after-statement" -Duseithreads
  [stdio] -Dcc="ccache gcc" -Accflags="-Werror=declaration-after-statement" -Duseithreads DEBUGGING
~~ ../ext/POSIX/t/posix.t ...................................... FAILED Non-zero exit status: 255 No plan found in TAP output
  [stdio] -Dcc="ccache gcc" -Accflags="-Werror=declaration-after-statement" -Duseithreads
  [stdio] -Dcc="ccache gcc" -Accflags="-Werror=declaration-after-statement" DEBUGGING
  [stdio] -Dcc="ccache gcc" -Accflags="-Werror=declaration-after-statement"
  [stdio] -Dcc="ccache gcc" -Accflags="-Werror=declaration-after-statement" -Duseithreads DEBUGGING
~~ ../lib/Pod/t/Usage.t ........................................ FAILED Bad plan.  You planned 8 tests but ran 0.
  [stdio] -Dcc="ccache gcc" -Accflags="-Werror=declaration-after-statement" -Duseithreads
  [stdio] -Dcc="ccache gcc" -Accflags="-Werror=declaration-after-statement" -Duseithreads DEBUGGING
~~ ../cpan/Encode/t/jis7-fallback.t ............................ FAILED No plan found in TAP output
  [stdio] -Dcc="ccache gcc" -Accflags="-Werror=declaration-after-statement" -Duseithreads
  [stdio] -Dcc="ccache gcc" -Accflags="-Werror=declaration-after-statement" -Duseithreads DEBUGGING
~~ ../cpan/Encode/t/at-tw.t .................................... FAILED Bad plan.  You planned 17 tests but ran 0.
  [stdio] -Dcc="ccache gcc" -Accflags="-Werror=declaration-after-statement" -Duseithreads
  [stdio] -Dcc="ccache gcc" -Accflags="-Werror=declaration-after-statement" -Duseithreads DEBUGGING
~~ ../cpan/Pod-Simple/t/encod04.t .............................. FAILED Bad plan.  You planned 6 tests but ran 1.
  [stdio] -Dcc="ccache gcc" -Accflags="-Werror=declaration-after-statement" -Duseithreads
  [stdio] -Dcc="ccache gcc" -Accflags="-Werror=declaration-after-statement" -Duseithreads DEBUGGING
~~ ../cpan/Test-Simple/t/Legacy/threads.t ...................... FAILED Non-zero exit status: 255 No plan found in TAP output
  [stdio] -Dcc="ccache gcc" -Accflags="-Werror=declaration-after-statement" -Duseithreads
  [stdio] -Dcc="ccache gcc" -Accflags="-Werror=declaration-after-statement" -Duseithreads DEBUGGING
~~ ../dist/Storable/t/retrieve.t ............................... FAILED No plan found in TAP output
  [stdio] -Dcc="ccache gcc" -Accflags="-Werror=declaration-after-statement" -Duseithreads
  [stdio] -Dcc="ccache gcc" -Accflags="-Werror=declaration-after-statement" -Duseithreads DEBUGGING
~~ ../cpan/ExtUtils-MakeMaker/t/test_boilerplate.t ............. FAILED No plan found in TAP output
  [stdio] -Dcc="ccache gcc" -Accflags="-Werror=declaration-after-statement" -Duseithreads
  [stdio] -Dcc="ccache gcc" -Accflags="-Werror=declaration-after-statement" -Duseithreads DEBUGGING
~~ ../cpan/ExtUtils-MakeMaker/t/min_perl_version.t ............. FAILED 16 Non-zero exit status: 1
  [stdio] -Dcc="ccache gcc" -Accflags="-Werror=declaration-after-statement" DEBUGGING
  [stdio] -Dcc="ccache gcc" -Accflags="-Werror=declaration-after-statement"
~~ ../dist/threads-shared/t/object2.t .......................... FAILED Non-zero exit status: 255 Bad plan.  You planned 133 tests but ran 0.
  [stdio] -Dcc="ccache gcc" -Accflags="-Werror=declaration-after-statement" -Duseithreads
  [stdio] -Dcc="ccache gcc" -Accflags="-Werror=declaration-after-statement" -Duseithreads DEBUGGING
~~ ../dist/Storable/t/CVE-2015-1592.t .......................... FAILED No plan found in TAP output
  [stdio] -Dcc="ccache gcc" -Accflags="-Werror=declaration-after-statement" -Duseithreads
  [stdio] -Dcc="ccache gcc" -Accflags="-Werror=declaration-after-statement" -Duseithreads DEBUGGING
~~ ../cpan/autodie/t/utf8_open.t ............................... FAILED No plan found in TAP output
  [stdio] -Dcc="ccache gcc" -Accflags="-Werror=declaration-after-statement" -Duseithreads
  [stdio] -Dcc="ccache gcc" -Accflags="-Werror=declaration-after-statement" -Duseithreads DEBUGGING
~~ ../dist/threads-shared/t/utf8.t ............................. FAILED Non-zero exit status: 255 Bad plan.  You planned 12 tests but ran 0.
  [stdio] -Dcc="ccache gcc" -Accflags="-Werror=declaration-after-statement" -Duseithreads
  [stdio] -Dcc="ccache gcc" -Accflags="-Werror=declaration-after-statement" -Duseithreads DEBUGGING
~~ ../dist/threads/t/basic.t ................................... FAILED Non-zero exit status: 255 Bad plan.  You planned 34 tests but ran 0.
  [stdio] -Dcc="ccache gcc" -Accflags="-Werror=declaration-after-statement" -Duseithreads
  [stdio] -Dcc="ccache gcc" -Accflags="-Werror=declaration-after-statement" -Duseithreads DEBUGGING
~~ ../cpan/ExtUtils-MakeMaker/t/INST.t ......................... FAILED Bad plan.  You planned 26 tests but ran 0.
  [stdio] -Dcc="ccache gcc" -Accflags="-Werror=declaration-after-statement" -Duseithreads
  [stdio] -Dcc="ccache gcc" -Accflags="-Werror=declaration-after-statement" -Duseithreads DEBUGGING
~~ ../cpan/Test-Simple/t/Legacy/is_deeply_fail.t ............... FAILED Non-zero exit status: 255 No plan found in TAP output
  [stdio] -Dcc="ccache gcc" -Accflags="-Werror=declaration-after-statement" -Duseithreads
  [stdio] -Dcc="ccache gcc" -Accflags="-Werror=declaration-after-statement" DEBUGGING
  [stdio] -Dcc="ccache gcc" -Accflags="-Werror=declaration-after-statement"
  [stdio] -Dcc="ccache gcc" -Accflags="-Werror=declaration-after-statement" -Duseithreads DEBUGGING
~~ ../dist/ExtUtils-ParseXS/t/001-basic.t ...................... FAILED Bad plan.  You planned 17 tests but ran 3.
  [stdio] -Dcc="ccache gcc" -Accflags="-Werror=declaration-after-statement" -Duseithreads
  [stdio] -Dcc="ccache gcc" -Accflags="-Werror=declaration-after-statement" -Duseithreads DEBUGGING
~~ ../t/uni/fold.t ............................................. FAILED No plan found in TAP output
  [stdio] -Dcc="ccache gcc" -Accflags="-Werror=declaration-after-statement" -Duseithreads
  [stdio] -Dcc="ccache gcc" -Accflags="-Werror=declaration-after-statement" -Duseithreads DEBUGGING
~~ ../cpan/Encode/t/mime_header_iso2022jp.t .................... FAILED Bad plan.  You planned 14 tests but ran 0.
  [stdio] -Dcc="ccache gcc" -Accflags="-Werror=declaration-after-statement" -Duseithreads
  [stdio] -Dcc="ccache gcc" -Accflags="-Werror=declaration-after-statement" -Duseithreads DEBUGGING
~~ ../dist/Storable/t/flags.t .................................. FAILED Bad plan.  You planned 16 tests but ran 0.
  [stdio] -Dcc="ccache gcc" -Accflags="-Werror=declaration-after-statement" -Duseithreads
  [stdio] -Dcc="ccache gcc" -Accflags="-Werror=declaration-after-statement" -Duseithreads DEBUGGING
~~ ../dist/Storable/t/regexp.t ................................. FAILED No plan found in TAP output
  [stdio] -Dcc="ccache gcc" -Accflags="-Werror=declaration-after-statement" -Duseithreads
  [stdio] -Dcc="ccache gcc" -Accflags="-Werror=declaration-after-statement" -Duseithreads DEBUGGING
~~ ../dist/Storable/t/compat06.t ............................... FAILED Bad plan.  You planned 8 tests but ran 0.
  [stdio] -Dcc="ccache gcc" -Accflags="-Werror=declaration-after-statement" -Duseithreads
  [stdio] -Dcc="ccache gcc" -Accflags="-Werror=declaration-after-statement" -Duseithreads DEBUGGING
~~ ../cpan/Archive-Tar/t/09_roundtrip.t ........................ FAILED Bad plan.  You planned 7 tests but ran 3.
  [stdio] -Dcc="ccache gcc" -Accflags="-Werror=declaration-after-statement" -Duseithreads
  [stdio] -Dcc="ccache gcc" -Accflags="-Werror=declaration-after-statement" -Duseithreads DEBUGGING
~~ ../ext/XS-APItest/t/handy09.t ............................... FAILED No plan found in TAP output
  [stdio] -Dcc="ccache gcc" -Accflags="-Werror=declaration-after-statement" -Duseithreads
  [stdio] -Dcc="ccache gcc" -Accflags="-Werror=declaration-after-statement" -Duseithreads DEBUGGING
~~ ../ext/B/t/optree_samples.t ................................. FAILED Non-zero exit status: 2 No plan found in TAP output
  [stdio] -Dcc="ccache gcc" -Accflags="-Werror=declaration-after-statement" -Duseithreads
  [stdio] -Dcc="ccache gcc" -Accflags="-Werror=declaration-after-statement" DEBUGGING
  [stdio] -Dcc="ccache gcc" -Accflags="-Werror=declaration-after-statement"
  [stdio] -Dcc="ccache gcc" -Accflags="-Werror=declaration-after-statement" -Duseithreads DEBUGGING
~~ ../cpan/Compress-Raw-Bzip2/t/19nonpv.t ...................... FAILED Non-zero exit status: 255 No plan found in TAP output
  [stdio] -Dcc="ccache gcc" -Accflags="-Werror=declaration-after-statement" -Duseithreads
  [stdio] -Dcc="ccache gcc" -Accflags="-Werror=declaration-after-statement" DEBUGGING
  [stdio] -Dcc="ccache gcc" -Accflags="-Werror=declaration-after-statement"
  [stdio] -Dcc="ccache gcc" -Accflags="-Werror=declaration-after-statement" -Duseithreads DEBUGGING
~~ ../ext/B/t/optree_constants.t ............................... FAILED Non-zero exit status: 2 No plan found in TAP output
  [stdio] -Dcc="ccache gcc" -Accflags="-Werror=declaration-after-statement" -Duseithreads
  [stdio] -Dcc="ccache gcc" -Accflags="-Werror=declaration-after-statement" DEBUGGING
  [stdio] -Dcc="ccache gcc" -Accflags="-Werror=declaration-after-statement"
  [stdio] -Dcc="ccache gcc" -Accflags="-Werror=declaration-after-statement" -Duseithreads DEBUGGING
~~ ../cpan/Test-Simple/t/Test2/behavior/disable_ipc_a.t ........ FAILED No plan found in TAP output
  [stdio] -Dcc="ccache gcc" -Accflags="-Werror=declaration-after-statement" -Duseithreads
  [stdio] -Dcc="ccache gcc" -Accflags="-Werror=declaration-after-statement" -Duseithreads DEBUGGING
~~ ../cpan/podlators/t/text/utf8-io.t .......................... FAILED Bad plan.  You planned 17 tests but ran 0.
  [stdio] -Dcc="ccache gcc" -Accflags="-Werror=declaration-after-statement" -Duseithreads
  [stdio] -Dcc="ccache gcc" -Accflags="-Werror=declaration-after-statement" -Duseithreads DEBUGGING
~~ ../cpan/CPAN/t/03pkgs.t ..................................... FAILED Bad plan.  You planned 11 tests but ran 0.
  [stdio] -Dcc="ccache gcc" -Accflags="-Werror=declaration-after-statement" -Duseithreads
  [stdio] -Dcc="ccache gcc" -Accflags="-Werror=declaration-after-statement" -Duseithreads DEBUGGING
~~ ../cpan/Test-Simple/t/Test2/modules/API/Context.t ........... FAILED Non-zero exit status: 255 No plan found in TAP output
  [stdio] -Dcc="ccache gcc" -Accflags="-Werror=declaration-after-statement" -Duseithreads
  [stdio] -Dcc="ccache gcc" -Accflags="-Werror=declaration-after-statement" DEBUGGING
  [stdio] -Dcc="ccache gcc" -Accflags="-Werror=declaration-after-statement"
  [stdio] -Dcc="ccache gcc" -Accflags="-Werror=declaration-after-statement" -Duseithreads DEBUGGING
~~ ../cpan/podlators/t/man/iso-8859-1.t ........................ FAILED Bad plan.  You planned 3 tests but ran 0.
  [stdio] -Dcc="ccache gcc" -Accflags="-Werror=declaration-after-statement" -Duseithreads
  [stdio] -Dcc="ccache gcc" -Accflags="-Werror=declaration-after-statement" -Duseithreads DEBUGGING
~~ ../t/re/fold_grind_l.t ...................................... FAILED No plan found in TAP output
  [stdio] -Dcc="ccache gcc" -Accflags="-Werror=declaration-after-statement" -Duseithreads
  [stdio] -Dcc="ccache gcc" -Accflags="-Werror=declaration-after-statement" -Duseithreads DEBUGGING
~~ ../cpan/ExtUtils-MakeMaker/t/prefixify.t .................... FAILED No plan found in TAP output
  [stdio] -Dcc="ccache gcc" -Accflags="-Werror=declaration-after-statement" -Duseithreads
  [stdio] -Dcc="ccache gcc" -Accflags="-Werror=declaration-after-statement" -Duseithreads DEBUGGING
~~ ../dist/Devel-PPPort/t/ppphtest.t ........................... FAILED 5-13 50-53 83-84 118-132 152-161 202-204 Bad plan.  You planned 238 tests but ran 209.
  [stdio] -Dcc="ccache gcc" -Accflags="-Werror=declaration-after-statement" -Duseithreads
  [stdio] -Dcc="ccache gcc" -Accflags="-Werror=declaration-after-statement" DEBUGGING
  [stdio] -Dcc="ccache gcc" -Accflags="-Werror=declaration-after-statement"
  [stdio] -Dcc="ccache gcc" -Accflags="-Werror=declaration-after-statement" -Duseithreads DEBUGGING
~~ ../ext/File-Glob/t/case.t ................................... FAILED Non-zero exit status: 2 No plan found in TAP output
  [stdio] -Dcc="ccache gcc" -Accflags="-Werror=declaration-after-statement" -Duseithreads
  [stdio] -Dcc="ccache gcc" -Accflags="-Werror=declaration-after-statement" DEBUGGING
  [stdio] -Dcc="ccache gcc" -Accflags="-Werror=declaration-after-statement"
  [stdio] -Dcc="ccache gcc" -Accflags="-Werror=declaration-after-statement" -Duseithreads DEBUGGING
~~ ../cpan/DB_File/t/db-threads.t .............................. FAILED 1 Non-zero exit status: 2 Bad plan.  You planned 7 tests but ran 2.
  [stdio] -Dcc="ccache gcc" -Accflags="-Werror=declaration-after-statement" -Duseithreads
  [stdio] -Dcc="ccache gcc" -Accflags="-Werror=declaration-after-statement" -Duseithreads DEBUGGING
~~ ../cpan/CPAN-Meta/t/parse-cpan-meta/02_api.t ................ FAILED No plan found in TAP output
  [stdio] -Dcc="ccache gcc" -Accflags="-Werror=declaration-after-statement" -Duseithreads
  [stdio] -Dcc="ccache gcc" -Accflags="-Werror=declaration-after-statement" -Duseithreads DEBUGGING
~~ ../ext/Hash-Util-FieldHash/t/03_class.t ..................... FAILED Non-zero exit status: 255 Bad plan.  You planned 7 tests but ran 2.
  [stdio] -Dcc="ccache gcc" -Accflags="-Werror=declaration-after-statement" -Duseithreads
  [stdio] -Dcc="ccache gcc" -Accflags="-Werror=declaration-after-statement" -Duseithreads DEBUGGING
~~ ../ext/B/t/optree_misc.t .................................... FAILED Non-zero exit status: 255 No plan found in TAP output
  [stdio] -Dcc="ccache gcc" -Accflags="-Werror=declaration-after-statement" -Duseithreads
  [stdio] -Dcc="ccache gcc" -Accflags="-Werror=declaration-after-statement" DEBUGGING
  [stdio] -Dcc="ccache gcc" -Accflags="-Werror=declaration-after-statement"
  [stdio] -Dcc="ccache gcc" -Accflags="-Werror=declaration-after-statement" -Duseithreads DEBUGGING
~~ ../dist/ExtUtils-ParseXS/t/002-more.t ....................... FAILED Bad plan.  You planned 30 tests but ran 2.
  [stdio] -Dcc="ccache gcc" -Accflags="-Werror=declaration-after-statement" -Duseithreads
  [stdio] -Dcc="ccache gcc" -Accflags="-Werror=declaration-after-statement" -Duseithreads DEBUGGING
~~ ../t/re/pat_rt_report_thr.t ................................. FAILED Non-zero exit status: 255 No plan found in TAP output
  [stdio] -Dcc="ccache gcc" -Accflags="-Werror=declaration-after-statement" -Duseithreads
  [stdio] -Dcc="ccache gcc" -Accflags="-Werror=declaration-after-statement" -Duseithreads DEBUGGING
~~ ../cpan/Encode/t/at-cn.t .................................... FAILED Bad plan.  You planned 29 tests but ran 0.
  [stdio] -Dcc="ccache gcc" -Accflags="-Werror=declaration-after-statement" -Duseithreads
  [stdio] -Dcc="ccache gcc" -Accflags="-Werror=declaration-after-statement" -Duseithreads DEBUGGING
~~ ../ext/Fcntl/t/mode.t ....................................... FAILED Non-zero exit status: 255 No plan found in TAP output
  [stdio] -Dcc="ccache gcc" -Accflags="-Werror=declaration-after-statement" -Duseithreads
  [stdio] -Dcc="ccache gcc" -Accflags="-Werror=declaration-after-statement" DEBUGGING
  [stdio] -Dcc="ccache gcc" -Accflags="-Werror=declaration-after-statement"
  [stdio] -Dcc="ccache gcc" -Accflags="-Werror=declaration-after-statement" -Duseithreads DEBUGGING
~~ ../cpan/ExtUtils-MakeMaker/t/prompt.t ....................... FAILED Bad plan.  You planned 11 tests but ran 0.
  [stdio] -Dcc="ccache gcc" -Accflags="-Werror=declaration-after-statement" -Duseithreads
  [stdio] -Dcc="ccache gcc" -Accflags="-Werror=declaration-after-statement" -Duseithreads DEBUGGING
~~ ../ext/XS-APItest/t/xs_special_subs_require.t ............... FAILED 71-73 Non-zero exit status: 3
  [stdio] -Dcc="ccache gcc" -Accflags="-Werror=declaration-after-statement" -Duseithreads
  [stdio] -Dcc="ccache gcc" -Accflags="-Werror=declaration-after-statement" DEBUGGING
  [stdio] -Dcc="ccache gcc" -Accflags="-Werror=declaration-after-statement"
  [stdio] -Dcc="ccache gcc" -Accflags="-Werror=declaration-after-statement" -Duseithreads DEBUGGING
~~ ../lib/Symbol.t ............................................. FAILED Non-zero exit status: 255 Bad plan.  You planned 26 tests but ran 0.
  [stdio] -Dcc="ccache gcc" -Accflags="-Werror=declaration-after-statement" -Duseithreads
  [stdio] -Dcc="ccache gcc" -Accflags="-Werror=declaration-after-statement" DEBUGGING
  [stdio] -Dcc="ccache gcc" -Accflags="-Werror=declaration-after-statement"
  [stdio] -Dcc="ccache gcc" -Accflags="-Werror=declaration-after-statement" -Duseithreads DEBUGGING
~~ ../lib/charnames.t .......................................... FAILED No plan found in TAP output
  [stdio] -Dcc="ccache gcc" -Accflags="-Werror=declaration-after-statement" -Duseithreads
  [stdio] -Dcc="ccache gcc" -Accflags="-Werror=declaration-after-statement" -Duseithreads DEBUGGING
~~ ../cpan/Pod-Checker/t/pod/poderrs.t ......................... FAILED Non-zero exit status: 255 No plan found in TAP output
  [stdio] -Dcc="ccache gcc" -Accflags="-Werror=declaration-after-statement" -Duseithreads
  [stdio] -Dcc="ccache gcc" -Accflags="-Werror=declaration-after-statement" DEBUGGING
  [stdio] -Dcc="ccache gcc" -Accflags="-Werror=declaration-after-statement"
  [stdio] -Dcc="ccache gcc" -Accflags="-Werror=declaration-after-statement" -Duseithreads DEBUGGING
~~ ../dist/Storable/t/just_plain_nasty.t ....................... FAILED No plan found in TAP output
  [stdio] -Dcc="ccache gcc" -Accflags="-Werror=declaration-after-statement" -Duseithreads
  [stdio] -Dcc="ccache gcc" -Accflags="-Werror=declaration-after-statement" -Duseithreads DEBUGGING
~~ ../dist/Thread-Queue/t/03_peek.t ............................ FAILED Non-zero exit status: 255 No plan found in TAP output
  [stdio] -Dcc="ccache gcc" -Accflags="-Werror=declaration-after-statement" -Duseithreads
  [stdio] -Dcc="ccache gcc" -Accflags="-Werror=declaration-after-statement" -Duseithreads DEBUGGING
~~ ../ext/File-Find/t/find.t ................................... FAILED Non-zero exit status: 2 No plan found in TAP output
  [stdio] -Dcc="ccache gcc" -Accflags="-Werror=declaration-after-statement" -Duseithreads
  [stdio] -Dcc="ccache gcc" -Accflags="-Werror=declaration-after-statement" DEBUGGING
  [stdio] -Dcc="ccache gcc" -Accflags="-Werror=declaration-after-statement"
  [stdio] -Dcc="ccache gcc" -Accflags="-Werror=declaration-after-statement" -Duseithreads DEBUGGING
~~ ../cpan/Module-Metadata/t/encoding.t ........................ FAILED Bad plan.  You planned 12 tests but ran 0.
  [stdio] -Dcc="ccache gcc" -Accflags="-Werror=declaration-after-statement" -Duseithreads
  [stdio] -Dcc="ccache gcc" -Accflags="-Werror=declaration-after-statement" -Duseithreads DEBUGGING
~~ ../cpan/ExtUtils-MakeMaker/t/min_perl_version.t ............. FAILED No plan found in TAP output
  [stdio] -Dcc="ccache gcc" -Accflags="-Werror=declaration-after-statement" -Duseithreads
  [stdio] -Dcc="ccache gcc" -Accflags="-Werror=declaration-after-statement" -Duseithreads DEBUGGING
~~ ../dist/ExtUtils-CBuilder/t/00-have-compiler.t .............. FAILED Non-zero exit status: 255 No plan found in TAP output
  [stdio] -Dcc="ccache gcc" -Accflags="-Werror=declaration-after-statement" -Duseithreads
  [stdio] -Dcc="ccache gcc" -Accflags="-Werror=declaration-after-statement" DEBUGGING
  [stdio] -Dcc="ccache gcc" -Accflags="-Werror=declaration-after-statement"
  [stdio] -Dcc="ccache gcc" -Accflags="-Werror=declaration-after-statement" -Duseithreads DEBUGGING
~~ ../ext/XS-APItest/t/handy03.t ............................... FAILED No plan found in TAP output
  [stdio] -Dcc="ccache gcc" -Accflags="-Werror=declaration-after-statement" -Duseithreads
  [stdio] -Dcc="ccache gcc" -Accflags="-Werror=declaration-after-statement" -Duseithreads DEBUGGING
~~ ../cpan/Pod-Simple/t/JustPod02.t ............................ FAILED Bad plan.  You planned 1 tests but ran 0.
  [stdio] -Dcc="ccache gcc" -Accflags="-Werror=declaration-after-statement" -Duseithreads
  [stdio] -Dcc="ccache gcc" -Accflags="-Werror=declaration-after-statement" -Duseithreads DEBUGGING
~~ ../cpan/Pod-Simple/t/00about.t .............................. FAILED Bad plan.  You planned 28 tests but ran 25.
  [stdio] -Dcc="ccache gcc" -Accflags="-Werror=declaration-after-statement" -Duseithreads
  [stdio] -Dcc="ccache gcc" -Accflags="-Werror=declaration-after-statement" -Duseithreads DEBUGGING
~~ ../dist/threads/t/state.t ................................... FAILED Non-zero exit status: 255 No plan found in TAP output
  [stdio] -Dcc="ccache gcc" -Accflags="-Werror=declaration-after-statement" -Duseithreads
  [stdio] -Dcc="ccache gcc" -Accflags="-Werror=declaration-after-statement" -Duseithreads DEBUGGING
~~ ../cpan/CPAN-Meta-YAML/t/31_local_tml.t ..................... FAILED No plan found in TAP output
  [stdio] -Dcc="ccache gcc" -Accflags="-Werror=declaration-after-statement" -Duseithreads
  [stdio] -Dcc="ccache gcc" -Accflags="-Werror=declaration-after-statement" -Duseithreads DEBUGGING
~~ ../cpan/version/t/01base.t .................................. FAILED Non-zero exit status: 255
  [stdio] -Dcc="ccache gcc" -Accflags="-Werror=declaration-after-statement" -Duseithreads
  [stdio] -Dcc="ccache gcc" -Accflags="-Werror=declaration-after-statement" DEBUGGING
  [stdio] -Dcc="ccache gcc" -Accflags="-Werror=declaration-after-statement"
  [stdio] -Dcc="ccache gcc" -Accflags="-Werror=declaration-after-statement" -Duseithreads DEBUGGING
~~ ../dist/Data-Dumper/t/dumper.t .............................. FAILED 1 Non-zero exit status: 2 Bad plan.  You planned 468 tests but ran 36.
  [stdio] -Dcc="ccache gcc" -Accflags="-Werror=declaration-after-statement" -Duseithreads
  [stdio] -Dcc="ccache gcc" -Accflags="-Werror=declaration-after-statement" DEBUGGING
  [stdio] -Dcc="ccache gcc" -Accflags="-Werror=declaration-after-statement"
  [stdio] -Dcc="ccache gcc" -Accflags="-Werror=declaration-after-statement" -Duseithreads DEBUGGING
~~ ../t/porting/regen.t ........................................ FAILED 20-21
  [stdio] -Dcc="ccache gcc" -Accflags="-Werror=declaration-after-statement" DEBUGGING
  [stdio] -Dcc="ccache gcc" -Accflags="-Werror=declaration-after-statement"
~~ ../dist/Storable/t/blessed.t ................................ FAILED No plan found in TAP output
  [stdio] -Dcc="ccache gcc" -Accflags="-Werror=declaration-after-statement" -Duseithreads
  [stdio] -Dcc="ccache gcc" -Accflags="-Werror=declaration-after-statement" -Duseithreads DEBUGGING
~~ ../lib/open.t ............................................... FAILED Bad plan.  You planned 11 tests but ran 9.
  [stdio] -Dcc="ccache gcc" -Accflags="-Werror=declaration-after-statement" -Duseithreads
  [stdio] -Dcc="ccache gcc" -Accflags="-Werror=declaration-after-statement" -Duseithreads DEBUGGING
~~ ../dist/Thread-Queue/t/06_insert.t .......................... FAILED Non-zero exit status: 255 No plan found in TAP output
  [stdio] -Dcc="ccache gcc" -Accflags="-Werror=declaration-after-statement" -Duseithreads
  [stdio] -Dcc="ccache gcc" -Accflags="-Werror=declaration-after-statement" -Duseithreads DEBUGGING
~~ ../t/re/pat_rt_report.t ..................................... FAILED 2497
  [stdio] -Dcc="ccache gcc" -Accflags="-Werror=declaration-after-statement" -Duseithreads
  [stdio] -Dcc="ccache gcc" -Accflags="-Werror=declaration-after-statement" -Duseithreads DEBUGGING
~~ ../dist/Storable/t/freeze.t ................................. FAILED No plan found in TAP output
  [stdio] -Dcc="ccache gcc" -Accflags="-Werror=declaration-after-statement" -Duseithreads
  [stdio] -Dcc="ccache gcc" -Accflags="-Werror=declaration-after-statement" -Duseithreads DEBUGGING
~~ ../dist/threads-shared/t/shared_attr.t ...................... FAILED Non-zero exit status: 255 Bad plan.  You planned 101 tests but ran 0.
  [stdio] -Dcc="ccache gcc" -Accflags="-Werror=declaration-after-statement" -Duseithreads
  [stdio] -Dcc="ccache gcc" -Accflags="-Werror=declaration-after-statement" -Duseithreads DEBUGGING
~~ ../ext/PerlIO-via/t/thread.t ................................ FAILED Non-zero exit status: 255 No plan found in TAP output
  [stdio] -Dcc="ccache gcc" -Accflags="-Werror=declaration-after-statement" -Duseithreads
  [stdio] -Dcc="ccache gcc" -Accflags="-Werror=declaration-after-statement" -Duseithreads DEBUGGING
~~ ../cpan/Pod-Simple/t/encod01.t .............................. FAILED Bad plan.  You planned 6 tests but ran 0.
  [stdio] -Dcc="ccache gcc" -Accflags="-Werror=declaration-after-statement" -Duseithreads
  [stdio] -Dcc="ccache gcc" -Accflags="-Werror=declaration-after-statement" -Duseithreads DEBUGGING
~~ ../cpan/ExtUtils-Install/t/Installapi2.t .................... FAILED Bad plan.  You planned 70 tests but ran 0.
  [stdio] -Dcc="ccache gcc" -Accflags="-Werror=declaration-after-statement" -Duseithreads
  [stdio] -Dcc="ccache gcc" -Accflags="-Werror=declaration-after-statement" -Duseithreads DEBUGGING
~~ ../cpan/Time-Piece/t/07arith.t .............................. FAILED Non-zero exit status: 255 Bad plan.  You planned 43 tests but ran 2.
  [stdio] -Dcc="ccache gcc" -Accflags="-Werror=declaration-after-statement" -Duseithreads
  [stdio] -Dcc="ccache gcc" -Accflags="-Werror=declaration-after-statement" DEBUGGING
  [stdio] -Dcc="ccache gcc" -Accflags="-Werror=declaration-after-statement"
  [stdio] -Dcc="ccache gcc" -Accflags="-Werror=declaration-after-statement" -Duseithreads DEBUGGING
~~ ../cpan/Encode/t/mime-header.t .............................. FAILED Bad plan.  You planned 266 tests but ran 0.
  [stdio] -Dcc="ccache gcc" -Accflags="-Werror=declaration-after-statement" -Duseithreads
  [stdio] -Dcc="ccache gcc" -Accflags="-Werror=declaration-after-statement" -Duseithreads DEBUGGING
~~ ../ext/B/t/pragma.t ......................................... FAILED Non-zero exit status: 255 Bad plan.  You planned 12 tests but ran 0.
  [stdio] -Dcc="ccache gcc" -Accflags="-Werror=declaration-after-statement" -Duseithreads
  [stdio] -Dcc="ccache gcc" -Accflags="-Werror=declaration-after-statement" DEBUGGING
  [stdio] -Dcc="ccache gcc" -Accflags="-Werror=declaration-after-statement"
  [stdio] -Dcc="ccache gcc" -Accflags="-Werror=declaration-after-statement" -Duseithreads DEBUGGING
~~ ../cpan/Test-Simple/t/Legacy/is_deeply_with_threads.t ....... FAILED Non-zero exit status: 255 No plan found in TAP output
  [stdio] -Dcc="ccache gcc" -Accflags="-Werror=declaration-after-statement" -Duseithreads
  [stdio] -Dcc="ccache gcc" -Accflags="-Werror=declaration-after-statement" -Duseithreads DEBUGGING
~~ ../ext/XS-APItest/t/my_cxt.t ................................ FAILED Non-zero exit status: 255 Bad plan.  You planned 16 tests but ran 7.
  [stdio] -Dcc="ccache gcc" -Accflags="-Werror=declaration-after-statement" -Duseithreads
  [stdio] -Dcc="ccache gcc" -Accflags="-Werror=declaration-after-statement" -Duseithreads DEBUGGING
~~ ../dist/Thread-Queue/t/09_ended.t ........................... FAILED Non-zero exit status: 255 No plan found in TAP output
  [stdio] -Dcc="ccache gcc" -Accflags="-Werror=declaration-after-statement" -Duseithreads
  [stdio] -Dcc="ccache gcc" -Accflags="-Werror=declaration-after-statement" -Duseithreads DEBUGGING
~~ ../cpan/Encode/t/decode.t ................................... FAILED No plan found in TAP output
  [stdio] -Dcc="ccache gcc" -Accflags="-Werror=declaration-after-statement" -Duseithreads
  [stdio] -Dcc="ccache gcc" -Accflags="-Werror=declaration-after-statement" -Duseithreads DEBUGGING
~~ ../dist/threads/t/free2.t ................................... FAILED Non-zero exit status: 255 No plan found in TAP output
  [stdio] -Dcc="ccache gcc" -Accflags="-Werror=declaration-after-statement" -Duseithreads
  [stdio] -Dcc="ccache gcc" -Accflags="-Werror=declaration-after-statement" -Duseithreads DEBUGGING
~~ ../ext/IPC-Open3/t/IPC-Open3.t .............................. FAILED Non-zero exit status: 255 No plan found in TAP output
  [stdio] -Dcc="ccache gcc" -Accflags="-Werror=declaration-after-statement" -Duseithreads
  [stdio] -Dcc="ccache gcc" -Accflags="-Werror=declaration-after-statement" DEBUGGING
  [stdio] -Dcc="ccache gcc" -Accflags="-Werror=declaration-after-statement"
  [stdio] -Dcc="ccache gcc" -Accflags="-Werror=declaration-after-statement" -Duseithreads DEBUGGING
~~ ../cpan/Encode/t/taint.t .................................... FAILED No plan found in TAP output
  [stdio] -Dcc="ccache gcc" -Accflags="-Werror=declaration-after-statement" -Duseithreads
  [stdio] -Dcc="ccache gcc" -Accflags="-Werror=declaration-after-statement" -Duseithreads DEBUGGING
~~ ../dist/threads/t/context.t ................................. FAILED Non-zero exit status: 255 No plan found in TAP output
  [stdio] -Dcc="ccache gcc" -Accflags="-Werror=declaration-after-statement" -Duseithreads
  [stdio] -Dcc="ccache gcc" -Accflags="-Werror=declaration-after-statement" -Duseithreads DEBUGGING
~~ ../cpan/Test-Simple/t/Legacy/Tester/tbt_05faildiag.t ........ FAILED Non-zero exit status: 255 Bad plan.  You planned 5 tests but ran 0.
  [stdio] -Dcc="ccache gcc" -Accflags="-Werror=declaration-after-statement" -Duseithreads
  [stdio] -Dcc="ccache gcc" -Accflags="-Werror=declaration-after-statement" DEBUGGING
  [stdio] -Dcc="ccache gcc" -Accflags="-Werror=declaration-after-statement"
  [stdio] -Dcc="ccache gcc" -Accflags="-Werror=declaration-after-statement" -Duseithreads DEBUGGING
~~ ../cpan/Test-Simple/t/Test2/behavior/disable_ipc_c.t ........ FAILED No plan found in TAP output
  [stdio] -Dcc="ccache gcc" -Accflags="-Werror=declaration-after-statement" -Duseithreads
  [stdio] -Dcc="ccache gcc" -Accflags="-Werror=declaration-after-statement" -Duseithreads DEBUGGING
~~ ../cpan/Encode/t/mime-name.t ................................ FAILED No plan found in TAP output
  [stdio] -Dcc="ccache gcc" -Accflags="-Werror=declaration-after-statement" -Duseithreads
  [stdio] -Dcc="ccache gcc" -Accflags="-Werror=declaration-after-statement" -Duseithreads DEBUGGING
~~ ../dist/threads/t/exit.t .................................... FAILED Non-zero exit status: 255 No plan found in TAP output
  [stdio] -Dcc="ccache gcc" -Accflags="-Werror=declaration-after-statement" -Duseithreads
  [stdio] -Dcc="ccache gcc" -Accflags="-Werror=declaration-after-statement" -Duseithreads DEBUGGING
~~ ../cpan/podlators/t/text/termcap.t .......................... FAILED Bad plan.  You planned 15 tests but ran 0.
  [stdio] -Dcc="ccache gcc" -Accflags="-Werror=declaration-after-statement" -Duseithreads
  [stdio] -Dcc="ccache gcc" -Accflags="-Werror=declaration-after-statement" -Duseithreads DEBUGGING
~~ ../cpan/Module-Metadata/t/metadata.t ........................ FAILED No plan found in TAP output
  [stdio] -Dcc="ccache gcc" -Accflags="-Werror=declaration-after-statement" -Duseithreads
  [stdio] -Dcc="ccache gcc" -Accflags="-Werror=declaration-after-statement" -Duseithreads DEBUGGING
~~ ../t/porting/podcheck.t ..................................... FAILED No plan found in TAP output
  [stdio] -Dcc="ccache gcc" -Accflags="-Werror=declaration-after-statement" -Duseithreads
  [stdio] -Dcc="ccache gcc" -Accflags="-Werror=declaration-after-statement" -Duseithreads DEBUGGING
~~ ../cpan/Pod-Checker/t/pod/podchkenc.t ....................... FAILED Non-zero exit status: 255 No plan found in TAP output
  [stdio] -Dcc="ccache gcc" -Accflags="-Werror=declaration-after-statement" -Duseithreads
  [stdio] -Dcc="ccache gcc" -Accflags="-Werror=declaration-after-statement" DEBUGGING
  [stdio] -Dcc="ccache gcc" -Accflags="-Werror=declaration-after-statement"
  [stdio] -Dcc="ccache gcc" -Accflags="-Werror=declaration-after-statement" -Duseithreads DEBUGGING
~~ ../cpan/podlators/t/text/color.t ............................ FAILED Bad plan.  You planned 11 tests but ran 0.
  [stdio] -Dcc="ccache gcc" -Accflags="-Werror=declaration-after-statement" -Duseithreads
  [stdio] -Dcc="ccache gcc" -Accflags="-Werror=declaration-after-statement" -Duseithreads DEBUGGING
~~ ../cpan/podlators/t/man/snippets.t .......................... FAILED Bad plan.  You planned 93 tests but ran 0.
  [stdio] -Dcc="ccache gcc" -Accflags="-Werror=declaration-after-statement" -Duseithreads
  [stdio] -Dcc="ccache gcc" -Accflags="-Werror=declaration-after-statement" -Duseithreads DEBUGGING
~~ ../cpan/ExtUtils-MakeMaker/t/os_unsupported.t ............... FAILED Bad plan.  You planned 1 tests but ran 0.
  [stdio] -Dcc="ccache gcc" -Accflags="-Werror=declaration-after-statement" -Duseithreads
  [stdio] -Dcc="ccache gcc" -Accflags="-Werror=declaration-after-statement" -Duseithreads DEBUGGING
~~ ../dist/threads/t/end.t ..................................... FAILED Non-zero exit status: 255 No plan found in TAP output
  [stdio] -Dcc="ccache gcc" -Accflags="-Werror=declaration-after-statement" -Duseithreads
  [stdio] -Dcc="ccache gcc" -Accflags="-Werror=declaration-after-statement" -Duseithreads DEBUGGING
~~ ../cpan/Pod-Usage/t/pod/selectheaders.t ..................... FAILED 1-2 Non-zero exit status: 2
  [stdio] -Dcc="ccache gcc" -Accflags="-Werror=declaration-after-statement" -Duseithreads
  [stdio] -Dcc="ccache gcc" -Accflags="-Werror=declaration-after-statement" -Duseithreads DEBUGGING
~~ ../t/uni/method.t ........................................... FAILED Bad plan.  You planned 62 tests but ran 24.
  [stdio] -Dcc="ccache gcc" -Accflags="-Werror=declaration-after-statement" -Duseithreads
  [stdio] -Dcc="ccache gcc" -Accflags="-Werror=declaration-after-statement" -Duseithreads DEBUGGING
~~ ../cpan/Test-Simple/t/Test2/acceptance/try_it_plan.t ........ FAILED Non-zero exit status: 255 No plan found in TAP output
  [stdio] -Dcc="ccache gcc" -Accflags="-Werror=declaration-after-statement" -Duseithreads
  [stdio] -Dcc="ccache gcc" -Accflags="-Werror=declaration-after-statement" DEBUGGING
  [stdio] -Dcc="ccache gcc" -Accflags="-Werror=declaration-after-statement"
  [stdio] -Dcc="ccache gcc" -Accflags="-Werror=declaration-after-statement" -Duseithreads DEBUGGING
~~ ../cpan/Compress-Raw-Zlib/t/19nonpv.t ....................... FAILED Non-zero exit status: 255 No plan found in TAP output
  [stdio] -Dcc="ccache gcc" -Accflags="-Werror=declaration-after-statement" -Duseithreads
  [stdio] -Dcc="ccache gcc" -Accflags="-Werror=declaration-after-statement" DEBUGGING
  [stdio] -Dcc="ccache gcc" -Accflags="-Werror=declaration-after-statement"
  [stdio] -Dcc="ccache gcc" -Accflags="-Werror=declaration-after-statement" -Duseithreads DEBUGGING
~~ ../cpan/Text-Balanced/t/08_extvar.t ......................... FAILED Non-zero exit status: 255 Bad plan.  You planned 183 tests but ran 0.
  [stdio] -Dcc="ccache gcc" -Accflags="-Werror=declaration-after-statement" -Duseithreads
  [stdio] -Dcc="ccache gcc" -Accflags="-Werror=declaration-after-statement" DEBUGGING
  [stdio] -Dcc="ccache gcc" -Accflags="-Werror=declaration-after-statement"
  [stdio] -Dcc="ccache gcc" -Accflags="-Werror=declaration-after-statement" -Duseithreads DEBUGGING
~~ ../cpan/ExtUtils-MakeMaker/t/MM_VMS.t ....................... FAILED Non-zero exit status: 255 No plan found in TAP output
  [stdio] -Dcc="ccache gcc" -Accflags="-Werror=declaration-after-statement" -Duseithreads
  [stdio] -Dcc="ccache gcc" -Accflags="-Werror=declaration-after-statement" DEBUGGING
  [stdio] -Dcc="ccache gcc" -Accflags="-Werror=declaration-after-statement"
  [stdio] -Dcc="ccache gcc" -Accflags="-Werror=declaration-after-statement" -Duseithreads DEBUGGING
~~ ../cpan/ExtUtils-Constant/t/Constant.t ...................... FAILED No plan found in TAP output
  [stdio] -Dcc="ccache gcc" -Accflags="-Werror=declaration-after-statement" -Duseithreads
  [stdio] -Dcc="ccache gcc" -Accflags="-Werror=declaration-after-statement" -Duseithreads DEBUGGING
~~ ../dist/Storable/t/downgrade.t .............................. FAILED 13 77 125 Non-zero exit status: 25
  [stdio] -Dcc="ccache gcc" -Accflags="-Werror=declaration-after-statement"
~~ ../dist/Storable/t/robust.t ................................. FAILED Bad plan.  You planned 1 tests but ran 0.
  [stdio] -Dcc="ccache gcc" -Accflags="-Werror=declaration-after-statement" -Duseithreads
  [stdio] -Dcc="ccache gcc" -Accflags="-Werror=declaration-after-statement" -Duseithreads DEBUGGING
~~ ../ext/XS-APItest/t/my_exit.t ............................... FAILED Non-zero exit status: 2 No plan found in TAP output
  [stdio] -Dcc="ccache gcc" -Accflags="-Werror=declaration-after-statement" -Duseithreads
  [stdio] -Dcc="ccache gcc" -Accflags="-Werror=declaration-after-statement" DEBUGGING
  [stdio] -Dcc="ccache gcc" -Accflags="-Werror=declaration-after-statement"
  [stdio] -Dcc="ccache gcc" -Accflags="-Werror=declaration-after-statement" -Duseithreads DEBUGGING
~~ ../t/uni/title.t ............................................ FAILED No plan found in TAP output
  [stdio] -Dcc="ccache gcc" -Accflags="-Werror=declaration-after-statement" -Duseithreads
  [stdio] -Dcc="ccache gcc" -Accflags="-Werror=declaration-after-statement" -Duseithreads DEBUGGING
~~ ../cpan/Encode/t/encoding-locale.t .......................... FAILED Bad plan.  You planned 3 tests but ran 0.
  [stdio] -Dcc="ccache gcc" -Accflags="-Werror=declaration-after-statement" -Duseithreads
  [stdio] -Dcc="ccache gcc" -Accflags="-Werror=declaration-after-statement" -Duseithreads DEBUGGING
~~ ../cpan/ExtUtils-MakeMaker/t/INST_PREFIX.t .................. FAILED Bad plan.  You planned 52 tests but ran 0.
  [stdio] -Dcc="ccache gcc" -Accflags="-Werror=declaration-after-statement" -Duseithreads
  [stdio] -Dcc="ccache gcc" -Accflags="-Werror=declaration-after-statement" -Duseithreads DEBUGGING
~~ ../cpan/Encode/t/rt86327.t .................................. FAILED No plan found in TAP output
  [stdio] -Dcc="ccache gcc" -Accflags="-Werror=declaration-after-statement" -Duseithreads
  [stdio] -Dcc="ccache gcc" -Accflags="-Werror=declaration-after-statement" -Duseithreads DEBUGGING
~~ ../ext/Fcntl/t/syslfs.t ..................................... FAILED Non-zero exit status: 255 No plan found in TAP output
  [stdio] -Dcc="ccache gcc" -Accflags="-Werror=declaration-after-statement" -Duseithreads
  [stdio] -Dcc="ccache gcc" -Accflags="-Werror=declaration-after-statement" DEBUGGING
  [stdio] -Dcc="ccache gcc" -Accflags="-Werror=declaration-after-statement"
  [stdio] -Dcc="ccache gcc" -Accflags="-Werror=declaration-after-statement" -Duseithreads DEBUGGING
~~ ../dist/Storable/t/lock.t ................................... FAILED No plan found in TAP output
  [stdio] -Dcc="ccache gcc" -Accflags="-Werror=declaration-after-statement" -Duseithreads
  [stdio] -Dcc="ccache gcc" -Accflags="-Werror=declaration-after-statement" -Duseithreads DEBUGGING
~~ ../dist/Storable/t/downgrade.t .............................. FAILED No plan found in TAP output
  [stdio] -Dcc="ccache gcc" -Accflags="-Werror=declaration-after-statement" -Duseithreads
  [stdio] -Dcc="ccache gcc" -Accflags="-Werror=declaration-after-statement" -Duseithreads DEBUGGING
~~ ../cpan/Test-Simple/t/Legacy/exit.t ......................... FAILED 1-256
  [stdio] -Dcc="ccache gcc" -Accflags="-Werror=declaration-after-statement" DEBUGGING
  [stdio] -Dcc="ccache gcc" -Accflags="-Werror=declaration-after-statement" -Duseithreads DEBUGGING
~~ ../cpan/ExtUtils-MakeMaker/t/unicode.t ...................... FAILED No plan found in TAP output
  [stdio] -Dcc="ccache gcc" -Accflags="-Werror=declaration-after-statement" -Duseithreads
  [stdio] -Dcc="ccache gcc" -Accflags="-Werror=declaration-after-statement" -Duseithreads DEBUGGING
~~ ../dist/Thread-Queue/t/10_timed.t ........................... FAILED Non-zero exit status: 255 No plan found in TAP output
  [stdio] -Dcc="ccache gcc" -Accflags="-Werror=declaration-after-statement" -Duseithreads
  [stdio] -Dcc="ccache gcc" -Accflags="-Werror=declaration-after-statement" -Duseithreads DEBUGGING
~~ ../cpan/CPAN-Meta/t/load-bad.t .............................. FAILED No plan found in TAP output
  [stdio] -Dcc="ccache gcc" -Accflags="-Werror=declaration-after-statement" -Duseithreads
  [stdio] -Dcc="ccache gcc" -Accflags="-Werror=declaration-after-statement" -Duseithreads DEBUGGING
~~ ../cpan/Test-Simple/t/Test2/modules/IPC/Driver.t ............ FAILED No plan found in TAP output
  [stdio] -Dcc="ccache gcc" -Accflags="-Werror=declaration-after-statement" -Duseithreads
  [stdio] -Dcc="ccache gcc" -Accflags="-Werror=declaration-after-statement" -Duseithreads DEBUGGING
~~ ../ext/FileCache/t/01open.t ................................. FAILED Non-zero exit status: 25 Bad plan.  You planned 1 tests but ran 0.
  [stdio] -Dcc="ccache gcc" -Accflags="-Werror=declaration-after-statement" -Duseithreads
  [stdio] -Dcc="ccache gcc" -Accflags="-Werror=declaration-after-statement" DEBUGGING
  [stdio] -Dcc="ccache gcc" -Accflags="-Werror=declaration-after-statement"
  [stdio] -Dcc="ccache gcc" -Accflags="-Werror=declaration-after-statement" -Duseithreads DEBUGGING
~~ ../dist/ExtUtils-CBuilder/t/02-link.t ....................... FAILED Non-zero exit status: 255 No plan found in TAP output
  [stdio] -Dcc="ccache gcc" -Accflags="-Werror=declaration-after-statement" -Duseithreads
  [stdio] -Dcc="ccache gcc" -Accflags="-Werror=declaration-after-statement" DEBUGGING
  [stdio] -Dcc="ccache gcc" -Accflags="-Werror=declaration-after-statement"
  [stdio] -Dcc="ccache gcc" -Accflags="-Werror=declaration-after-statement" -Duseithreads DEBUGGING
~~ ../ext/FileCache/t/07noimport.t ............................. FAILED Non-zero exit status: 25 Bad plan.  You planned 1 tests but ran 0.
  [stdio] -Dcc="ccache gcc" -Accflags="-Werror=declaration-after-statement" -Duseithreads
  [stdio] -Dcc="ccache gcc" -Accflags="-Werror=declaration-after-statement" DEBUGGING
  [stdio] -Dcc="ccache gcc" -Accflags="-Werror=declaration-after-statement"
  [stdio] -Dcc="ccache gcc" -Accflags="-Werror=declaration-after-statement" -Duseithreads DEBUGGING
~~ ../ext/XS-APItest/t/handy05.t ............................... FAILED No plan found in TAP output
  [stdio] -Dcc="ccache gcc" -Accflags="-Werror=declaration-after-statement" -Duseithreads
  [stdio] -Dcc="ccache gcc" -Accflags="-Werror=declaration-after-statement" -Duseithreads DEBUGGING
~~ ../dist/Storable/t/hugeids.t ................................ FAILED No plan found in TAP output
  [stdio] -Dcc="ccache gcc" -Accflags="-Werror=declaration-after-statement" -Duseithreads
  [stdio] -Dcc="ccache gcc" -Accflags="-Werror=declaration-after-statement" -Duseithreads DEBUGGING
~~ ../dist/ExtUtils-CBuilder/t/01-basic.t ...................... FAILED Non-zero exit status: 255 No plan found in TAP output
  [stdio] -Dcc="ccache gcc" -Accflags="-Werror=declaration-after-statement" -Duseithreads
  [stdio] -Dcc="ccache gcc" -Accflags="-Werror=declaration-after-statement" DEBUGGING
  [stdio] -Dcc="ccache gcc" -Accflags="-Werror=declaration-after-statement"
  [stdio] -Dcc="ccache gcc" -Accflags="-Werror=declaration-after-statement" -Duseithreads DEBUGGING
~~ ../dist/threads/t/libc.t .................................... FAILED 1 Non-zero exit status: 255 Bad plan.  You planned 11 tests but ran 1.
  [stdio] -Dcc="ccache gcc" -Accflags="-Werror=declaration-after-statement" -Duseithreads
  [stdio] -Dcc="ccache gcc" -Accflags="-Werror=declaration-after-statement" -Duseithreads DEBUGGING
~~ ../ext/B/t/concise.t ........................................ FAILED Non-zero exit status: 2 No plan found in TAP output
  [stdio] -Dcc="ccache gcc" -Accflags="-Werror=declaration-after-statement" -Duseithreads
  [stdio] -Dcc="ccache gcc" -Accflags="-Werror=declaration-after-statement" DEBUGGING
  [stdio] -Dcc="ccache gcc" -Accflags="-Werror=declaration-after-statement"
  [stdio] -Dcc="ccache gcc" -Accflags="-Werror=declaration-after-statement" -Duseithreads DEBUGGING
~~ ../cpan/JSON-PP/t/020_faihu.t ............................... FAILED No plan found in TAP output
  [stdio] -Dcc="ccache gcc" -Accflags="-Werror=declaration-after-statement" -Duseithreads
  [stdio] -Dcc="ccache gcc" -Accflags="-Werror=declaration-after-statement" -Duseithreads DEBUGGING
~~ ../cpan/Encode/t/utf8warnings.t ............................. FAILED No plan found in TAP output
  [stdio] -Dcc="ccache gcc" -Accflags="-Werror=declaration-after-statement" -Duseithreads
  [stdio] -Dcc="ccache gcc" -Accflags="-Werror=declaration-after-statement" -Duseithreads DEBUGGING
~~ ../cpan/CPAN/t/02nox.t ...................................... FAILED Bad plan.  You planned 8 tests but ran 0.
  [stdio] -Dcc="ccache gcc" -Accflags="-Werror=declaration-after-statement" -Duseithreads
  [stdio] -Dcc="ccache gcc" -Accflags="-Werror=declaration-after-statement" -Duseithreads DEBUGGING
~~ ../cpan/Digest-MD5/t/files.t ................................ FAILED 2
  [stdio] -Dcc="ccache gcc" -Accflags="-Werror=declaration-after-statement" -Duseithreads
  [stdio] -Dcc="ccache gcc" -Accflags="-Werror=declaration-after-statement" DEBUGGING
  [stdio] -Dcc="ccache gcc" -Accflags="-Werror=declaration-after-statement"
  [stdio] -Dcc="ccache gcc" -Accflags="-Werror=declaration-after-statement" -Duseithreads DEBUGGING
~~ ../ext/XS-APItest/t/handy08.t ............................... FAILED No plan found in TAP output
  [stdio] -Dcc="ccache gcc" -Accflags="-Werror=declaration-after-statement" -Duseithreads
  [stdio] -Dcc="ccache gcc" -Accflags="-Werror=declaration-after-statement" -Duseithreads DEBUGGING
~~ ../cpan/ExtUtils-MakeMaker/t/fix_libs.t ..................... FAILED No plan found in TAP output
  [stdio] -Dcc="ccache gcc" -Accflags="-Werror=declaration-after-statement" -Duseithreads
  [stdio] -Dcc="ccache gcc" -Accflags="-Werror=declaration-after-statement" -Duseithreads DEBUGGING
~~ ../t/re/pat_re_eval.t ....................................... FAILED 422-423
  [stdio] -Dcc="ccache gcc" -Accflags="-Werror=declaration-after-statement" DEBUGGING
~~ ../lib/DBM_Filter/t/utf8.t .................................. FAILED No plan found in TAP output
  [stdio] -Dcc="ccache gcc" -Accflags="-Werror=declaration-after-statement" -Duseithreads
  [stdio] -Dcc="ccache gcc" -Accflags="-Werror=declaration-after-statement" -Duseithreads DEBUGGING
~~ ../cpan/ExtUtils-MakeMaker/t/parse_version.t ................ FAILED No plan found in TAP output
  [stdio] -Dcc="ccache gcc" -Accflags="-Werror=declaration-after-statement" -Duseithreads
  [stdio] -Dcc="ccache gcc" -Accflags="-Werror=declaration-after-statement" -Duseithreads DEBUGGING
~~ ../t/re/pat_psycho_thr.t .................................... FAILED Non-zero exit status: 255 No plan found in TAP output
  [stdio] -Dcc="ccache gcc" -Accflags="-Werror=declaration-after-statement" -Duseithreads
  [stdio] -Dcc="ccache gcc" -Accflags="-Werror=declaration-after-statement" -Duseithreads DEBUGGING
~~ ../cpan/ExtUtils-MakeMaker/t/MM_Any.t ....................... FAILED Bad plan.  You planned 7 tests but ran 0.
  [stdio] -Dcc="ccache gcc" -Accflags="-Werror=declaration-after-statement" -Duseithreads
  [stdio] -Dcc="ccache gcc" -Accflags="-Werror=declaration-after-statement" -Duseithreads DEBUGGING
~~ ../ext/File-Glob/t/taint.t .................................. FAILED Non-zero exit status: 2 No plan found in TAP output
  [stdio] -Dcc="ccache gcc" -Accflags="-Werror=declaration-after-statement" -Duseithreads
  [stdio] -Dcc="ccache gcc" -Accflags="-Werror=declaration-after-statement" DEBUGGING
  [stdio] -Dcc="ccache gcc" -Accflags="-Werror=declaration-after-statement"
  [stdio] -Dcc="ccache gcc" -Accflags="-Werror=declaration-after-statement" -Duseithreads DEBUGGING
~~ ../dist/Storable/t/destroy.t ................................ FAILED Bad plan.  You planned 1 tests but ran 0.
  [stdio] -Dcc="ccache gcc" -Accflags="-Werror=declaration-after-statement" -Duseithreads
  [stdio] -Dcc="ccache gcc" -Accflags="-Werror=declaration-after-statement" -Duseithreads DEBUGGING
~~ ../dist/threads/t/kill2.t ................................... FAILED Non-zero exit status: 255 No plan found in TAP output
  [stdio] -Dcc="ccache gcc" -Accflags="-Werror=declaration-after-statement" -Duseithreads
  [stdio] -Dcc="ccache gcc" -Accflags="-Werror=declaration-after-statement" -Duseithreads DEBUGGING
~~ ../dist/threads/t/join.t .................................... FAILED Non-zero exit status: 255 No plan found in TAP output
  [stdio] -Dcc="ccache gcc" -Accflags="-Werror=declaration-after-statement" -Duseithreads
  [stdio] -Dcc="ccache gcc" -Accflags="-Werror=declaration-after-statement" -Duseithreads DEBUGGING
~~ ../cpan/podlators/t/text/overstrike.t ....................... FAILED Bad plan.  You planned 5 tests but ran 0.
  [stdio] -Dcc="ccache gcc" -Accflags="-Werror=declaration-after-statement" -Duseithreads
  [stdio] -Dcc="ccache gcc" -Accflags="-Werror=declaration-after-statement" -Duseithreads DEBUGGING
~~ ../dist/threads-shared/t/no_share.t ......................... FAILED Non-zero exit status: 255 Bad plan.  You planned 6 tests but ran 0.
  [stdio] -Dcc="ccache gcc" -Accflags="-Werror=declaration-after-statement" -Duseithreads
  [stdio] -Dcc="ccache gcc" -Accflags="-Werror=declaration-after-statement" -Duseithreads DEBUGGING
~~ ../t/re/fold_grind_d.t ...................................... FAILED No plan found in TAP output
  [stdio] -Dcc="ccache gcc" -Accflags="-Werror=declaration-after-statement" -Duseithreads
  [stdio] -Dcc="ccache gcc" -Accflags="-Werror=declaration-after-statement" -Duseithreads DEBUGGING
~~ ../ext/XS-APItest/t/handy01.t ............................... FAILED No plan found in TAP output
  [stdio] -Dcc="ccache gcc" -Accflags="-Werror=declaration-after-statement" -Duseithreads
  [stdio] -Dcc="ccache gcc" -Accflags="-Werror=declaration-after-statement" -Duseithreads DEBUGGING
~~ ../dist/Storable/t/recurse.t ................................ FAILED No plan found in TAP output
  [stdio] -Dcc="ccache gcc" -Accflags="-Werror=declaration-after-statement" -Duseithreads
  [stdio] -Dcc="ccache gcc" -Accflags="-Werror=declaration-after-statement" -Duseithreads DEBUGGING
~~ ../cpan/Pod-Simple/t/JustPod01.t ............................ FAILED Bad plan.  You planned 2 tests but ran 1.
  [stdio] -Dcc="ccache gcc" -Accflags="-Werror=declaration-after-statement" -Duseithreads
  [stdio] -Dcc="ccache gcc" -Accflags="-Werror=declaration-after-statement" -Duseithreads DEBUGGING
~~ ../t/re/pat.t ............................................... FAILED 936
  [stdio] -Dcc="ccache gcc" -Accflags="-Werror=declaration-after-statement" -Duseithreads
  [stdio] -Dcc="ccache gcc" -Accflags="-Werror=declaration-after-statement" -Duseithreads DEBUGGING
~~ ../cpan/ExtUtils-MakeMaker/t/pod2man.t ...................... FAILED Bad plan.  You planned 3 tests but ran 0.
  [stdio] -Dcc="ccache gcc" -Accflags="-Werror=declaration-after-statement" -Duseithreads
  [stdio] -Dcc="ccache gcc" -Accflags="-Werror=declaration-after-statement" -Duseithreads DEBUGGING
~~ ../cpan/CPAN-Meta-YAML/t/10_read.t .......................... FAILED No plan found in TAP output
  [stdio] -Dcc="ccache gcc" -Accflags="-Werror=declaration-after-statement" -Duseithreads
  [stdio] -Dcc="ccache gcc" -Accflags="-Werror=declaration-after-statement" -Duseithreads DEBUGGING
~~ ../t/mro/package_aliases_utf8.t ............................. FAILED 11-34
  [stdio] -Dcc="ccache gcc" -Accflags="-Werror=declaration-after-statement" -Duseithreads
  [stdio] -Dcc="ccache gcc" -Accflags="-Werror=declaration-after-statement" -Duseithreads DEBUGGING
~~ ../ext/re/t/lexical_debug.t ................................. FAILED 3
  [stdio] -Dcc="ccache gcc" -Accflags="-Werror=declaration-after-statement" -Duseithreads
  [stdio] -Dcc="ccache gcc" -Accflags="-Werror=declaration-after-statement" DEBUGGING
  [stdio] -Dcc="ccache gcc" -Accflags="-Werror=declaration-after-statement"
  [stdio] -Dcc="ccache gcc" -Accflags="-Werror=declaration-after-statement" -Duseithreads DEBUGGING
~~ ../cpan/CPAN-Meta/t/converter.t ............................. FAILED No plan found in TAP output
  [stdio] -Dcc="ccache gcc" -Accflags="-Werror=declaration-after-statement" -Duseithreads
  [stdio] -Dcc="ccache gcc" -Accflags="-Werror=declaration-after-statement" -Duseithreads DEBUGGING
~~ ../cpan/ExtUtils-Install/t/Install.t ........................ FAILED Bad plan.  You planned 62 tests but ran 0.
  [stdio] -Dcc="ccache gcc" -Accflags="-Werror=declaration-after-statement" -Duseithreads
  [stdio] -Dcc="ccache gcc" -Accflags="-Werror=declaration-after-statement" -Duseithreads DEBUGGING
~~ ../t/run/switches.t ......................................... FAILED 117
  [stdio] -Dcc="ccache gcc" -Accflags="-Werror=declaration-after-statement" -Duseithreads
  [stdio] -Dcc="ccache gcc" -Accflags="-Werror=declaration-after-statement" -Duseithreads DEBUGGING
~~ ../dist/Storable/t/tied_store.t ............................. FAILED No plan found in TAP output
  [stdio] -Dcc="ccache gcc" -Accflags="-Werror=declaration-after-statement" -Duseithreads
  [stdio] -Dcc="ccache gcc" -Accflags="-Werror=declaration-after-statement" -Duseithreads DEBUGGING
~~ ../ext/Opcode/t/Opcode.t .................................... FAILED Non-zero exit status: 255 No plan found in TAP output
  [stdio] -Dcc="ccache gcc" -Accflags="-Werror=declaration-after-statement" -Duseithreads
  [stdio] -Dcc="ccache gcc" -Accflags="-Werror=declaration-after-statement" DEBUGGING
  [stdio] -Dcc="ccache gcc" -Accflags="-Werror=declaration-after-statement"
  [stdio] -Dcc="ccache gcc" -Accflags="-Werror=declaration-after-statement" -Duseithreads DEBUGGING
~~ ../t/re/pat_re_eval.t ....................................... FAILED Bad plan.  You planned 506 tests but ran 290.
  [stdio] -Dcc="ccache gcc" -Accflags="-Werror=declaration-after-statement" -Duseithreads
  [stdio] -Dcc="ccache gcc" -Accflags="-Werror=declaration-after-statement" -Duseithreads DEBUGGING
~~ ../dist/threads/t/problems.t ................................ FAILED Non-zero exit status: 255 No plan found in TAP output
  [stdio] -Dcc="ccache gcc" -Accflags="-Werror=declaration-after-statement" -Duseithreads
  [stdio] -Dcc="ccache gcc" -Accflags="-Werror=declaration-after-statement" -Duseithreads DEBUGGING
~~ ../cpan/Text-Balanced/t/02_extbrk.t ......................... FAILED Non-zero exit status: 255 Bad plan.  You planned 19 tests but ran 0.
  [stdio] -Dcc="ccache gcc" -Accflags="-Werror=declaration-after-statement" -Duseithreads
  [stdio] -Dcc="ccache gcc" -Accflags="-Werror=declaration-after-statement" DEBUGGING
  [stdio] -Dcc="ccache gcc" -Accflags="-Werror=declaration-after-statement"
  [stdio] -Dcc="ccache gcc" -Accflags="-Werror=declaration-after-statement" -Duseithreads DEBUGGING
~~ ../cpan/Test-Simple/t/Test2/modules/IPC.t ................... FAILED No plan found in TAP output
  [stdio] -Dcc="ccache gcc" -Accflags="-Werror=declaration-after-statement" -Duseithreads
  [stdio] -Dcc="ccache gcc" -Accflags="-Werror=declaration-after-statement" -Duseithreads DEBUGGING
~~ ../cpan/Text-Balanced/t/04_extdel.t ......................... FAILED Non-zero exit status: 255 Bad plan.  You planned 45 tests but ran 0.
  [stdio] -Dcc="ccache gcc" -Accflags="-Werror=declaration-after-statement" -Duseithreads
  [stdio] -Dcc="ccache gcc" -Accflags="-Werror=declaration-after-statement" DEBUGGING
  [stdio] -Dcc="ccache gcc" -Accflags="-Werror=declaration-after-statement"
  [stdio] -Dcc="ccache gcc" -Accflags="-Werror=declaration-after-statement" -Duseithreads DEBUGGING
~~ ../dist/Storable/t/tied.t ................................... FAILED No plan found in TAP output
  [stdio] -Dcc="ccache gcc" -Accflags="-Werror=declaration-after-statement" -Duseithreads
  [stdio] -Dcc="ccache gcc" -Accflags="-Werror=declaration-after-statement" -Duseithreads DEBUGGING
~~ ../dist/threads/t/stress_cv.t ............................... FAILED Non-zero exit status: 255 Bad plan.  You planned 61 tests but ran 0.
  [stdio] -Dcc="ccache gcc" -Accflags="-Werror=declaration-after-statement" -Duseithreads
  [stdio] -Dcc="ccache gcc" -Accflags="-Werror=declaration-after-statement" -Duseithreads DEBUGGING
~~ ../cpan/ExtUtils-MakeMaker/t/parse_abstract.t ............... FAILED No plan found in TAP output
  [stdio] -Dcc="ccache gcc" -Accflags="-Werror=declaration-after-statement" -Duseithreads
  [stdio] -Dcc="ccache gcc" -Accflags="-Werror=declaration-after-statement" -Duseithreads DEBUGGING
~~ ../dist/Storable/t/recurse.t ................................ FAILED Non-zero exit status: 255 Bad plan.  You planned 39 tests but ran 0.
  [stdio] -Dcc="ccache gcc" -Accflags="-Werror=declaration-after-statement" DEBUGGING
  [stdio] -Dcc="ccache gcc" -Accflags="-Werror=declaration-after-statement"
~~ ../cpan/CPAN-Meta/t/converter-bad.t ......................... FAILED No plan found in TAP output
  [stdio] -Dcc="ccache gcc" -Accflags="-Werror=declaration-after-statement" -Duseithreads
  [stdio] -Dcc="ccache gcc" -Accflags="-Werror=declaration-after-statement" -Duseithreads DEBUGGING
~~ ../cpan/Compress-Raw-Bzip2/t/01bzip2.t ...................... FAILED Non-zero exit status: 2 Bad plan.  You planned 173 tests but ran 1.
  [stdio] -Dcc="ccache gcc" -Accflags="-Werror=declaration-after-statement" -Duseithreads
  [stdio] -Dcc="ccache gcc" -Accflags="-Werror=declaration-after-statement" DEBUGGING
  [stdio] -Dcc="ccache gcc" -Accflags="-Werror=declaration-after-statement"
  [stdio] -Dcc="ccache gcc" -Accflags="-Werror=declaration-after-statement" -Duseithreads DEBUGGING
~~ ../dist/threads-shared/t/cond.t ............................. FAILED Non-zero exit status: 255 Bad plan.  You planned 32 tests but ran 0.
  [stdio] -Dcc="ccache gcc" -Accflags="-Werror=declaration-after-statement" -Duseithreads
  [stdio] -Dcc="ccache gcc" -Accflags="-Werror=declaration-after-statement" -Duseithreads DEBUGGING
~~ ../t/op/threads-dirh.t ...................................... FAILED Non-zero exit status: 255 Bad plan.  You planned 6 tests but ran 0.
  [stdio] -Dcc="ccache gcc" -Accflags="-Werror=declaration-after-statement" -Duseithreads
  [stdio] -Dcc="ccache gcc" -Accflags="-Werror=declaration-after-statement" -Duseithreads DEBUGGING
~~ ../ext/XS-APItest/t/handy04.t ............................... FAILED No plan found in TAP output
  [stdio] -Dcc="ccache gcc" -Accflags="-Werror=declaration-after-statement" -Duseithreads
  [stdio] -Dcc="ccache gcc" -Accflags="-Werror=declaration-after-statement" -Duseithreads DEBUGGING
~~ ../dist/Devel-PPPort/t/warn.t ............................... FAILED 4
  [stdio] -Dcc="ccache gcc" -Accflags="-Werror=declaration-after-statement" -Duseithreads
  [stdio] -Dcc="ccache gcc" -Accflags="-Werror=declaration-after-statement" DEBUGGING
  [stdio] -Dcc="ccache gcc" -Accflags="-Werror=declaration-after-statement"
  [stdio] -Dcc="ccache gcc" -Accflags="-Werror=declaration-after-statement" -Duseithreads DEBUGGING
~~ ../cpan/CPAN-Meta/t/meta-obj.t .............................. FAILED No plan found in TAP output
  [stdio] -Dcc="ccache gcc" -Accflags="-Werror=declaration-after-statement" -Duseithreads
  [stdio] -Dcc="ccache gcc" -Accflags="-Werror=declaration-after-statement" -Duseithreads DEBUGGING
~~ ../cpan/ExtUtils-MakeMaker/t/writemakefile_args.t ........... FAILED Bad plan.  You planned 43 tests but ran 0.
  [stdio] -Dcc="ccache gcc" -Accflags="-Werror=declaration-after-statement" -Duseithreads
  [stdio] -Dcc="ccache gcc" -Accflags="-Werror=declaration-after-statement" -Duseithreads DEBUGGING
~~ ../dist/ExtUtils-ParseXS/t/003-usage.t ...................... FAILED Bad plan.  You planned 24 tests but ran 2.
  [stdio] -Dcc="ccache gcc" -Accflags="-Werror=declaration-after-statement" -Duseithreads
  [stdio] -Dcc="ccache gcc" -Accflags="-Werror=declaration-after-statement" -Duseithreads DEBUGGING
~~ ../dist/threads-shared/t/blessed.t .......................... FAILED Non-zero exit status: 255 Bad plan.  You planned 37 tests but ran 0.
  [stdio] -Dcc="ccache gcc" -Accflags="-Werror=declaration-after-statement" -Duseithreads
  [stdio] -Dcc="ccache gcc" -Accflags="-Werror=declaration-after-statement" -Duseithreads DEBUGGING
~~ ../cpan/Encode/t/truncated_utf8.t ........................... FAILED No plan found in TAP output
  [stdio] -Dcc="ccache gcc" -Accflags="-Werror=declaration-after-statement" -Duseithreads
  [stdio] -Dcc="ccache gcc" -Accflags="-Werror=declaration-after-statement" -Duseithreads DEBUGGING
~~ ../ext/PerlIO-encoding/t/encoding.t ......................... FAILED No plan found in TAP output
  [stdio] -Dcc="ccache gcc" -Accflags="-Werror=declaration-after-statement" -Duseithreads
  [stdio] -Dcc="ccache gcc" -Accflags="-Werror=declaration-after-statement" -Duseithreads DEBUGGING
~~ ../dist/Storable/t/weak.t ................................... FAILED Non-zero exit status: 25
  [stdio] -Dcc="ccache gcc" -Accflags="-Werror=declaration-after-statement"
~~ ../dist/Exporter/t/Exporter.t ............................... FAILED Non-zero exit status: 255 No plan found in TAP output
  [stdio] -Dcc="ccache gcc" -Accflags="-Werror=declaration-after-statement" -Duseithreads
  [stdio] -Dcc="ccache gcc" -Accflags="-Werror=declaration-after-statement" DEBUGGING
  [stdio] -Dcc="ccache gcc" -Accflags="-Werror=declaration-after-statement"
  [stdio] -Dcc="ccache gcc" -Accflags="-Werror=declaration-after-statement" -Duseithreads DEBUGGING
~~ ../cpan/ExtUtils-MakeMaker/t/several_authors.t .............. FAILED No plan found in TAP output
  [stdio] -Dcc="ccache gcc" -Accflags="-Werror=declaration-after-statement" -Duseithreads
  [stdio] -Dcc="ccache gcc" -Accflags="-Werror=declaration-after-statement" -Duseithreads DEBUGGING
~~ ../cpan/Pod-Simple/t/pulltitl.t ............................. FAILED Bad plan.  You planned 117 tests but ran 69.
  [stdio] -Dcc="ccache gcc" -Accflags="-Werror=declaration-after-statement" -Duseithreads
  [stdio] -Dcc="ccache gcc" -Accflags="-Werror=declaration-after-statement" -Duseithreads DEBUGGING
~~ ../cpan/Encode/t/Encoder.t .................................. FAILED Bad plan.  You planned 516 tests but ran 0.
  [stdio] -Dcc="ccache gcc" -Accflags="-Werror=declaration-after-statement" -Duseithreads
  [stdio] -Dcc="ccache gcc" -Accflags="-Werror=declaration-after-statement" -Duseithreads DEBUGGING
~~ ../ext/B/t/optree_check.t ................................... FAILED Non-zero exit status: 255 No plan found in TAP output
  [stdio] -Dcc="ccache gcc" -Accflags="-Werror=declaration-after-statement" -Duseithreads
  [stdio] -Dcc="ccache gcc" -Accflags="-Werror=declaration-after-statement" DEBUGGING
  [stdio] -Dcc="ccache gcc" -Accflags="-Werror=declaration-after-statement"
  [stdio] -Dcc="ccache gcc" -Accflags="-Werror=declaration-after-statement" -Duseithreads DEBUGGING
~~ ../cpan/podlators/t/text/iso-8859-1.t ....................... FAILED Bad plan.  You planned 3 tests but ran 0.
  [stdio] -Dcc="ccache gcc" -Accflags="-Werror=declaration-after-statement" -Duseithreads
  [stdio] -Dcc="ccache gcc" -Accflags="-Werror=declaration-after-statement" -Duseithreads DEBUGGING
~~ ../cpan/Test-Simple/t/Legacy/Regression/683_thread_todo.t ... FAILED Non-zero exit status: 255 No plan found in TAP output
  [stdio] -Dcc="ccache gcc" -Accflags="-Werror=declaration-after-statement" -Duseithreads
  [stdio] -Dcc="ccache gcc" -Accflags="-Werror=declaration-after-statement" -Duseithreads DEBUGGING
~~ ../lib/utf8.t ............................................... FAILED 40 82
  [stdio] -Dcc="ccache gcc" -Accflags="-Werror=declaration-after-statement" -Duseithreads
  [stdio] -Dcc="ccache gcc" -Accflags="-Werror=declaration-after-statement" DEBUGGING
  [stdio] -Dcc="ccache gcc" -Accflags="-Werror=declaration-after-statement"
  [stdio] -Dcc="ccache gcc" -Accflags="-Werror=declaration-after-statement" -Duseithreads DEBUGGING
~~ ../lib/overload.t ........................................... FAILED Non-zero exit status: 255 Bad plan.  You planned 5363 tests but ran 137.
  [stdio] -Dcc="ccache gcc" -Accflags="-Werror=declaration-after-statement" -Duseithreads
  [stdio] -Dcc="ccache gcc" -Accflags="-Werror=declaration-after-statement" DEBUGGING
  [stdio] -Dcc="ccache gcc" -Accflags="-Werror=declaration-after-statement"
  [stdio] -Dcc="ccache gcc" -Accflags="-Werror=declaration-after-statement" -Duseithreads DEBUGGING
~~ ../ext/XS-APItest/t/handy06.t ............................... FAILED No plan found in TAP output
  [stdio] -Dcc="ccache gcc" -Accflags="-Werror=declaration-after-statement" -Duseithreads
  [stdio] -Dcc="ccache gcc" -Accflags="-Werror=declaration-after-statement" -Duseithreads DEBUGGING
~~ ../cpan/CPAN/t/01loadme.t ................................... FAILED No plan found in TAP output
  [stdio] -Dcc="ccache gcc" -Accflags="-Werror=declaration-after-statement" -Duseithreads
  [stdio] -Dcc="ccache gcc" -Accflags="-Werror=declaration-after-statement" -Duseithreads DEBUGGING
~~ ../cpan/ExtUtils-Install/t/Installed.t ...................... FAILED Bad plan.  You planned 73 tests but ran 0.
  [stdio] -Dcc="ccache gcc" -Accflags="-Werror=declaration-after-statement" -Duseithreads
  [stdio] -Dcc="ccache gcc" -Accflags="-Werror=declaration-after-statement" -Duseithreads DEBUGGING
~~ ../cpan/Encode/t/Aliases.t .................................. FAILED No plan found in TAP output
  [stdio] -Dcc="ccache gcc" -Accflags="-Werror=declaration-after-statement" -Duseithreads
  [stdio] -Dcc="ccache gcc" -Accflags="-Werror=declaration-after-statement" -Duseithreads DEBUGGING
~~ ../ext/Devel-Peek/t/Peek.t .................................. FAILED Non-zero exit status: 255 No plan found in TAP output
  [stdio] -Dcc="ccache gcc" -Accflags="-Werror=declaration-after-statement" -Duseithreads
  [stdio] -Dcc="ccache gcc" -Accflags="-Werror=declaration-after-statement" DEBUGGING
  [stdio] -Dcc="ccache gcc" -Accflags="-Werror=declaration-after-statement"
  [stdio] -Dcc="ccache gcc" -Accflags="-Werror=declaration-after-statement" -Duseithreads DEBUGGING
~~ ../dist/Storable/t/store.t .................................. FAILED No plan found in TAP output
  [stdio] -Dcc="ccache gcc" -Accflags="-Werror=declaration-after-statement" -Duseithreads
  [stdio] -Dcc="ccache gcc" -Accflags="-Werror=declaration-after-statement" -Duseithreads DEBUGGING
~~ ../cpan/Test-Simple/t/Test2/behavior/ipc_wait_timeout.t ..... FAILED No plan found in TAP output
  [stdio] -Dcc="ccache gcc" -Accflags="-Werror=declaration-after-statement" -Duseithreads
  [stdio] -Dcc="ccache gcc" -Accflags="-Werror=declaration-after-statement" -Duseithreads DEBUGGING
~~ ../cpan/version/t/03require.t ............................... FAILED Non-zero exit status: 255
  [stdio] -Dcc="ccache gcc" -Accflags="-Werror=declaration-after-statement" -Duseithreads
  [stdio] -Dcc="ccache gcc" -Accflags="-Werror=declaration-after-statement" DEBUGGING
  [stdio] -Dcc="ccache gcc" -Accflags="-Werror=declaration-after-statement"
  [stdio] -Dcc="ccache gcc" -Accflags="-Werror=declaration-after-statement" -Duseithreads DEBUGGING
~~ ../dist/Storable/t/restrict.t ............................... FAILED 1 79 115 131 147 163 179 195 211 227 243 259 275 291 Non-zero exit status: 176
  [stdio] -Dcc="ccache gcc" -Accflags="-Werror=declaration-after-statement" DEBUGGING
  [stdio] -Dcc="ccache gcc" -Accflags="-Werror=declaration-after-statement"
~~ ../t/uni/gv.t ............................................... FAILED Bad plan.  You planned 206 tests but ran 77.
  [stdio] -Dcc="ccache gcc" -Accflags="-Werror=declaration-after-statement" -Duseithreads
  [stdio] -Dcc="ccache gcc" -Accflags="-Werror=declaration-after-statement" -Duseithreads DEBUGGING
~~ ../cpan/Text-Balanced/t/05_extmul.t ......................... FAILED Non-zero exit status: 255 Bad plan.  You planned 86 tests but ran 0.
  [stdio] -Dcc="ccache gcc" -Accflags="-Werror=declaration-after-statement" -Duseithreads
  [stdio] -Dcc="ccache gcc" -Accflags="-Werror=declaration-after-statement" DEBUGGING
  [stdio] -Dcc="ccache gcc" -Accflags="-Werror=declaration-after-statement"
  [stdio] -Dcc="ccache gcc" -Accflags="-Werror=declaration-after-statement" -Duseithreads DEBUGGING
~~ ../t/op/tr.t ................................................ FAILED Bad plan.  You planned 315 tests but ran 247.
  [stdio] -Dcc="ccache gcc" -Accflags="-Werror=declaration-after-statement" -Duseithreads
  [stdio] -Dcc="ccache gcc" -Accflags="-Werror=declaration-after-statement" -Duseithreads DEBUGGING
~~ ../ext/B/t/optree_varinit.t ................................. FAILED 3 30
  [stdio] -Dcc="ccache gcc" -Accflags="-Werror=declaration-after-statement" -Duseithreads
  [stdio] -Dcc="ccache gcc" -Accflags="-Werror=declaration-after-statement" DEBUGGING
  [stdio] -Dcc="ccache gcc" -Accflags="-Werror=declaration-after-statement"
  [stdio] -Dcc="ccache gcc" -Accflags="-Werror=declaration-after-statement" -Duseithreads DEBUGGING
~~ ../cpan/Test-Simple/t/Test2/modules/IPC/Driver/Files.t ...... FAILED Non-zero exit status: 255 No plan found in TAP output
  [stdio] -Dcc="ccache gcc" -Accflags="-Werror=declaration-after-statement" -Duseithreads
  [stdio] -Dcc="ccache gcc" -Accflags="-Werror=declaration-after-statement" DEBUGGING
  [stdio] -Dcc="ccache gcc" -Accflags="-Werror=declaration-after-statement"
  [stdio] -Dcc="ccache gcc" -Accflags="-Werror=declaration-after-statement" -Duseithreads DEBUGGING
~~ ../cpan/Test-Simple/t/Test2/behavior/disable_ipc_d.t ........ FAILED Non-zero exit status: 255 No plan found in TAP output
  [stdio] -Dcc="ccache gcc" -Accflags="-Werror=declaration-after-statement" -Duseithreads
  [stdio] -Dcc="ccache gcc" -Accflags="-Werror=declaration-after-statement" -Duseithreads DEBUGGING
~~ ../cpan/ExtUtils-MakeMaker/t/revision.t ..................... FAILED Bad plan.  You planned 4 tests but ran 0.
  [stdio] -Dcc="ccache gcc" -Accflags="-Werror=declaration-after-statement" -Duseithreads
  [stdio] -Dcc="ccache gcc" -Accflags="-Werror=declaration-after-statement" -Duseithreads DEBUGGING
~~ ../dist/Storable/t/utf8hash.t ............................... FAILED No plan found in TAP output
  [stdio] -Dcc="ccache gcc" -Accflags="-Werror=declaration-after-statement" -Duseithreads
  [stdio] -Dcc="ccache gcc" -Accflags="-Werror=declaration-after-statement" -Duseithreads DEBUGGING
~~ ../cpan/Test-Simple/t/Test2/modules/API/Breakage.t .......... FAILED No plan found in TAP output
  [stdio] -Dcc="ccache gcc" -Accflags="-Werror=declaration-after-statement" -Duseithreads
  [stdio] -Dcc="ccache gcc" -Accflags="-Werror=declaration-after-statement" -Duseithreads DEBUGGING
~~ ../cpan/ExtUtils-MakeMaker/t/installed_file.t ............... FAILED No plan found in TAP output
  [stdio] -Dcc="ccache gcc" -Accflags="-Werror=declaration-after-statement" -Duseithreads
  [stdio] -Dcc="ccache gcc" -Accflags="-Werror=declaration-after-statement" -Duseithreads DEBUGGING
~~ ../dist/Storable/t/regexp.t ................................. FAILED Bad plan.  You planned 64 tests but ran 4.
  [stdio] -Dcc="ccache gcc" -Accflags="-Werror=declaration-after-statement" DEBUGGING
~~ ../cpan/Encode/t/guess.t .................................... FAILED No plan found in TAP output
  [stdio] -Dcc="ccache gcc" -Accflags="-Werror=declaration-after-statement" -Duseithreads
  [stdio] -Dcc="ccache gcc" -Accflags="-Werror=declaration-after-statement" -Duseithreads DEBUGGING
~~ ../dist/Attribute-Handlers/t/multi.t ........................ FAILED Non-zero exit status: 255 No plan found in TAP output
  [stdio] -Dcc="ccache gcc" -Accflags="-Werror=declaration-after-statement" -Duseithreads
  [stdio] -Dcc="ccache gcc" -Accflags="-Werror=declaration-after-statement" DEBUGGING
  [stdio] -Dcc="ccache gcc" -Accflags="-Werror=declaration-after-statement"
  [stdio] -Dcc="ccache gcc" -Accflags="-Werror=declaration-after-statement" -Duseithreads DEBUGGING
~~ ../cpan/Compress-Raw-Zlib/t/02zlib.t ........................ FAILED Non-zero exit status: 255 No plan found in TAP output
  [stdio] -Dcc="ccache gcc" -Accflags="-Werror=declaration-after-statement" -Duseithreads
  [stdio] -Dcc="ccache gcc" -Accflags="-Werror=declaration-after-statement" DEBUGGING
  [stdio] -Dcc="ccache gcc" -Accflags="-Werror=declaration-after-statement"
  [stdio] -Dcc="ccache gcc" -Accflags="-Werror=declaration-after-statement" -Duseithreads DEBUGGING
~~ ../cpan/Encode/t/isa.t ...................................... FAILED No plan found in TAP output
  [stdio] -Dcc="ccache gcc" -Accflags="-Werror=declaration-after-statement" -Duseithreads
  [stdio] -Dcc="ccache gcc" -Accflags="-Werror=declaration-after-statement" -Duseithreads DEBUGGING
~~ ../cpan/Pod-Usage/t/pod/headwithmarkup.t .................... FAILED 1 Non-zero exit status: 1
  [stdio] -Dcc="ccache gcc" -Accflags="-Werror=declaration-after-statement" -Duseithreads
  [stdio] -Dcc="ccache gcc" -Accflags="-Werror=declaration-after-statement" -Duseithreads DEBUGGING
~~ ../cpan/ExtUtils-MakeMaker/t/INSTALL_BASE.t ................. FAILED No plan found in TAP output
  [stdio] -Dcc="ccache gcc" -Accflags="-Werror=declaration-after-statement" -Duseithreads
  [stdio] -Dcc="ccache gcc" -Accflags="-Werror=declaration-after-statement" -Duseithreads DEBUGGING
~~ ../cpan/ExtUtils-MakeMaker/t/is_of_type.t ................... FAILED No plan found in TAP output
  [stdio] -Dcc="ccache gcc" -Accflags="-Werror=declaration-after-statement" -Duseithreads
  [stdio] -Dcc="ccache gcc" -Accflags="-Werror=declaration-after-statement" -Duseithreads DEBUGGING
~~ ../ext/XS-APItest/t/handy07.t ............................... FAILED No plan found in TAP output
  [stdio] -Dcc="ccache gcc" -Accflags="-Werror=declaration-after-statement" -Duseithreads
  [stdio] -Dcc="ccache gcc" -Accflags="-Werror=declaration-after-statement" -Duseithreads DEBUGGING
~~ ../dist/Thread-Semaphore/t/05_force.t ....................... FAILED Non-zero exit status: 255 No plan found in TAP output
  [stdio] -Dcc="ccache gcc" -Accflags="-Werror=declaration-after-statement" -Duseithreads
  [stdio] -Dcc="ccache gcc" -Accflags="-Werror=declaration-after-statement" -Duseithreads DEBUGGING
~~ ../cpan/CPAN-Meta-YAML/t/30_yaml_spec_tml.t ................. FAILED No plan found in TAP output
  [stdio] -Dcc="ccache gcc" -Accflags="-Werror=declaration-after-statement" -Duseithreads
  [stdio] -Dcc="ccache gcc" -Accflags="-Werror=declaration-after-statement" -Duseithreads DEBUGGING
~~ ../cpan/NEXT/t/next.t ....................................... FAILED Bad plan.  You planned 27 tests but ran 26.
  [stdio] -Dcc="ccache gcc" -Accflags="-Werror=declaration-after-statement" -Duseithreads
  [stdio] -Dcc="ccache gcc" -Accflags="-Werror=declaration-after-statement" DEBUGGING
  [stdio] -Dcc="ccache gcc" -Accflags="-Werror=declaration-after-statement"
  [stdio] -Dcc="ccache gcc" -Accflags="-Werror=declaration-after-statement" -Duseithreads DEBUGGING
~~ ../t/io/layers.t ............................................ FAILED No plan found in TAP output
  [stdio] -Dcc="ccache gcc" -Accflags="-Werror=declaration-after-statement" -Duseithreads
  [stdio] -Dcc="ccache gcc" -Accflags="-Werror=declaration-after-statement" -Duseithreads DEBUGGING
~~ ../cpan/ExtUtils-MakeMaker/t/recurs.t ....................... FAILED No plan found in TAP output
  [stdio] -Dcc="ccache gcc" -Accflags="-Werror=declaration-after-statement" -Duseithreads
  [stdio] -Dcc="ccache gcc" -Accflags="-Werror=declaration-after-statement" -Duseithreads DEBUGGING
~~ ../cpan/Scalar-List-Utils/t/dualvar.t ....................... FAILED Non-zero exit status: 255 Bad plan.  You planned 41 tests but ran 0.
  [stdio] -Dcc="ccache gcc" -Accflags="-Werror=declaration-after-statement" -Duseithreads
  [stdio] -Dcc="ccache gcc" -Accflags="-Werror=declaration-after-statement" DEBUGGING
  [stdio] -Dcc="ccache gcc" -Accflags="-Werror=declaration-after-statement"
  [stdio] -Dcc="ccache gcc" -Accflags="-Werror=declaration-after-statement" -Duseithreads DEBUGGING
~~ ../cpan/podlators/t/man/utf8-io.t ........................... FAILED Bad plan.  You planned 13 tests but ran 0.
  [stdio] -Dcc="ccache gcc" -Accflags="-Werror=declaration-after-statement" -Duseithreads
  [stdio] -Dcc="ccache gcc" -Accflags="-Werror=declaration-after-statement" -Duseithreads DEBUGGING
~~ ../dist/threads/t/free.t .................................... FAILED Non-zero exit status: 255 No plan found in TAP output
  [stdio] -Dcc="ccache gcc" -Accflags="-Werror=declaration-after-statement" -Duseithreads
  [stdio] -Dcc="ccache gcc" -Accflags="-Werror=declaration-after-statement" -Duseithreads DEBUGGING
~~ ../ext/Hash-Util/t/Util.t ................................... FAILED Non-zero exit status: 255 No plan found in TAP output
  [stdio] -Dcc="ccache gcc" -Accflags="-Werror=declaration-after-statement" -Duseithreads
  [stdio] -Dcc="ccache gcc" -Accflags="-Werror=declaration-after-statement" DEBUGGING
  [stdio] -Dcc="ccache gcc" -Accflags="-Werror=declaration-after-statement"
  [stdio] -Dcc="ccache gcc" -Accflags="-Werror=declaration-after-statement" -Duseithreads DEBUGGING
~~ ../cpan/ExtUtils-MakeMaker/t/prereq_print.t ................. FAILED No plan found in TAP output
  [stdio] -Dcc="ccache gcc" -Accflags="-Werror=declaration-after-statement" -Duseithreads
  [stdio] -Dcc="ccache gcc" -Accflags="-Werror=declaration-after-statement" -Duseithreads DEBUGGING
~~ ../cpan/Test-Simple/t/Test2/acceptance/try_it_fork.t ........ FAILED Non-zero exit status: 255 No plan found in TAP output
  [stdio] -Dcc="ccache gcc" -Accflags="-Werror=declaration-after-statement" -Duseithreads
  [stdio] -Dcc="ccache gcc" -Accflags="-Werror=declaration-after-statement" DEBUGGING
  [stdio] -Dcc="ccache gcc" -Accflags="-Werror=declaration-after-statement"
  [stdio] -Dcc="ccache gcc" -Accflags="-Werror=declaration-after-statement" -Duseithreads DEBUGGING
~~ ../cpan/IO-Compress/t/110encode-deflate.t ................... FAILED No plan found in TAP output
  [stdio] -Dcc="ccache gcc" -Accflags="-Werror=declaration-after-statement" -Duseithreads
  [stdio] -Dcc="ccache gcc" -Accflags="-Werror=declaration-after-statement" -Duseithreads DEBUGGING
~~ ../dist/Storable/t/forgive.t ................................ FAILED No plan found in TAP output
  [stdio] -Dcc="ccache gcc" -Accflags="-Werror=declaration-after-statement" -Duseithreads
  [stdio] -Dcc="ccache gcc" -Accflags="-Werror=declaration-after-statement" -Duseithreads DEBUGGING
~~ ../ext/XS-APItest/t/svpv_magic.t ............................ FAILED 9-10 Non-zero exit status: 2
  [stdio] -Dcc="ccache gcc" -Accflags="-Werror=declaration-after-statement" -Duseithreads
  [stdio] -Dcc="ccache gcc" -Accflags="-Werror=declaration-after-statement" DEBUGGING
  [stdio] -Dcc="ccache gcc" -Accflags="-Werror=declaration-after-statement"
  [stdio] -Dcc="ccache gcc" -Accflags="-Werror=declaration-after-statement" -Duseithreads DEBUGGING
~~ ../cpan/ExtUtils-MakeMaker/t/backwards.t .................... FAILED Bad plan.  You planned 2 tests but ran 0.
  [stdio] -Dcc="ccache gcc" -Accflags="-Werror=declaration-after-statement" -Duseithreads
  [stdio] -Dcc="ccache gcc" -Accflags="-Werror=declaration-after-statement" -Duseithreads DEBUGGING
~~ ../ext/PerlIO-encoding/t/nolooping.t ........................ FAILED Bad plan.  You planned 1 tests but ran 0.
  [stdio] -Dcc="ccache gcc" -Accflags="-Werror=declaration-after-statement" -Duseithreads
  [stdio] -Dcc="ccache gcc" -Accflags="-Werror=declaration-after-statement" -Duseithreads DEBUGGING
~~ ../cpan/Text-ParseWords/t/ParseWords.t ...................... FAILED Non-zero exit status: 255 Bad plan.  You planned 27 tests but ran 0.
  [stdio] -Dcc="ccache gcc" -Accflags="-Werror=declaration-after-statement" -Duseithreads
  [stdio] -Dcc="ccache gcc" -Accflags="-Werror=declaration-after-statement" DEBUGGING
  [stdio] -Dcc="ccache gcc" -Accflags="-Werror=declaration-after-statement"
  [stdio] -Dcc="ccache gcc" -Accflags="-Werror=declaration-after-statement" -Duseithreads DEBUGGING
~~ ../cpan/Encode/t/CJKT.t ..................................... FAILED Bad plan.  You planned 60 tests but ran 0.
  [stdio] -Dcc="ccache gcc" -Accflags="-Werror=declaration-after-statement" -Duseithreads
  [stdio] -Dcc="ccache gcc" -Accflags="-Werror=declaration-after-statement" -Duseithreads DEBUGGING
~~ ../cpan/ExtUtils-MakeMaker/t/meta_convert.t ................. FAILED No plan found in TAP output
  [stdio] -Dcc="ccache gcc" -Accflags="-Werror=declaration-after-statement" -Duseithreads
  [stdio] -Dcc="ccache gcc" -Accflags="-Werror=declaration-after-statement" -Duseithreads DEBUGGING
~~ ../lib/warnings.t ........................................... FAILED 1-8 133 188 231-232 267-268 298 345 371-375 431-436 459-471 491-498 523-526 614-617 640 668 705-708 739 796 831 865-867 911-916
  [stdio] -Dcc="ccache gcc" -Accflags="-Werror=declaration-after-statement" -Duseithreads
  [stdio] -Dcc="ccache gcc" -Accflags="-Werror=declaration-after-statement" DEBUGGING
  [stdio] -Dcc="ccache gcc" -Accflags="-Werror=declaration-after-statement"
  [stdio] -Dcc="ccache gcc" -Accflags="-Werror=declaration-after-statement" -Duseithreads DEBUGGING
~~ ../cpan/ExtUtils-MakeMaker/t/cd.t ........................... FAILED Non-zero exit status: 255 Bad plan.  You planned 4 tests but ran 0.
  [stdio] -Dcc="ccache gcc" -Accflags="-Werror=declaration-after-statement" DEBUGGING
  [stdio] -Dcc="ccache gcc" -Accflags="-Werror=declaration-after-statement"
~~ ../cpan/Encode/t/Unicode.t .................................. FAILED Bad plan.  You planned 56 tests but ran 0.
  [stdio] -Dcc="ccache gcc" -Accflags="-Werror=declaration-after-statement" -Duseithreads
  [stdio] -Dcc="ccache gcc" -Accflags="-Werror=declaration-after-statement" -Duseithreads DEBUGGING
~~ ../cpan/Pod-Simple/t/encod02.t .............................. FAILED Bad plan.  You planned 4 tests but ran 1.
  [stdio] -Dcc="ccache gcc" -Accflags="-Werror=declaration-after-statement" -Duseithreads
  [stdio] -Dcc="ccache gcc" -Accflags="-Werror=declaration-after-statement" -Duseithreads DEBUGGING
~~ ../dist/Storable/t/circular_hook.t .......................... FAILED No plan found in TAP output
  [stdio] -Dcc="ccache gcc" -Accflags="-Werror=declaration-after-statement" -Duseithreads
  [stdio] -Dcc="ccache gcc" -Accflags="-Werror=declaration-after-statement" -Duseithreads DEBUGGING
~~ ../cpan/CPAN-Meta/t/validator.t ............................. FAILED No plan found in TAP output
  [stdio] -Dcc="ccache gcc" -Accflags="-Werror=declaration-after-statement" -Duseithreads
  [stdio] -Dcc="ccache gcc" -Accflags="-Werror=declaration-after-statement" -Duseithreads DEBUGGING
~~ ../cpan/podlators/t/man/empty.t ............................. FAILED Bad plan.  You planned 8 tests but ran 0.
  [stdio] -Dcc="ccache gcc" -Accflags="-Werror=declaration-after-statement" -Duseithreads
  [stdio] -Dcc="ccache gcc" -Accflags="-Werror=declaration-after-statement" -Duseithreads DEBUGGING
~~ ../lib/locale.t ............................................. FAILED Non-zero exit status: 255 No plan found in TAP output
  [stdio] -Dcc="ccache gcc" -Accflags="-Werror=declaration-after-statement" -Duseithreads
  [stdio] -Dcc="ccache gcc" -Accflags="-Werror=declaration-after-statement" DEBUGGING
  [stdio] -Dcc="ccache gcc" -Accflags="-Werror=declaration-after-statement"
  [stdio] -Dcc="ccache gcc" -Accflags="-Werror=declaration-after-statement" -Duseithreads DEBUGGING
~~ ../cpan/Pod-Checker/t/pod/selfcheck.t ....................... FAILED Non-zero exit status: 255 No plan found in TAP output
  [stdio] -Dcc="ccache gcc" -Accflags="-Werror=declaration-after-statement" -Duseithreads
  [stdio] -Dcc="ccache gcc" -Accflags="-Werror=declaration-after-statement" DEBUGGING
  [stdio] -Dcc="ccache gcc" -Accflags="-Werror=declaration-after-statement"
  [stdio] -Dcc="ccache gcc" -Accflags="-Werror=declaration-after-statement" -Duseithreads DEBUGGING
~~ ../dist/Storable/t/regexp.t ................................. FAILED Non-zero exit status: 255 Bad plan.  You planned 64 tests but ran 4.
  [stdio] -Dcc="ccache gcc" -Accflags="-Werror=declaration-after-statement"
~~ ../cpan/Encode/t/perlio.t ................................... FAILED Bad plan.  You planned 38 tests but ran 0.
  [stdio] -Dcc="ccache gcc" -Accflags="-Werror=declaration-after-statement" -Duseithreads
  [stdio] -Dcc="ccache gcc" -Accflags="-Werror=declaration-after-statement" -Duseithreads DEBUGGING
~~ ../cpan/Encode/t/rt76824.t .................................. FAILED No plan found in TAP output
  [stdio] -Dcc="ccache gcc" -Accflags="-Werror=declaration-after-statement" -Duseithreads
  [stdio] -Dcc="ccache gcc" -Accflags="-Werror=declaration-after-statement" -Duseithreads DEBUGGING
~~ ../dist/threads-shared/t/hv_refs.t .......................... FAILED Non-zero exit status: 255 Bad plan.  You planned 20 tests but ran 0.
  [stdio] -Dcc="ccache gcc" -Accflags="-Werror=declaration-after-statement" -Duseithreads
  [stdio] -Dcc="ccache gcc" -Accflags="-Werror=declaration-after-statement" -Duseithreads DEBUGGING
~~ ../dist/threads-shared/t/sv_simple.t ........................ FAILED Non-zero exit status: 255 Bad plan.  You planned 11 tests but ran 0.
  [stdio] -Dcc="ccache gcc" -Accflags="-Werror=declaration-after-statement" -Duseithreads
  [stdio] -Dcc="ccache gcc" -Accflags="-Werror=declaration-after-statement" -Duseithreads DEBUGGING
~~ ../cpan/ExtUtils-MakeMaker/t/FIRST_MAKEFILE.t ............... FAILED Bad plan.  You planned 7 tests but ran 0.
  [stdio] -Dcc="ccache gcc" -Accflags="-Werror=declaration-after-statement" -Duseithreads
  [stdio] -Dcc="ccache gcc" -Accflags="-Werror=declaration-after-statement" -Duseithreads DEBUGGING
~~ ../cpan/version/t/07locale.t ................................ FAILED Non-zero exit status: 255 Bad plan.  You planned 8 tests but ran 1.
  [stdio] -Dcc="ccache gcc" -Accflags="-Werror=declaration-after-statement" -Duseithreads
  [stdio] -Dcc="ccache gcc" -Accflags="-Werror=declaration-after-statement" DEBUGGING
  [stdio] -Dcc="ccache gcc" -Accflags="-Werror=declaration-after-statement"
  [stdio] -Dcc="ccache gcc" -Accflags="-Werror=declaration-after-statement" -Duseithreads DEBUGGING
~~ ../cpan/Test-Simple/t/Test2/modules/API/Stack.t ............. FAILED No plan found in TAP output
  [stdio] -Dcc="ccache gcc" -Accflags="-Werror=declaration-after-statement" -Duseithreads
  [stdio] -Dcc="ccache gcc" -Accflags="-Werror=declaration-after-statement" -Duseithreads DEBUGGING
~~ ../ext/B/t/optree_concise.t ................................. FAILED Non-zero exit status: 255 No plan found in TAP output
  [stdio] -Dcc="ccache gcc" -Accflags="-Werror=declaration-after-statement" -Duseithreads
  [stdio] -Dcc="ccache gcc" -Accflags="-Werror=declaration-after-statement" DEBUGGING
  [stdio] -Dcc="ccache gcc" -Accflags="-Werror=declaration-after-statement"
  [stdio] -Dcc="ccache gcc" -Accflags="-Werror=declaration-after-statement" -Duseithreads DEBUGGING
~~ ../lib/sigtrap.t ............................................ FAILED 13
  [stdio] -Dcc="ccache gcc" -Accflags="-Werror=declaration-after-statement" -Duseithreads
  [stdio] -Dcc="ccache gcc" -Accflags="-Werror=declaration-after-statement" DEBUGGING
  [stdio] -Dcc="ccache gcc" -Accflags="-Werror=declaration-after-statement"
  [stdio] -Dcc="ccache gcc" -Accflags="-Werror=declaration-after-statement" -Duseithreads DEBUGGING
~~ ../cpan/Test-Simple/t/Test2/regression/693_ipc_ordering.t ... FAILED No plan found in TAP output
  [stdio] -Dcc="ccache gcc" -Accflags="-Werror=declaration-after-statement" -Duseithreads
  [stdio] -Dcc="ccache gcc" -Accflags="-Werror=declaration-after-statement" -Duseithreads DEBUGGING
~~ ../cpan/Encode/t/utf8ref.t .................................. FAILED No plan found in TAP output
  [stdio] -Dcc="ccache gcc" -Accflags="-Werror=declaration-after-statement" -Duseithreads
  [stdio] -Dcc="ccache gcc" -Accflags="-Werror=declaration-after-statement" -Duseithreads DEBUGGING
~~ ../ext/B/t/optree_specials.t ................................ FAILED 3
  [stdio] -Dcc="ccache gcc" -Accflags="-Werror=declaration-after-statement" -Duseithreads
  [stdio] -Dcc="ccache gcc" -Accflags="-Werror=declaration-after-statement" DEBUGGING
  [stdio] -Dcc="ccache gcc" -Accflags="-Werror=declaration-after-statement"
  [stdio] -Dcc="ccache gcc" -Accflags="-Werror=declaration-after-statement" -Duseithreads DEBUGGING
~~ ../dist/threads-shared/t/dualvar.t .......................... FAILED Non-zero exit status: 255 Bad plan.  You planned 226 tests but ran 0.
  [stdio] -Dcc="ccache gcc" -Accflags="-Werror=declaration-after-statement" -Duseithreads
  [stdio] -Dcc="ccache gcc" -Accflags="-Werror=declaration-after-statement" -Duseithreads DEBUGGING
~~ ../cpan/ExtUtils-MakeMaker/t/eu_command.t ................... FAILED Non-zero exit status: 255 No plan found in TAP output
  [stdio] -Dcc="ccache gcc" -Accflags="-Werror=declaration-after-statement" -Duseithreads
  [stdio] -Dcc="ccache gcc" -Accflags="-Werror=declaration-after-statement" DEBUGGING
  [stdio] -Dcc="ccache gcc" -Accflags="-Werror=declaration-after-statement"
  [stdio] -Dcc="ccache gcc" -Accflags="-Werror=declaration-after-statement" -Duseithreads DEBUGGING
~~ ../cpan/CPAN-Meta-YAML/t/12_write.t ......................... FAILED No plan found in TAP output
  [stdio] -Dcc="ccache gcc" -Accflags="-Werror=declaration-after-statement" -Duseithreads
  [stdio] -Dcc="ccache gcc" -Accflags="-Werror=declaration-after-statement" -Duseithreads DEBUGGING
~~ ../lib/ExtUtils/t/Embed.t ................................... FAILED Bad plan.  You planned 10 tests but ran 0.
  [stdio] -Dcc="ccache gcc" -Accflags="-Werror=declaration-after-statement" -Duseithreads
  [stdio] -Dcc="ccache gcc" -Accflags="-Werror=declaration-after-statement" -Duseithreads DEBUGGING
~~ ../ext/FileCache/t/05override.t ............................. FAILED Non-zero exit status: 25 Bad plan.  You planned 1 tests but ran 0.
  [stdio] -Dcc="ccache gcc" -Accflags="-Werror=declaration-after-statement" -Duseithreads
  [stdio] -Dcc="ccache gcc" -Accflags="-Werror=declaration-after-statement" DEBUGGING
  [stdio] -Dcc="ccache gcc" -Accflags="-Werror=declaration-after-statement"
  [stdio] -Dcc="ccache gcc" -Accflags="-Werror=declaration-after-statement" -Duseithreads DEBUGGING
~~ ../cpan/Compress-Raw-Zlib/t/18lvalue.t ...................... FAILED Non-zero exit status: 255 No plan found in TAP output
  [stdio] -Dcc="ccache gcc" -Accflags="-Werror=declaration-after-statement" -Duseithreads
  [stdio] -Dcc="ccache gcc" -Accflags="-Werror=declaration-after-statement" DEBUGGING
  [stdio] -Dcc="ccache gcc" -Accflags="-Werror=declaration-after-statement"
  [stdio] -Dcc="ccache gcc" -Accflags="-Werror=declaration-after-statement" -Duseithreads DEBUGGING
~~ ../t/io/binmode.t ........................................... FAILED 10
  [stdio] -Dcc="ccache gcc" -Accflags="-Werror=declaration-after-statement" -Duseithreads
  [stdio] -Dcc="ccache gcc" -Accflags="-Werror=declaration-after-statement" -Duseithreads DEBUGGING
~~ ../dist/Thread-Semaphore/t/04_nonblocking.t ................. FAILED Non-zero exit status: 255 No plan found in TAP output
  [stdio] -Dcc="ccache gcc" -Accflags="-Werror=declaration-after-statement" -Duseithreads
  [stdio] -Dcc="ccache gcc" -Accflags="-Werror=declaration-after-statement" -Duseithreads DEBUGGING
~~ ../dist/Storable/t/weak.t ................................... FAILED No plan found in TAP output
  [stdio] -Dcc="ccache gcc" -Accflags="-Werror=declaration-after-statement" -Duseithreads
  [stdio] -Dcc="ccache gcc" -Accflags="-Werror=declaration-after-statement" DEBUGGING
  [stdio] -Dcc="ccache gcc" -Accflags="-Werror=declaration-after-statement" -Duseithreads DEBUGGING
~~ ../cpan/Text-Balanced/t/03_extcbk.t ......................... FAILED Non-zero exit status: 255 Bad plan.  You planned 41 tests but ran 0.
  [stdio] -Dcc="ccache gcc" -Accflags="-Werror=declaration-after-statement" -Duseithreads
  [stdio] -Dcc="ccache gcc" -Accflags="-Werror=declaration-after-statement" DEBUGGING
  [stdio] -Dcc="ccache gcc" -Accflags="-Werror=declaration-after-statement"
  [stdio] -Dcc="ccache gcc" -Accflags="-Werror=declaration-after-statement" -Duseithreads DEBUGGING
~~ ../cpan/Test-Simple/t/Test2/acceptance/try_it_threads.t ..... FAILED Non-zero exit status: 255 No plan found in TAP output
  [stdio] -Dcc="ccache gcc" -Accflags="-Werror=declaration-after-statement" -Duseithreads
  [stdio] -Dcc="ccache gcc" -Accflags="-Werror=declaration-after-statement" DEBUGGING
  [stdio] -Dcc="ccache gcc" -Accflags="-Werror=declaration-after-statement"
  [stdio] -Dcc="ccache gcc" -Accflags="-Werror=declaration-after-statement" -Duseithreads DEBUGGING
~~ ../cpan/ExtUtils-MakeMaker/t/metafile_data.t ................ FAILED No plan found in TAP output
  [stdio] -Dcc="ccache gcc" -Accflags="-Werror=declaration-after-statement" -Duseithreads
  [stdio] -Dcc="ccache gcc" -Accflags="-Werror=declaration-after-statement" -Duseithreads DEBUGGING
~~ ../cpan/Test-Simple/t/Test2/modules/API/Instance.t .......... FAILED No plan found in TAP output
  [stdio] -Dcc="ccache gcc" -Accflags="-Werror=declaration-after-statement" -Duseithreads
  [stdio] -Dcc="ccache gcc" -Accflags="-Werror=declaration-after-statement" -Duseithreads DEBUGGING
~~ ../dist/Thread-Queue/t/01_basic.t ........................... FAILED Non-zero exit status: 255 No plan found in TAP output
  [stdio] -Dcc="ccache gcc" -Accflags="-Werror=declaration-after-statement" -Duseithreads
  [stdio] -Dcc="ccache gcc" -Accflags="-Werror=declaration-after-statement" -Duseithreads DEBUGGING
~~ ../dist/Storable/t/compat01.t ............................... FAILED No plan found in TAP output
  [stdio] -Dcc="ccache gcc" -Accflags="-Werror=declaration-after-statement" -Duseithreads
  [stdio] -Dcc="ccache gcc" -Accflags="-Werror=declaration-after-statement" -Duseithreads DEBUGGING
~~ ../cpan/podlators/t/general/pod-parser.t .................... FAILED Bad plan.  You planned 7 tests but ran 0.
  [stdio] -Dcc="ccache gcc" -Accflags="-Werror=declaration-after-statement" -Duseithreads
  [stdio] -Dcc="ccache gcc" -Accflags="-Werror=declaration-after-statement" -Duseithreads DEBUGGING
~~ ../dist/threads/t/err.t ..................................... FAILED 1 Non-zero exit status: 255 Bad plan.  You planned 10 tests but ran 1.
  [stdio] -Dcc="ccache gcc" -Accflags="-Werror=declaration-after-statement" -Duseithreads
  [stdio] -Dcc="ccache gcc" -Accflags="-Werror=declaration-after-statement" -Duseithreads DEBUGGING
~~ ../cpan/Pod-Perldoc/t/man/_get_columns.t .................... FAILED No plan found in TAP output
  [stdio] -Dcc="ccache gcc" -Accflags="-Werror=declaration-after-statement" -Duseithreads
  [stdio] -Dcc="ccache gcc" -Accflags="-Werror=declaration-after-statement" -Duseithreads DEBUGGING
~~ ../dist/Storable/t/attach_errors.t .......................... FAILED Bad plan.  You planned 40 tests but ran 0.
  [stdio] -Dcc="ccache gcc" -Accflags="-Werror=declaration-after-statement" -Duseithreads
  [stdio] -Dcc="ccache gcc" -Accflags="-Werror=declaration-after-statement" -Duseithreads DEBUGGING
~~ ../t/re/fold_grind_a.t ...................................... FAILED No plan found in TAP output
  [stdio] -Dcc="ccache gcc" -Accflags="-Werror=declaration-after-statement" -Duseithreads
  [stdio] -Dcc="ccache gcc" -Accflags="-Werror=declaration-after-statement" -Duseithreads DEBUGGING
~~ ../dist/threads/t/stress_re.t ............................... FAILED Non-zero exit status: 255 Bad plan.  You planned 61 tests but ran 0.
  [stdio] -Dcc="ccache gcc" -Accflags="-Werror=declaration-after-statement" -Duseithreads
  [stdio] -Dcc="ccache gcc" -Accflags="-Werror=declaration-after-statement" -Duseithreads DEBUGGING
~~ ../cpan/Test-Harness/t/rulesfile.t .......................... FAILED Bad plan.  You planned 4 tests but ran 0.
  [stdio] -Dcc="ccache gcc" -Accflags="-Werror=declaration-after-statement" -Duseithreads
  [stdio] -Dcc="ccache gcc" -Accflags="-Werror=declaration-after-statement" -Duseithreads DEBUGGING
~~ ../t/re/fold_grind_8.t ...................................... FAILED No plan found in TAP output
  [stdio] -Dcc="ccache gcc" -Accflags="-Werror=declaration-after-statement" -Duseithreads
  [stdio] -Dcc="ccache gcc" -Accflags="-Werror=declaration-after-statement" -Duseithreads DEBUGGING
~~ ../cpan/CPAN-Meta/t/converter-fail.t ........................ FAILED No plan found in TAP output
  [stdio] -Dcc="ccache gcc" -Accflags="-Werror=declaration-after-statement" -Duseithreads
  [stdio] -Dcc="ccache gcc" -Accflags="-Werror=declaration-after-statement" -Duseithreads DEBUGGING
~~ ../cpan/Encode/t/Encode.t ................................... FAILED No plan found in TAP output
  [stdio] -Dcc="ccache gcc" -Accflags="-Werror=declaration-after-statement" -Duseithreads
  [stdio] -Dcc="ccache gcc" -Accflags="-Werror=declaration-after-statement" -Duseithreads DEBUGGING
~~ ../cpan/ExtUtils-MakeMaker/t/split_command.t ................ FAILED No plan found in TAP output
  [stdio] -Dcc="ccache gcc" -Accflags="-Werror=declaration-after-statement" -Duseithreads
  [stdio] -Dcc="ccache gcc" -Accflags="-Werror=declaration-after-statement" -Duseithreads DEBUGGING
~~ ../dist/Exporter/t/warn.t ................................... FAILED Non-zero exit status: 255 No plan found in TAP output
  [stdio] -Dcc="ccache gcc" -Accflags="-Werror=declaration-after-statement" -Duseithreads
  [stdio] -Dcc="ccache gcc" -Accflags="-Werror=declaration-after-statement" DEBUGGING
  [stdio] -Dcc="ccache gcc" -Accflags="-Werror=declaration-after-statement"
  [stdio] -Dcc="ccache gcc" -Accflags="-Werror=declaration-after-statement" -Duseithreads DEBUGGING
~~ ../cpan/Encode/t/cow.t ...................................... FAILED No plan found in TAP output
  [stdio] -Dcc="ccache gcc" -Accflags="-Werror=declaration-after-statement" -Duseithreads
  [stdio] -Dcc="ccache gcc" -Accflags="-Werror=declaration-after-statement" -Duseithreads DEBUGGING
~~ ../ext/POSIX/t/sigaction.t .................................. FAILED Non-zero exit status: 255 Bad plan.  You planned 36 tests but ran 0.
  [stdio] -Dcc="ccache gcc" -Accflags="-Werror=declaration-after-statement" -Duseithreads
  [stdio] -Dcc="ccache gcc" -Accflags="-Werror=declaration-after-statement" DEBUGGING
  [stdio] -Dcc="ccache gcc" -Accflags="-Werror=declaration-after-statement"
  [stdio] -Dcc="ccache gcc" -Accflags="-Werror=declaration-after-statement" -Duseithreads DEBUGGING
~~ ../t/uni/labels.t ........................................... FAILED Bad plan.  You planned 10 tests but ran 1.
  [stdio] -Dcc="ccache gcc" -Accflags="-Werror=declaration-after-statement" -Duseithreads
  [stdio] -Dcc="ccache gcc" -Accflags="-Werror=declaration-after-statement" -Duseithreads DEBUGGING
~~ ../cpan/Test-Simple/t/regression/todo_and_facets.t .......... FAILED Non-zero exit status: 255 No plan found in TAP output
  [stdio] -Dcc="ccache gcc" -Accflags="-Werror=declaration-after-statement" -Duseithreads
  [stdio] -Dcc="ccache gcc" -Accflags="-Werror=declaration-after-statement" DEBUGGING
  [stdio] -Dcc="ccache gcc" -Accflags="-Werror=declaration-after-statement"
  [stdio] -Dcc="ccache gcc" -Accflags="-Werror=declaration-after-statement" -Duseithreads DEBUGGING
~~ ../dist/threads-shared/t/waithires.t ........................ FAILED Non-zero exit status: 255 Bad plan.  You planned 63 tests but ran 0.
  [stdio] -Dcc="ccache gcc" -Accflags="-Werror=declaration-after-statement" -Duseithreads
  [stdio] -Dcc="ccache gcc" -Accflags="-Werror=declaration-after-statement" -Duseithreads DEBUGGING
~~ ../cpan/ExtUtils-MakeMaker/t/cd.t ........................... FAILED Bad plan.  You planned 4 tests but ran 0.
  [stdio] -Dcc="ccache gcc" -Accflags="-Werror=declaration-after-statement" -Duseithreads
  [stdio] -Dcc="ccache gcc" -Accflags="-Werror=declaration-after-statement" -Duseithreads DEBUGGING
~~ ../dist/threads-shared/t/clone.t ............................ FAILED Non-zero exit status: 255 Bad plan.  You planned 40 tests but ran 0.
  [stdio] -Dcc="ccache gcc" -Accflags="-Werror=declaration-after-statement" -Duseithreads
  [stdio] -Dcc="ccache gcc" -Accflags="-Werror=declaration-after-statement" -Duseithreads DEBUGGING
~~ ../cpan/JSON-PP/t/gh_28_json_test_suite.t ................... FAILED Bad plan.  You planned 20 tests but ran 14.
  [stdio] -Dcc="ccache gcc" -Accflags="-Werror=declaration-after-statement" -Duseithreads
  [stdio] -Dcc="ccache gcc" -Accflags="-Werror=declaration-after-statement" -Duseithreads DEBUGGING
~~ ../ext/PerlIO-encoding/t/threads.t .......................... FAILED Non-zero exit status: 255 No plan found in TAP output
  [stdio] -Dcc="ccache gcc" -Accflags="-Werror=declaration-after-statement" -Duseithreads
  [stdio] -Dcc="ccache gcc" -Accflags="-Werror=declaration-after-statement" -Duseithreads DEBUGGING
~~ ../cpan/CPAN-Meta/t/save-load.t ............................. FAILED No plan found in TAP output
  [stdio] -Dcc="ccache gcc" -Accflags="-Werror=declaration-after-statement" -Duseithreads
  [stdio] -Dcc="ccache gcc" -Accflags="-Werror=declaration-after-statement" -Duseithreads DEBUGGING
~~ ../cpan/ExtUtils-MakeMaker/t/pm_to_blib.t ................... FAILED No plan found in TAP output
  [stdio] -Dcc="ccache gcc" -Accflags="-Werror=declaration-after-statement" -Duseithreads
  [stdio] -Dcc="ccache gcc" -Accflags="-Werror=declaration-after-statement" -Duseithreads DEBUGGING
~~ ../cpan/ExtUtils-MakeMaker/t/WriteEmptyMakefile.t ........... FAILED Bad plan.  You planned 5 tests but ran 0.
  [stdio] -Dcc="ccache gcc" -Accflags="-Werror=declaration-after-statement" -Duseithreads
  [stdio] -Dcc="ccache gcc" -Accflags="-Werror=declaration-after-statement" -Duseithreads DEBUGGING
~~ ../dist/Thread-Queue/t/02_refs.t ............................ FAILED Non-zero exit status: 255 No plan found in TAP output
  [stdio] -Dcc="ccache gcc" -Accflags="-Werror=declaration-after-statement" -Duseithreads
  [stdio] -Dcc="ccache gcc" -Accflags="-Werror=declaration-after-statement" -Duseithreads DEBUGGING
~~ ../cpan/Test-Simple/t/Legacy/buffer.t ....................... FAILED Non-zero exit status: 255 Bad plan.  You planned 20 tests but ran 0.
  [stdio] -Dcc="ccache gcc" -Accflags="-Werror=declaration-after-statement" -Duseithreads
  [stdio] -Dcc="ccache gcc" -Accflags="-Werror=declaration-after-statement" DEBUGGING
  [stdio] -Dcc="ccache gcc" -Accflags="-Werror=declaration-after-statement"
  [stdio] -Dcc="ccache gcc" -Accflags="-Werror=declaration-after-statement" -Duseithreads DEBUGGING
~~ ../cpan/ExtUtils-MakeMaker/t/03-xsstatic.t .................. FAILED No plan found in TAP output
  [stdio] -Dcc="ccache gcc" -Accflags="-Werror=declaration-after-statement" -Duseithreads
  [stdio] -Dcc="ccache gcc" -Accflags="-Werror=declaration-after-statement" -Duseithreads DEBUGGING
~~ ../ext/POSIX/t/mb.t ......................................... FAILED Non-zero exit status: 255 No plan found in TAP output
  [stdio] -Dcc="ccache gcc" -Accflags="-Werror=declaration-after-statement" -Duseithreads
  [stdio] -Dcc="ccache gcc" -Accflags="-Werror=declaration-after-statement" DEBUGGING
  [stdio] -Dcc="ccache gcc" -Accflags="-Werror=declaration-after-statement"
  [stdio] -Dcc="ccache gcc" -Accflags="-Werror=declaration-after-statement" -Duseithreads DEBUGGING
~~ ../cpan/ExtUtils-MakeMaker/t/02-xsdynamic.t ................. FAILED No plan found in TAP output
  [stdio] -Dcc="ccache gcc" -Accflags="-Werror=declaration-after-statement" -Duseithreads
  [stdio] -Dcc="ccache gcc" -Accflags="-Werror=declaration-after-statement" -Duseithreads DEBUGGING
~~ ../t/re/fold_grind_aa.t ..................................... FAILED No plan found in TAP output
  [stdio] -Dcc="ccache gcc" -Accflags="-Werror=declaration-after-statement" -Duseithreads
  [stdio] -Dcc="ccache gcc" -Accflags="-Werror=declaration-after-statement" -Duseithreads DEBUGGING
~~ ../cpan/ExtUtils-MakeMaker/t/VERSION_FROM.t ................. FAILED Bad plan.  You planned 1 tests but ran 0.
  [stdio] -Dcc="ccache gcc" -Accflags="-Werror=declaration-after-statement" -Duseithreads
  [stdio] -Dcc="ccache gcc" -Accflags="-Werror=declaration-after-statement" -Duseithreads DEBUGGING
~~ ../ext/PerlIO-scalar/t/scalar.t ............................. FAILED Non-zero exit status: 255 Bad plan.  You planned 123 tests but ran 82.
  [stdio] -Dcc="ccache gcc" -Accflags="-Werror=declaration-after-statement" -Duseithreads
  [stdio] -Dcc="ccache gcc" -Accflags="-Werror=declaration-after-statement" -Duseithreads DEBUGGING
~~ ../ext/POSIX/t/taint.t ...................................... FAILED Non-zero exit status: 255 No plan found in TAP output
  [stdio] -Dcc="ccache gcc" -Accflags="-Werror=declaration-after-statement" -Duseithreads
  [stdio] -Dcc="ccache gcc" -Accflags="-Werror=declaration-after-statement" DEBUGGING
  [stdio] -Dcc="ccache gcc" -Accflags="-Werror=declaration-after-statement"
  [stdio] -Dcc="ccache gcc" -Accflags="-Werror=declaration-after-statement" -Duseithreads DEBUGGING
~~ ../cpan/Encode/t/rt65541.t .................................. FAILED No plan found in TAP output
  [stdio] -Dcc="ccache gcc" -Accflags="-Werror=declaration-after-statement" -Duseithreads
  [stdio] -Dcc="ccache gcc" -Accflags="-Werror=declaration-after-statement" -Duseithreads DEBUGGING
~~ ../cpan/Compress-Raw-Zlib/t/09limitoutput.t ................. FAILED Non-zero exit status: 255 No plan found in TAP output
  [stdio] -Dcc="ccache gcc" -Accflags="-Werror=declaration-after-statement" -Duseithreads
  [stdio] -Dcc="ccache gcc" -Accflags="-Werror=declaration-after-statement" DEBUGGING
  [stdio] -Dcc="ccache gcc" -Accflags="-Werror=declaration-after-statement"
  [stdio] -Dcc="ccache gcc" -Accflags="-Werror=declaration-after-statement" -Duseithreads DEBUGGING
~~ ../dist/Data-Dumper/t/qr.t .................................. FAILED 1-2 Non-zero exit status: 2
  [stdio] -Dcc="ccache gcc" -Accflags="-Werror=declaration-after-statement" -Duseithreads
  [stdio] -Dcc="ccache gcc" -Accflags="-Werror=declaration-after-statement" DEBUGGING
  [stdio] -Dcc="ccache gcc" -Accflags="-Werror=declaration-after-statement"
  [stdio] -Dcc="ccache gcc" -Accflags="-Werror=declaration-after-statement" -Duseithreads DEBUGGING
~~ ../t/re/regexp_qr_embed_thr.t ............................... FAILED Non-zero exit status: 255 No plan found in TAP output
  [stdio] -Dcc="ccache gcc" -Accflags="-Werror=declaration-after-statement" -Duseithreads
  [stdio] -Dcc="ccache gcc" -Accflags="-Werror=declaration-after-statement" -Duseithreads DEBUGGING
~~ ../t/re/regexp_unicode_prop_thr.t ........................... FAILED Non-zero exit status: 255 No plan found in TAP output
  [stdio] -Dcc="ccache gcc" -Accflags="-Werror=declaration-after-statement" -Duseithreads
  [stdio] -Dcc="ccache gcc" -Accflags="-Werror=declaration-after-statement" -Duseithreads DEBUGGING
~~ ../cpan/Compress-Raw-Bzip2/t/09limitoutput.t ................ FAILED Non-zero exit status: 255 No plan found in TAP output
  [stdio] -Dcc="ccache gcc" -Accflags="-Werror=declaration-after-statement" -Duseithreads
  [stdio] -Dcc="ccache gcc" -Accflags="-Werror=declaration-after-statement" DEBUGGING
  [stdio] -Dcc="ccache gcc" -Accflags="-Werror=declaration-after-statement"
  [stdio] -Dcc="ccache gcc" -Accflags="-Werror=declaration-after-statement" -Duseithreads DEBUGGING
~~ ../dist/threads/t/list.t .................................... FAILED Non-zero exit status: 255 Bad plan.  You planned 15 tests but ran 0.
  [stdio] -Dcc="ccache gcc" -Accflags="-Werror=declaration-after-statement" -Duseithreads
  [stdio] -Dcc="ccache gcc" -Accflags="-Werror=declaration-after-statement" -Duseithreads DEBUGGING
~~ ../dist/Thread-Queue/t/11_limit.t ........................... FAILED Non-zero exit status: 255 No plan found in TAP output
  [stdio] -Dcc="ccache gcc" -Accflags="-Werror=declaration-after-statement" -Duseithreads
  [stdio] -Dcc="ccache gcc" -Accflags="-Werror=declaration-after-statement" -Duseithreads DEBUGGING
~~ ../t/op/threads.t ........................................... FAILED Non-zero exit status: 255 Bad plan.  You planned 30 tests but ran 0.
  [stdio] -Dcc="ccache gcc" -Accflags="-Werror=declaration-after-statement" -Duseithreads
  [stdio] -Dcc="ccache gcc" -Accflags="-Werror=declaration-after-statement" -Duseithreads DEBUGGING
~~ ../cpan/Test-Simple/t/Legacy/todo.t ......................... FAILED Non-zero exit status: 255 No plan found in TAP output
  [stdio] -Dcc="ccache gcc" -Accflags="-Werror=declaration-after-statement" -Duseithreads
  [stdio] -Dcc="ccache gcc" -Accflags="-Werror=declaration-after-statement" DEBUGGING
  [stdio] -Dcc="ccache gcc" -Accflags="-Werror=declaration-after-statement"
  [stdio] -Dcc="ccache gcc" -Accflags="-Werror=declaration-after-statement" -Duseithreads DEBUGGING
~~ ../dist/Storable/t/huge.t ................................... FAILED No plan found in TAP output
  [stdio] -Dcc="ccache gcc" -Accflags="-Werror=declaration-after-statement" -Duseithreads
  [stdio] -Dcc="ccache gcc" -Accflags="-Werror=declaration-after-statement" -Duseithreads DEBUGGING
~~ ../t/re/user_prop_race_thr.t ................................ FAILED Non-zero exit status: 255 Bad plan.  You planned 3 tests but ran 0.
  [stdio] -Dcc="ccache gcc" -Accflags="-Werror=declaration-after-statement" -Duseithreads
  [stdio] -Dcc="ccache gcc" -Accflags="-Werror=declaration-after-statement" -Duseithreads DEBUGGING
~~ ../ext/XS-APItest/t/utf16_to_utf8.t ......................... FAILED No plan found in TAP output
  [stdio] -Dcc="ccache gcc" -Accflags="-Werror=declaration-after-statement" -Duseithreads
  [stdio] -Dcc="ccache gcc" -Accflags="-Werror=declaration-after-statement" -Duseithreads DEBUGGING
~~ ../cpan/Encode/t/from_to.t .................................. FAILED Bad plan.  You planned 3 tests but ran 0.
  [stdio] -Dcc="ccache gcc" -Accflags="-Werror=declaration-after-statement" -Duseithreads
  [stdio] -Dcc="ccache gcc" -Accflags="-Werror=declaration-after-statement" -Duseithreads DEBUGGING
~~ ../dist/Storable/t/utf8.t ................................... FAILED No plan found in TAP output
  [stdio] -Dcc="ccache gcc" -Accflags="-Werror=declaration-after-statement" -Duseithreads
  [stdio] -Dcc="ccache gcc" -Accflags="-Werror=declaration-after-statement" -Duseithreads DEBUGGING
~~ ../t/op/getpid.t ............................................ FAILED 1 Non-zero exit status: 255 Bad plan.  You planned 3 tests but ran 1.
  [stdio] -Dcc="ccache gcc" -Accflags="-Werror=declaration-after-statement" -Duseithreads
  [stdio] -Dcc="ccache gcc" -Accflags="-Werror=declaration-after-statement" -Duseithreads DEBUGGING
~~ ../lib/Unicode/UCD.t ........................................ FAILED No plan found in TAP output
  [stdio] -Dcc="ccache gcc" -Accflags="-Werror=declaration-after-statement" -Duseithreads
  [stdio] -Dcc="ccache gcc" -Accflags="-Werror=declaration-after-statement" -Duseithreads DEBUGGING
~~ ../cpan/Memoize/t/tie_storable.t ............................ FAILED No plan found in TAP output
  [stdio] -Dcc="ccache gcc" -Accflags="-Werror=declaration-after-statement" -Duseithreads
  [stdio] -Dcc="ccache gcc" -Accflags="-Werror=declaration-after-statement" -Duseithreads DEBUGGING
~~ ../lib/B/Deparse-subclass.t ................................. FAILED Non-zero exit status: 255 Bad plan.  You planned 2 tests but ran 0.
  [stdio] -Dcc="ccache gcc" -Accflags="-Werror=declaration-after-statement" -Duseithreads
  [stdio] -Dcc="ccache gcc" -Accflags="-Werror=declaration-after-statement" DEBUGGING
  [stdio] -Dcc="ccache gcc" -Accflags="-Werror=declaration-after-statement"
  [stdio] -Dcc="ccache gcc" -Accflags="-Werror=declaration-after-statement" -Duseithreads DEBUGGING
~~ ../cpan/Test-Simple/t/regression/fork_first.t ............... FAILED No plan found in TAP output
  [stdio] -Dcc="ccache gcc" -Accflags="-Werror=declaration-after-statement" -Duseithreads
  [stdio] -Dcc="ccache gcc" -Accflags="-Werror=declaration-after-statement" -Duseithreads DEBUGGING
~~ ../lib/DBM_Filter/t/encode.t ................................ FAILED No plan found in TAP output
  [stdio] -Dcc="ccache gcc" -Accflags="-Werror=declaration-after-statement" -Duseithreads
  [stdio] -Dcc="ccache gcc" -Accflags="-Werror=declaration-after-statement" -Duseithreads DEBUGGING
~~ ../cpan/Compress-Raw-Zlib/t/07bufsize.t ..................... FAILED Non-zero exit status: 255 No plan found in TAP output
  [stdio] -Dcc="ccache gcc" -Accflags="-Werror=declaration-after-statement" -Duseithreads
  [stdio] -Dcc="ccache gcc" -Accflags="-Werror=declaration-after-statement" DEBUGGING
  [stdio] -Dcc="ccache gcc" -Accflags="-Werror=declaration-after-statement"
  [stdio] -Dcc="ccache gcc" -Accflags="-Werror=declaration-after-statement" -Duseithreads DEBUGGING
~~ ../cpan/Test-Simple/t/Legacy/utf8.t ......................... FAILED No plan found in TAP output
  [stdio] -Dcc="ccache gcc" -Accflags="-Werror=declaration-after-statement" -Duseithreads
  [stdio] -Dcc="ccache gcc" -Accflags="-Werror=declaration-after-statement" -Duseithreads DEBUGGING
~~ ../cpan/IPC-SysV/t/msg.t .................................... FAILED Non-zero exit status: 255 No plan found in TAP output
  [stdio] -Dcc="ccache gcc" -Accflags="-Werror=declaration-after-statement" -Duseithreads
  [stdio] -Dcc="ccache gcc" -Accflags="-Werror=declaration-after-statement" DEBUGGING
  [stdio] -Dcc="ccache gcc" -Accflags="-Werror=declaration-after-statement"
  [stdio] -Dcc="ccache gcc" -Accflags="-Werror=declaration-after-statement" -Duseithreads DEBUGGING
~~ ../cpan/Test-Simple/t/Legacy/fail-more.t .................... FAILED Non-zero exit status: 255 No plan found in TAP output
  [stdio] -Dcc="ccache gcc" -Accflags="-Werror=declaration-after-statement" -Duseithreads
  [stdio] -Dcc="ccache gcc" -Accflags="-Werror=declaration-after-statement" DEBUGGING
  [stdio] -Dcc="ccache gcc" -Accflags="-Werror=declaration-after-statement"
  [stdio] -Dcc="ccache gcc" -Accflags="-Werror=declaration-after-statement" -Duseithreads DEBUGGING
~~ ../cpan/ExtUtils-MakeMaker/t/vstrings.t ..................... FAILED No plan found in TAP output
  [stdio] -Dcc="ccache gcc" -Accflags="-Werror=declaration-after-statement" -Duseithreads
  [stdio] -Dcc="ccache gcc" -Accflags="-Werror=declaration-after-statement" -Duseithreads DEBUGGING
~~ ../ext/B/t/concise-xs.t ..................................... FAILED Non-zero exit status: 255
  [stdio] -Dcc="ccache gcc" -Accflags="-Werror=declaration-after-statement" -Duseithreads
  [stdio] -Dcc="ccache gcc" -Accflags="-Werror=declaration-after-statement" DEBUGGING
  [stdio] -Dcc="ccache gcc" -Accflags="-Werror=declaration-after-statement"
  [stdio] -Dcc="ccache gcc" -Accflags="-Werror=declaration-after-statement" -Duseithreads DEBUGGING
~~ ../t/re/anyof.t ............................................. FAILED No plan found in TAP output
  [stdio] -Dcc="ccache gcc" -Accflags="-Werror=declaration-after-statement" -Duseithreads
  [stdio] -Dcc="ccache gcc" -Accflags="-Werror=declaration-after-statement" -Duseithreads DEBUGGING
~~ ../dist/threads/t/kill.t .................................... FAILED Non-zero exit status: 255 No plan found in TAP output
  [stdio] -Dcc="ccache gcc" -Accflags="-Werror=declaration-after-statement" -Duseithreads
  [stdio] -Dcc="ccache gcc" -Accflags="-Werror=declaration-after-statement" -Duseithreads DEBUGGING
~~ ../ext/XS-APItest/t/sym-hook.t .............................. FAILED Non-zero exit status: 255 Bad plan.  You planned 4 tests but ran 0.
  [stdio] -Dcc="ccache gcc" -Accflags="-Werror=declaration-after-statement" -Duseithreads
  [stdio] -Dcc="ccache gcc" -Accflags="-Werror=declaration-after-statement" DEBUGGING
  [stdio] -Dcc="ccache gcc" -Accflags="-Werror=declaration-after-statement"
  [stdio] -Dcc="ccache gcc" -Accflags="-Werror=declaration-after-statement" -Duseithreads DEBUGGING
~~ ../dist/Storable/t/file_magic.t ............................. FAILED No plan found in TAP output
  [stdio] -Dcc="ccache gcc" -Accflags="-Werror=declaration-after-statement" -Duseithreads
  [stdio] -Dcc="ccache gcc" -Accflags="-Werror=declaration-after-statement" -Duseithreads DEBUGGING
~~ ../cpan/Getopt-Long/t/gol-oo.t .............................. FAILED Non-zero exit status: 255 No plan found in TAP output
  [stdio] -Dcc="ccache gcc" -Accflags="-Werror=declaration-after-statement" -Duseithreads
  [stdio] -Dcc="ccache gcc" -Accflags="-Werror=declaration-after-statement" DEBUGGING
  [stdio] -Dcc="ccache gcc" -Accflags="-Werror=declaration-after-statement"
  [stdio] -Dcc="ccache gcc" -Accflags="-Werror=declaration-after-statement" -Duseithreads DEBUGGING
~~ ../cpan/Pod-Simple/t/verb_fmt.t ............................. FAILED Non-zero exit status: 255 Bad plan.  You planned 62 tests but ran 0.
  [stdio] -Dcc="ccache gcc" -Accflags="-Werror=declaration-after-statement" -Duseithreads
  [stdio] -Dcc="ccache gcc" -Accflags="-Werror=declaration-after-statement" DEBUGGING
  [stdio] -Dcc="ccache gcc" -Accflags="-Werror=declaration-after-statement"
  [stdio] -Dcc="ccache gcc" -Accflags="-Werror=declaration-after-statement" -Duseithreads DEBUGGING
~~ ../cpan/ExtUtils-MakeMaker/t/oneliner.t ..................... FAILED No plan found in TAP output
  [stdio] -Dcc="ccache gcc" -Accflags="-Werror=declaration-after-statement" -Duseithreads
  [stdio] -Dcc="ccache gcc" -Accflags="-Werror=declaration-after-statement" -Duseithreads DEBUGGING
~~ ../cpan/Test-Simple/t/Legacy/exit.t ......................... FAILED 1-256 272
  [stdio] -Dcc="ccache gcc" -Accflags="-Werror=declaration-after-statement" -Duseithreads
~~ ../cpan/Test-Simple/t/Test2/behavior/disable_ipc_b.t ........ FAILED No plan found in TAP output
  [stdio] -Dcc="ccache gcc" -Accflags="-Werror=declaration-after-statement" -Duseithreads
  [stdio] -Dcc="ccache gcc" -Accflags="-Werror=declaration-after-statement" -Duseithreads DEBUGGING
~~ ../dist/Thread-Semaphore/t/01_basic.t ....................... FAILED Non-zero exit status: 255 No plan found in TAP output
  [stdio] -Dcc="ccache gcc" -Accflags="-Werror=declaration-after-statement" -Duseithreads
  [stdio] -Dcc="ccache gcc" -Accflags="-Werror=declaration-after-statement" -Duseithreads DEBUGGING
~~ ../ext/FileCache/t/02maxopen.t .............................. FAILED Non-zero exit status: 25 Bad plan.  You planned 5 tests but ran 0.
  [stdio] -Dcc="ccache gcc" -Accflags="-Werror=declaration-after-statement" -Duseithreads
  [stdio] -Dcc="ccache gcc" -Accflags="-Werror=declaration-after-statement" DEBUGGING
  [stdio] -Dcc="ccache gcc" -Accflags="-Werror=declaration-after-statement"
  [stdio] -Dcc="ccache gcc" -Accflags="-Werror=declaration-after-statement" -Duseithreads DEBUGGING
~~ ../cpan/Test-Simple/t/Legacy/exit.t ......................... FAILED 1-257
  [stdio] -Dcc="ccache gcc" -Accflags="-Werror=declaration-after-statement"
~~ ../dist/Storable/t/sig_die.t ................................ FAILED Bad plan.  You planned 1 tests but ran 0.
  [stdio] -Dcc="ccache gcc" -Accflags="-Werror=declaration-after-statement" -Duseithreads
  [stdio] -Dcc="ccache gcc" -Accflags="-Werror=declaration-after-statement" -Duseithreads DEBUGGING
~~ ../t/re/reg_fold.t .......................................... FAILED No plan found in TAP output
  [stdio] -Dcc="ccache gcc" -Accflags="-Werror=declaration-after-statement" -Duseithreads
  [stdio] -Dcc="ccache gcc" -Accflags="-Werror=declaration-after-statement" -Duseithreads DEBUGGING
~~ ../dist/encoding-warnings/t/1-warning.t ..................... FAILED No plan found in TAP output
  [stdio] -Dcc="ccache gcc" -Accflags="-Werror=declaration-after-statement" -Duseithreads
  [stdio] -Dcc="ccache gcc" -Accflags="-Werror=declaration-after-statement" -Duseithreads DEBUGGING
~~ ../t/op/index_thr.t ......................................... FAILED Non-zero exit status: 255 No plan found in TAP output
  [stdio] -Dcc="ccache gcc" -Accflags="-Werror=declaration-after-statement" -Duseithreads
  [stdio] -Dcc="ccache gcc" -Accflags="-Werror=declaration-after-statement" -Duseithreads DEBUGGING
~~ ../ext/XS-APItest/t/fetch_pad_names.t ....................... FAILED No plan found in TAP output
  [stdio] -Dcc="ccache gcc" -Accflags="-Werror=declaration-after-statement" -Duseithreads
  [stdio] -Dcc="ccache gcc" -Accflags="-Werror=declaration-after-statement" -Duseithreads DEBUGGING
~~ ../ext/Opcode/t/ops.t ....................................... FAILED Non-zero exit status: 255 No plan found in TAP output
  [stdio] -Dcc="ccache gcc" -Accflags="-Werror=declaration-after-statement" -Duseithreads
  [stdio] -Dcc="ccache gcc" -Accflags="-Werror=declaration-after-statement" DEBUGGING
  [stdio] -Dcc="ccache gcc" -Accflags="-Werror=declaration-after-statement"
  [stdio] -Dcc="ccache gcc" -Accflags="-Werror=declaration-after-statement" -Duseithreads DEBUGGING
~~ ../cpan/ExtUtils-MakeMaker/t/oneliner.t ..................... FAILED 5 Non-zero exit status: 1
  [stdio] -Dcc="ccache gcc" -Accflags="-Werror=declaration-after-statement" DEBUGGING
  [stdio] -Dcc="ccache gcc" -Accflags="-Werror=declaration-after-statement"
~~ ../t/re/recompile.t ......................................... FAILED 43
  [stdio] -Dcc="ccache gcc" -Accflags="-Werror=declaration-after-statement" DEBUGGING
  [stdio] -Dcc="ccache gcc" -Accflags="-Werror=declaration-after-statement" -Duseithreads DEBUGGING
~~ ../cpan/podlators/t/man/heading.t ........................... FAILED Bad plan.  You planned 9 tests but ran 0.
  [stdio] -Dcc="ccache gcc" -Accflags="-Werror=declaration-after-statement" -Duseithreads
  [stdio] -Dcc="ccache gcc" -Accflags="-Werror=declaration-after-statement" -Duseithreads DEBUGGING
~~ ../cpan/Test-Simple/t/Legacy/subtest/singleton.t ............ FAILED Non-zero exit status: 255 Bad plan.  You planned 3 tests but ran 0.
  [stdio] -Dcc="ccache gcc" -Accflags="-Werror=declaration-after-statement" -Duseithreads
  [stdio] -Dcc="ccache gcc" -Accflags="-Werror=declaration-after-statement" DEBUGGING
  [stdio] -Dcc="ccache gcc" -Accflags="-Werror=declaration-after-statement"
  [stdio] -Dcc="ccache gcc" -Accflags="-Werror=declaration-after-statement" -Duseithreads DEBUGGING
~~ ../cpan/IO-Compress/t/112utf8-zip.t ......................... FAILED No plan found in TAP output
  [stdio] -Dcc="ccache gcc" -Accflags="-Werror=declaration-after-statement" -Duseithreads
  [stdio] -Dcc="ccache gcc" -Accflags="-Werror=declaration-after-statement" -Duseithreads DEBUGGING
~~ ../dist/threads-shared/t/stress.t ........................... FAILED Non-zero exit status: 255 Bad plan.  You planned 1 tests but ran 0.
  [stdio] -Dcc="ccache gcc" -Accflags="-Werror=declaration-after-statement" -Duseithreads
  [stdio] -Dcc="ccache gcc" -Accflags="-Werror=declaration-after-statement" -Duseithreads DEBUGGING
~~ ../dist/threads-shared/t/hv_simple.t ........................ FAILED Non-zero exit status: 255 Bad plan.  You planned 16 tests but ran 0.
  [stdio] -Dcc="ccache gcc" -Accflags="-Werror=declaration-after-statement" -Duseithreads
  [stdio] -Dcc="ccache gcc" -Accflags="-Werror=declaration-after-statement" -Duseithreads DEBUGGING
~~ ../cpan/ExtUtils-MakeMaker/t/fixin.t ........................ FAILED Bad plan.  You planned 30 tests but ran 0.
  [stdio] -Dcc="ccache gcc" -Accflags="-Werror=declaration-after-statement" -Duseithreads
  [stdio] -Dcc="ccache gcc" -Accflags="-Werror=declaration-after-statement" -Duseithreads DEBUGGING
~~ ../dist/Storable/t/tied_hook.t .............................. FAILED No plan found in TAP output
  [stdio] -Dcc="ccache gcc" -Accflags="-Werror=declaration-after-statement" -Duseithreads
  [stdio] -Dcc="ccache gcc" -Accflags="-Werror=declaration-after-statement" -Duseithreads DEBUGGING
~~ ../dist/threads-shared/t/sv_refs.t .......................... FAILED Non-zero exit status: 255 Bad plan.  You planned 21 tests but ran 0.
  [stdio] -Dcc="ccache gcc" -Accflags="-Werror=declaration-after-statement" -Duseithreads
  [stdio] -Dcc="ccache gcc" -Accflags="-Werror=declaration-after-statement" -Duseithreads DEBUGGING
~~ ../cpan/ExtUtils-Install/t/InstallWithMM.t .................. FAILED No plan found in TAP output
  [stdio] -Dcc="ccache gcc" -Accflags="-Werror=declaration-after-statement" -Duseithreads
  [stdio] -Dcc="ccache gcc" -Accflags="-Werror=declaration-after-statement" -Duseithreads DEBUGGING
~~ ../dist/Storable/t/canonical.t .............................. FAILED No plan found in TAP output
  [stdio] -Dcc="ccache gcc" -Accflags="-Werror=declaration-after-statement" -Duseithreads
  [stdio] -Dcc="ccache gcc" -Accflags="-Werror=declaration-after-statement" -Duseithreads DEBUGGING
~~ ../ext/XS-APItest/t/keyword_plugin_threads.t ................ FAILED 1
  [stdio] -Dcc="ccache gcc" -Accflags="-Werror=declaration-after-statement" -Duseithreads
  [stdio] -Dcc="ccache gcc" -Accflags="-Werror=declaration-after-statement" -Duseithreads DEBUGGING
~~ ../t/uni/lower.t ............................................ FAILED No plan found in TAP output
  [stdio] -Dcc="ccache gcc" -Accflags="-Werror=declaration-after-statement" -Duseithreads
  [stdio] -Dcc="ccache gcc" -Accflags="-Werror=declaration-after-statement" -Duseithreads DEBUGGING
~~ ../cpan/Digest-MD5/t/utf8.t ................................. FAILED No plan found in TAP output
  [stdio] -Dcc="ccache gcc" -Accflags="-Werror=declaration-after-statement" -Duseithreads
  [stdio] -Dcc="ccache gcc" -Accflags="-Werror=declaration-after-statement" -Duseithreads DEBUGGING
~~ ../cpan/Encode/t/gsm0338.t .................................. FAILED Bad plan.  You planned 780 tests but ran 0.
  [stdio] -Dcc="ccache gcc" -Accflags="-Werror=declaration-after-statement" -Duseithreads
  [stdio] -Dcc="ccache gcc" -Accflags="-Werror=declaration-after-statement" -Duseithreads DEBUGGING
~~ ../cpan/ExtUtils-MakeMaker/t/make.t ......................... FAILED Bad plan.  You planned 3 tests but ran 0.
  [stdio] -Dcc="ccache gcc" -Accflags="-Werror=declaration-after-statement" -Duseithreads
  [stdio] -Dcc="ccache gcc" -Accflags="-Werror=declaration-after-statement" -Duseithreads DEBUGGING
~~ ../cpan/Pod-Usage/t/pod/pod2usage2.t ........................ FAILED Bad plan.  You planned 33 tests but ran 0.
  [stdio] -Dcc="ccache gcc" -Accflags="-Werror=declaration-after-statement" -Duseithreads
  [stdio] -Dcc="ccache gcc" -Accflags="-Werror=declaration-after-statement" -Duseithreads DEBUGGING
~~ ../dist/threads/t/blocks.t .................................. FAILED Non-zero exit status: 255 No plan found in TAP output
  [stdio] -Dcc="ccache gcc" -Accflags="-Werror=declaration-after-statement" -Duseithreads
  [stdio] -Dcc="ccache gcc" -Accflags="-Werror=declaration-after-statement" -Duseithreads DEBUGGING
~~ ../dist/constant/t/constant.t ............................... FAILED Non-zero exit status: 7 Bad plan.  You planned 109 tests but ran 1.
  [stdio] -Dcc="ccache gcc" -Accflags="-Werror=declaration-after-statement" -Duseithreads
  [stdio] -Dcc="ccache gcc" -Accflags="-Werror=declaration-after-statement" DEBUGGING
  [stdio] -Dcc="ccache gcc" -Accflags="-Werror=declaration-after-statement"
  [stdio] -Dcc="ccache gcc" -Accflags="-Werror=declaration-after-statement" -Duseithreads DEBUGGING
~~ ../cpan/Pod-Simple/t/htmlbat.t .............................. FAILED Bad plan.  You planned 17 tests but ran 2.
  [stdio] -Dcc="ccache gcc" -Accflags="-Werror=declaration-after-statement" -Duseithreads
  [stdio] -Dcc="ccache gcc" -Accflags="-Werror=declaration-after-statement" -Duseithreads DEBUGGING
~~ ../cpan/Pod-Simple/t/enc-chars.t ............................ FAILED Bad plan.  You planned 5 tests but ran 3.
  [stdio] -Dcc="ccache gcc" -Accflags="-Werror=declaration-after-statement" -Duseithreads
  [stdio] -Dcc="ccache gcc" -Accflags="-Werror=declaration-after-statement" -Duseithreads DEBUGGING
~~ ../cpan/Test-Simple/t/Test2/acceptance/try_it_todo.t ........ FAILED Non-zero exit status: 255 No plan found in TAP output
  [stdio] -Dcc="ccache gcc" -Accflags="-Werror=declaration-after-statement" -Duseithreads
  [stdio] -Dcc="ccache gcc" -Accflags="-Werror=declaration-after-statement" DEBUGGING
  [stdio] -Dcc="ccache gcc" -Accflags="-Werror=declaration-after-statement"
  [stdio] -Dcc="ccache gcc" -Accflags="-Werror=declaration-after-statement" -Duseithreads DEBUGGING
~~ ../cpan/Encode/t/use-Encode-Alias.t ......................... FAILED No plan found in TAP output
  [stdio] -Dcc="ccache gcc" -Accflags="-Werror=declaration-after-statement" -Duseithreads
  [stdio] -Dcc="ccache gcc" -Accflags="-Werror=declaration-after-statement" -Duseithreads DEBUGGING
~~ ../cpan/IO-Compress/t/110encode-gzip.t ...................... FAILED No plan found in TAP output
  [stdio] -Dcc="ccache gcc" -Accflags="-Werror=declaration-after-statement" -Duseithreads
  [stdio] -Dcc="ccache gcc" -Accflags="-Werror=declaration-after-statement" -Duseithreads DEBUGGING
~~ ../ext/XS-APItest/t/clone-with-stack.t ...................... FAILED 6
  [stdio] -Dcc="ccache gcc" -Accflags="-Werror=declaration-after-statement" -Duseithreads
  [stdio] -Dcc="ccache gcc" -Accflags="-Werror=declaration-after-statement" -Duseithreads DEBUGGING
~~ ../dist/Thread-Queue/t/05_extract.t ......................... FAILED Non-zero exit status: 255 No plan found in TAP output
  [stdio] -Dcc="ccache gcc" -Accflags="-Werror=declaration-after-statement" -Duseithreads
  [stdio] -Dcc="ccache gcc" -Accflags="-Werror=declaration-after-statement" -Duseithreads DEBUGGING
~~ ../t/re/pat_re_eval_thr.t ................................... FAILED Non-zero exit status: 255 No plan found in TAP output
  [stdio] -Dcc="ccache gcc" -Accflags="-Werror=declaration-after-statement" -Duseithreads
  [stdio] -Dcc="ccache gcc" -Accflags="-Werror=declaration-after-statement" -Duseithreads DEBUGGING
~~ ../lib/Thread.t ............................................. FAILED Non-zero exit status: 255 No plan found in TAP output
  [stdio] -Dcc="ccache gcc" -Accflags="-Werror=declaration-after-statement" -Duseithreads
  [stdio] -Dcc="ccache gcc" -Accflags="-Werror=declaration-after-statement" -Duseithreads DEBUGGING
~~ ../cpan/ExtUtils-MakeMaker/t/MM_Unix.t ...................... FAILED Bad plan.  You planned 114 tests but ran 0.
  [stdio] -Dcc="ccache gcc" -Accflags="-Werror=declaration-after-statement" -Duseithreads
  [stdio] -Dcc="ccache gcc" -Accflags="-Werror=declaration-after-statement" -Duseithreads DEBUGGING
~~ ../cpan/Test-Simple/t/Test2/behavior/Taint.t ................ FAILED Non-zero exit status: 255 No plan found in TAP output
  [stdio] -Dcc="ccache gcc" -Accflags="-Werror=declaration-after-statement" -Duseithreads
  [stdio] -Dcc="ccache gcc" -Accflags="-Werror=declaration-after-statement" DEBUGGING
  [stdio] -Dcc="ccache gcc" -Accflags="-Werror=declaration-after-statement"
  [stdio] -Dcc="ccache gcc" -Accflags="-Werror=declaration-after-statement" -Duseithreads DEBUGGING
~~ ../lib/B/Deparse.t .......................................... FAILED 69 279 303 Bad plan.  You planned 315 tests but ran 314.
  [stdio] -Dcc="ccache gcc" -Accflags="-Werror=declaration-after-statement" -Duseithreads
  [stdio] -Dcc="ccache gcc" -Accflags="-Werror=declaration-after-statement" DEBUGGING
  [stdio] -Dcc="ccache gcc" -Accflags="-Werror=declaration-after-statement"
  [stdio] -Dcc="ccache gcc" -Accflags="-Werror=declaration-after-statement" -Duseithreads DEBUGGING
~~ ../ext/Hash-Util/t/builtin.t ................................ FAILED 8 Non-zero exit status: 3
  [stdio] -Dcc="ccache gcc" -Accflags="-Werror=declaration-after-statement" -Duseithreads
  [stdio] -Dcc="ccache gcc" -Accflags="-Werror=declaration-after-statement" DEBUGGING
  [stdio] -Dcc="ccache gcc" -Accflags="-Werror=declaration-after-statement"
  [stdio] -Dcc="ccache gcc" -Accflags="-Werror=declaration-after-statement" -Duseithreads DEBUGGING
~~ ../cpan/ExtUtils-MakeMaker/t/basic.t ........................ FAILED No plan found in TAP output
  [stdio] -Dcc="ccache gcc" -Accflags="-Werror=declaration-after-statement" -Duseithreads
  [stdio] -Dcc="ccache gcc" -Accflags="-Werror=declaration-after-statement" -Duseithreads DEBUGGING
~~ ../dist/Storable/t/attach.t ................................. FAILED Bad plan.  You planned 3 tests but ran 0.
  [stdio] -Dcc="ccache gcc" -Accflags="-Werror=declaration-after-statement" -Duseithreads
  [stdio] -Dcc="ccache gcc" -Accflags="-Werror=declaration-after-statement" -Duseithreads DEBUGGING
~~ ../cpan/version/t/04strict_lax.t ............................ FAILED Non-zero exit status: 255
  [stdio] -Dcc="ccache gcc" -Accflags="-Werror=declaration-after-statement" -Duseithreads
  [stdio] -Dcc="ccache gcc" -Accflags="-Werror=declaration-after-statement" DEBUGGING
  [stdio] -Dcc="ccache gcc" -Accflags="-Werror=declaration-after-statement"
  [stdio] -Dcc="ccache gcc" -Accflags="-Werror=declaration-after-statement" -Duseithreads DEBUGGING
~~ ../cpan/Text-Balanced/t/06_extqlk.t ......................... FAILED Non-zero exit status: 255 Bad plan.  You planned 95 tests but ran 0.
  [stdio] -Dcc="ccache gcc" -Accflags="-Werror=declaration-after-statement" -Duseithreads
  [stdio] -Dcc="ccache gcc" -Accflags="-Werror=declaration-after-statement" DEBUGGING
  [stdio] -Dcc="ccache gcc" -Accflags="-Werror=declaration-after-statement"
  [stdio] -Dcc="ccache gcc" -Accflags="-Werror=declaration-after-statement" -Duseithreads DEBUGGING
~~ ../t/re/pat_advanced_thr.t .................................. FAILED Non-zero exit status: 255 No plan found in TAP output
  [stdio] -Dcc="ccache gcc" -Accflags="-Werror=declaration-after-statement" -Duseithreads
  [stdio] -Dcc="ccache gcc" -Accflags="-Werror=declaration-after-statement" -Duseithreads DEBUGGING
~~ ../dist/Storable/t/downgrade.t .............................. FAILED 13 66-67 125 Non-zero exit status: 28
  [stdio] -Dcc="ccache gcc" -Accflags="-Werror=declaration-after-statement" DEBUGGING
~~ ../dist/Storable/t/attach_singleton.t ....................... FAILED Bad plan.  You planned 16 tests but ran 0.
  [stdio] -Dcc="ccache gcc" -Accflags="-Werror=declaration-after-statement" -Duseithreads
  [stdio] -Dcc="ccache gcc" -Accflags="-Werror=declaration-after-statement" -Duseithreads DEBUGGING
~~ ../cpan/CPAN-Meta-YAML/t/21_yamlpm_compat.t ................. FAILED No plan found in TAP output
  [stdio] -Dcc="ccache gcc" -Accflags="-Werror=declaration-after-statement" -Duseithreads
  [stdio] -Dcc="ccache gcc" -Accflags="-Werror=declaration-after-statement" -Duseithreads DEBUGGING
~~ ../cpan/CPAN-Meta-YAML/t/32_world_tml.t ..................... FAILED No plan found in TAP output
  [stdio] -Dcc="ccache gcc" -Accflags="-Werror=declaration-after-statement" -Duseithreads
  [stdio] -Dcc="ccache gcc" -Accflags="-Werror=declaration-after-statement" -Duseithreads DEBUGGING
~~ ../cpan/Scalar-List-Utils/t/exotic_names.t .................. FAILED No plan found in TAP output
  [stdio] -Dcc="ccache gcc" -Accflags="-Werror=declaration-after-statement" -Duseithreads
  [stdio] -Dcc="ccache gcc" -Accflags="-Werror=declaration-after-statement" -Duseithreads DEBUGGING
~~ ../ext/XS-APItest/t/xsub_h.t ................................ FAILED Non-zero exit status: 255 No plan found in TAP output
  [stdio] -Dcc="ccache gcc" -Accflags="-Werror=declaration-after-statement" -Duseithreads
  [stdio] -Dcc="ccache gcc" -Accflags="-Werror=declaration-after-statement" DEBUGGING
  [stdio] -Dcc="ccache gcc" -Accflags="-Werror=declaration-after-statement"
  [stdio] -Dcc="ccache gcc" -Accflags="-Werror=declaration-after-statement" -Duseithreads DEBUGGING
~~ ../dist/Storable/t/malice.t ................................. FAILED 8 233 398 Non-zero exit status: 20
  [stdio] -Dcc="ccache gcc" -Accflags="-Werror=declaration-after-statement" DEBUGGING
  [stdio] -Dcc="ccache gcc" -Accflags="-Werror=declaration-after-statement"
~~ ../dist/Storable/t/leaks.t .................................. FAILED No plan found in TAP output
  [stdio] -Dcc="ccache gcc" -Accflags="-Werror=declaration-after-statement" -Duseithreads
  [stdio] -Dcc="ccache gcc" -Accflags="-Werror=declaration-after-statement" -Duseithreads DEBUGGING
~~ ../dist/Storable/t/croak.t .................................. FAILED No plan found in TAP output
  [stdio] -Dcc="ccache gcc" -Accflags="-Werror=declaration-after-statement" -Duseithreads
  [stdio] -Dcc="ccache gcc" -Accflags="-Werror=declaration-after-statement" -Duseithreads DEBUGGING
~~ ../dist/threads/t/thread.t .................................. FAILED Non-zero exit status: 255 No plan found in TAP output
  [stdio] -Dcc="ccache gcc" -Accflags="-Werror=declaration-after-statement" -Duseithreads
  [stdio] -Dcc="ccache gcc" -Accflags="-Werror=declaration-after-statement" -Duseithreads DEBUGGING
~~ ../dist/Thread-Queue/t/07_lock.t ............................ FAILED Non-zero exit status: 255 No plan found in TAP output
  [stdio] -Dcc="ccache gcc" -Accflags="-Werror=declaration-after-statement" -Duseithreads
  [stdio] -Dcc="ccache gcc" -Accflags="-Werror=declaration-after-statement" -Duseithreads DEBUGGING
~~ ../cpan/Test-Harness/t/unicode.t ............................ FAILED No plan found in TAP output
  [stdio] -Dcc="ccache gcc" -Accflags="-Werror=declaration-after-statement" -Duseithreads
  [stdio] -Dcc="ccache gcc" -Accflags="-Werror=declaration-after-statement" -Duseithreads DEBUGGING
~~ ../cpan/Encode/t/magic.t .................................... FAILED No plan found in TAP output
  [stdio] -Dcc="ccache gcc" -Accflags="-Werror=declaration-after-statement" -Duseithreads
  [stdio] -Dcc="ccache gcc" -Accflags="-Werror=declaration-after-statement" -Duseithreads DEBUGGING
~~ ../t/re/pat_thr.t ........................................... FAILED Non-zero exit status: 255 No plan found in TAP output
  [stdio] -Dcc="ccache gcc" -Accflags="-Werror=declaration-after-statement" -Duseithreads
  [stdio] -Dcc="ccache gcc" -Accflags="-Werror=declaration-after-statement" -Duseithreads DEBUGGING
~~ ../cpan/Encode/t/grow.t ..................................... FAILED No plan found in TAP output
  [stdio] -Dcc="ccache gcc" -Accflags="-Werror=declaration-after-statement" -Duseithreads
  [stdio] -Dcc="ccache gcc" -Accflags="-Werror=declaration-after-statement" -Duseithreads DEBUGGING
~~ ../dist/Storable/t/overload.t ............................... FAILED No plan found in TAP output
  [stdio] -Dcc="ccache gcc" -Accflags="-Werror=declaration-after-statement" -Duseithreads
  [stdio] -Dcc="ccache gcc" -Accflags="-Werror=declaration-after-statement" -Duseithreads DEBUGGING
~~ ../t/re/speed_thr.t ......................................... FAILED Non-zero exit status: 255 No plan found in TAP output
  [stdio] -Dcc="ccache gcc" -Accflags="-Werror=declaration-after-statement" -Duseithreads
  [stdio] -Dcc="ccache gcc" -Accflags="-Werror=declaration-after-statement" -Duseithreads DEBUGGING
~~ ../t/op/substr_thr.t ........................................ FAILED Non-zero exit status: 255 No plan found in TAP output
  [stdio] -Dcc="ccache gcc" -Accflags="-Werror=declaration-after-statement" -Duseithreads
  [stdio] -Dcc="ccache gcc" -Accflags="-Werror=declaration-after-statement" -Duseithreads DEBUGGING
~~ ../dist/Storable/t/dclone.t ................................. FAILED No plan found in TAP output
  [stdio] -Dcc="ccache gcc" -Accflags="-Werror=declaration-after-statement" -Duseithreads
  [stdio] -Dcc="ccache gcc" -Accflags="-Werror=declaration-after-statement" -Duseithreads DEBUGGING
~~ ../cpan/IO-Compress/t/110encode-zip.t ....................... FAILED No plan found in TAP output
  [stdio] -Dcc="ccache gcc" -Accflags="-Werror=declaration-after-statement" -Duseithreads
  [stdio] -Dcc="ccache gcc" -Accflags="-Werror=declaration-after-statement" -Duseithreads DEBUGGING
~~ ../dist/threads/t/kill3.t ................................... FAILED Non-zero exit status: 255 No plan found in TAP output
  [stdio] -Dcc="ccache gcc" -Accflags="-Werror=declaration-after-statement" -Duseithreads
  [stdio] -Dcc="ccache gcc" -Accflags="-Werror=declaration-after-statement" -Duseithreads DEBUGGING
~~ ../dist/threads-shared/t/object.t ........................... FAILED Non-zero exit status: 255 Bad plan.  You planned 28 tests but ran 0.
  [stdio] -Dcc="ccache gcc" -Accflags="-Werror=declaration-after-statement" -Duseithreads
  [stdio] -Dcc="ccache gcc" -Accflags="-Werror=declaration-after-statement" -Duseithreads DEBUGGING
~~ ../cpan/IO-Compress/t/cz-08encoding.t ....................... FAILED No plan found in TAP output
  [stdio] -Dcc="ccache gcc" -Accflags="-Werror=declaration-after-statement" -Duseithreads
  [stdio] -Dcc="ccache gcc" -Accflags="-Werror=declaration-after-statement" -Duseithreads DEBUGGING
~~ ../dist/threads-shared/t/av_simple.t ........................ FAILED Non-zero exit status: 255 Bad plan.  You planned 47 tests but ran 0.
  [stdio] -Dcc="ccache gcc" -Accflags="-Werror=declaration-after-statement" -Duseithreads
  [stdio] -Dcc="ccache gcc" -Accflags="-Werror=declaration-after-statement" -Duseithreads DEBUGGING
~~ ../dist/threads/t/stack_env.t ............................... FAILED Non-zero exit status: 255 Bad plan.  You planned 4 tests but ran 0.
  [stdio] -Dcc="ccache gcc" -Accflags="-Werror=declaration-after-statement" -Duseithreads
  [stdio] -Dcc="ccache gcc" -Accflags="-Werror=declaration-after-statement" -Duseithreads DEBUGGING
~~ ../cpan/ExtUtils-MakeMaker/t/echo.t ......................... FAILED No plan found in TAP output
  [stdio] -Dcc="ccache gcc" -Accflags="-Werror=declaration-after-statement" -Duseithreads
  [stdio] -Dcc="ccache gcc" -Accflags="-Werror=declaration-after-statement" -Duseithreads DEBUGGING
~~ ../cpan/ExtUtils-MakeMaker/t/miniperl.t ..................... FAILED 3-4 Non-zero exit status: 2
  [stdio] -Dcc="ccache gcc" -Accflags="-Werror=declaration-after-statement" -Duseithreads
  [stdio] -Dcc="ccache gcc" -Accflags="-Werror=declaration-after-statement" -Duseithreads DEBUGGING
~~ ../cpan/ExtUtils-MakeMaker/t/postamble.t .................... FAILED Bad plan.  You planned 8 tests but ran 0.
  [stdio] -Dcc="ccache gcc" -Accflags="-Werror=declaration-after-statement" -Duseithreads
  [stdio] -Dcc="ccache gcc" -Accflags="-Werror=declaration-after-statement" -Duseithreads DEBUGGING
~~ ../ext/FileCache/t/03append.t ............................... FAILED Non-zero exit status: 25 Bad plan.  You planned 2 tests but ran 0.
  [stdio] -Dcc="ccache gcc" -Accflags="-Werror=declaration-after-statement" -Duseithreads
  [stdio] -Dcc="ccache gcc" -Accflags="-Werror=declaration-after-statement" DEBUGGING
  [stdio] -Dcc="ccache gcc" -Accflags="-Werror=declaration-after-statement"
  [stdio] -Dcc="ccache gcc" -Accflags="-Werror=declaration-after-statement" -Duseithreads DEBUGGING
~~ ../cpan/IPC-Cmd/t/03_run-forked.t ........................... FAILED No plan found in TAP output
  [stdio] -Dcc="ccache gcc" -Accflags="-Werror=declaration-after-statement" -Duseithreads
  [stdio] -Dcc="ccache gcc" -Accflags="-Werror=declaration-after-statement" -Duseithreads DEBUGGING
~~ ../cpan/ExtUtils-MakeMaker/t/hints.t ........................ FAILED Bad plan.  You planned 3 tests but ran 0.
  [stdio] -Dcc="ccache gcc" -Accflags="-Werror=declaration-after-statement" -Duseithreads
  [stdio] -Dcc="ccache gcc" -Accflags="-Werror=declaration-after-statement" -Duseithreads DEBUGGING
~~ ../cpan/podlators/t/text/invalid.t .......................... FAILED Bad plan.  You planned 8 tests but ran 0.
  [stdio] -Dcc="ccache gcc" -Accflags="-Werror=declaration-after-statement" -Duseithreads
  [stdio] -Dcc="ccache gcc" -Accflags="-Werror=declaration-after-statement" -Duseithreads DEBUGGING
~~ ../t/porting/podcheck.t ..................................... FAILED 299
  [stdio] -Dcc="ccache gcc" -Accflags="-Werror=declaration-after-statement" DEBUGGING
  [stdio] -Dcc="ccache gcc" -Accflags="-Werror=declaration-after-statement"
~~ ../cpan/Pod-Simple/t/xhtml01.t .............................. FAILED Bad plan.  You planned 62 tests but ran 40.
  [stdio] -Dcc="ccache gcc" -Accflags="-Werror=declaration-after-statement" -Duseithreads
  [stdio] -Dcc="ccache gcc" -Accflags="-Werror=declaration-after-statement" -Duseithreads DEBUGGING
~~ ../cpan/ExtUtils-MakeMaker/t/pm.t ........................... FAILED Bad plan.  You planned 6 tests but ran 0.
  [stdio] -Dcc="ccache gcc" -Accflags="-Werror=declaration-after-statement" -Duseithreads
  [stdio] -Dcc="ccache gcc" -Accflags="-Werror=declaration-after-statement" -Duseithreads DEBUGGING
~~ ../dist/Storable/t/malice.t ................................. FAILED No plan found in TAP output
  [stdio] -Dcc="ccache gcc" -Accflags="-Werror=declaration-after-statement" -Duseithreads
  [stdio] -Dcc="ccache gcc" -Accflags="-Werror=declaration-after-statement" -Duseithreads DEBUGGING
~~ ../dist/threads/t/stress_string.t ........................... FAILED Non-zero exit status: 255 Bad plan.  You planned 61 tests but ran 0.
  [stdio] -Dcc="ccache gcc" -Accflags="-Werror=declaration-after-statement" -Duseithreads
  [stdio] -Dcc="ccache gcc" -Accflags="-Werror=declaration-after-statement" -Duseithreads DEBUGGING
~~ ../dist/threads/t/no_threads.t .............................. FAILED 1
  [stdio] -Dcc="ccache gcc" -Accflags="-Werror=declaration-after-statement" DEBUGGING
  [stdio] -Dcc="ccache gcc" -Accflags="-Werror=declaration-after-statement"
~~ ../cpan/IO-Compress/t/110encode-bzip2.t ..................... FAILED No plan found in TAP output
  [stdio] -Dcc="ccache gcc" -Accflags="-Werror=declaration-after-statement" -Duseithreads
  [stdio] -Dcc="ccache gcc" -Accflags="-Werror=declaration-after-statement" -Duseithreads DEBUGGING
~~ ../cpan/Text-Balanced/t/09_gentag.t ......................... FAILED Non-zero exit status: 255 Bad plan.  You planned 37 tests but ran 0.
  [stdio] -Dcc="ccache gcc" -Accflags="-Werror=declaration-after-statement" -Duseithreads
  [stdio] -Dcc="ccache gcc" -Accflags="-Werror=declaration-after-statement" DEBUGGING
  [stdio] -Dcc="ccache gcc" -Accflags="-Werror=declaration-after-statement"
  [stdio] -Dcc="ccache gcc" -Accflags="-Werror=declaration-after-statement" -Duseithreads DEBUGGING
~~ ../ext/B/t/sv_stash.t ....................................... FAILED 1
  [stdio] -Dcc="ccache gcc" -Accflags="-Werror=declaration-after-statement" -Duseithreads
  [stdio] -Dcc="ccache gcc" -Accflags="-Werror=declaration-after-statement" DEBUGGING
  [stdio] -Dcc="ccache gcc" -Accflags="-Werror=declaration-after-statement"
  [stdio] -Dcc="ccache gcc" -Accflags="-Werror=declaration-after-statement" -Duseithreads DEBUGGING
~~ ../cpan/ExtUtils-MakeMaker/t/dir_target.t ................... FAILED Bad plan.  You planned 1 tests but ran 0.
  [stdio] -Dcc="ccache gcc" -Accflags="-Werror=declaration-after-statement" -Duseithreads
  [stdio] -Dcc="ccache gcc" -Accflags="-Werror=declaration-after-statement" -Duseithreads DEBUGGING
~~ ../dist/threads-shared/t/wait.t ............................. FAILED Non-zero exit status: 255 Bad plan.  You planned 91 tests but ran 0.
  [stdio] -Dcc="ccache gcc" -Accflags="-Werror=declaration-after-statement" -Duseithreads
  [stdio] -Dcc="ccache gcc" -Accflags="-Werror=declaration-after-statement" -Duseithreads DEBUGGING
~~ ../lib/B/Deparse-core.t ..................................... FAILED 3823-3840 Non-zero exit status: 18
  [stdio] -Dcc="ccache gcc" -Accflags="-Werror=declaration-after-statement" -Duseithreads
  [stdio] -Dcc="ccache gcc" -Accflags="-Werror=declaration-after-statement" DEBUGGING
  [stdio] -Dcc="ccache gcc" -Accflags="-Werror=declaration-after-statement"
  [stdio] -Dcc="ccache gcc" -Accflags="-Werror=declaration-after-statement" -Duseithreads DEBUGGING
~~ ../dist/Storable/t/tied_reify.t ............................. FAILED Bad plan.  You planned 1 tests but ran 0.
  [stdio] -Dcc="ccache gcc" -Accflags="-Werror=declaration-after-statement" -Duseithreads
  [stdio] -Dcc="ccache gcc" -Accflags="-Werror=declaration-after-statement" -Duseithreads DEBUGGING
~~ ../dist/Storable/t/code.t ................................... FAILED Bad plan.  You planned 63 tests but ran 0.
  [stdio] -Dcc="ccache gcc" -Accflags="-Werror=declaration-after-statement" -Duseithreads
  [stdio] -Dcc="ccache gcc" -Accflags="-Werror=declaration-after-statement" -Duseithreads DEBUGGING
~~ ../cpan/Test-Simple/t/Test2/modules/API.t ................... FAILED Non-zero exit status: 255 No plan found in TAP output
  [stdio] -Dcc="ccache gcc" -Accflags="-Werror=declaration-after-statement" -Duseithreads
  [stdio] -Dcc="ccache gcc" -Accflags="-Werror=declaration-after-statement" DEBUGGING
  [stdio] -Dcc="ccache gcc" -Accflags="-Werror=declaration-after-statement"
  [stdio] -Dcc="ccache gcc" -Accflags="-Werror=declaration-after-statement" -Duseithreads DEBUGGING
~~ ../cpan/Pod-Simple/t/rtf_utf8.t ............................. FAILED Bad plan.  You planned 5 tests but ran 3.
  [stdio] -Dcc="ccache gcc" -Accflags="-Werror=declaration-after-statement" -Duseithreads
  [stdio] -Dcc="ccache gcc" -Accflags="-Werror=declaration-after-statement" -Duseithreads DEBUGGING
~~ ../dist/ExtUtils-CBuilder/t/03-cplusplus.t .................. FAILED Non-zero exit status: 255 No plan found in TAP output
  [stdio] -Dcc="ccache gcc" -Accflags="-Werror=declaration-after-statement" -Duseithreads
  [stdio] -Dcc="ccache gcc" -Accflags="-Werror=declaration-after-statement" DEBUGGING
  [stdio] -Dcc="ccache gcc" -Accflags="-Werror=declaration-after-statement"
  [stdio] -Dcc="ccache gcc" -Accflags="-Werror=declaration-after-statement" -Duseithreads DEBUGGING
~~ ../cpan/Encode/t/rt85489.t .................................. FAILED Bad plan.  You planned 8 tests but ran 0.
  [stdio] -Dcc="ccache gcc" -Accflags="-Werror=declaration-after-statement" -Duseithreads
  [stdio] -Dcc="ccache gcc" -Accflags="-Werror=declaration-after-statement" -Duseithreads DEBUGGING
~~ ../t/re/reg_email_thr.t ..................................... FAILED Non-zero exit status: 255 No plan found in TAP output
  [stdio] -Dcc="ccache gcc" -Accflags="-Werror=declaration-after-statement" -Duseithreads
  [stdio] -Dcc="ccache gcc" -Accflags="-Werror=declaration-after-statement" -Duseithreads DEBUGGING
~~ ../ext/PerlIO-encoding/t/fallback.t ......................... FAILED No plan found in TAP output
  [stdio] -Dcc="ccache gcc" -Accflags="-Werror=declaration-after-statement" -Duseithreads
  [stdio] -Dcc="ccache gcc" -Accflags="-Werror=declaration-after-statement" -Duseithreads DEBUGGING
~~ ../cpan/Encode/t/undef.t .................................... FAILED No plan found in TAP output
  [stdio] -Dcc="ccache gcc" -Accflags="-Werror=declaration-after-statement" -Duseithreads
  [stdio] -Dcc="ccache gcc" -Accflags="-Werror=declaration-after-statement" -Duseithreads DEBUGGING
~~ ../cpan/Pod-Simple/t/encod03.t .............................. FAILED Bad plan.  You planned 4 tests but ran 1.
  [stdio] -Dcc="ccache gcc" -Accflags="-Werror=declaration-after-statement" -Duseithreads
  [stdio] -Dcc="ccache gcc" -Accflags="-Werror=declaration-after-statement" -Duseithreads DEBUGGING
~~ ../cpan/ExtUtils-MakeMaker/t/maketext_filter.t .............. FAILED Bad plan.  You planned 6 tests but ran 0.
  [stdio] -Dcc="ccache gcc" -Accflags="-Werror=declaration-after-statement" -Duseithreads
  [stdio] -Dcc="ccache gcc" -Accflags="-Werror=declaration-after-statement" -Duseithreads DEBUGGING
~~ ../cpan/Encode/t/utf8strict.t ............................... FAILED No plan found in TAP output
  [stdio] -Dcc="ccache gcc" -Accflags="-Werror=declaration-after-statement" -Duseithreads
  [stdio] -Dcc="ccache gcc" -Accflags="-Werror=declaration-after-statement" -Duseithreads DEBUGGING
~~ ../cpan/ExtUtils-MakeMaker/t/arch_check.t ................... FAILED No plan found in TAP output
  [stdio] -Dcc="ccache gcc" -Accflags="-Werror=declaration-after-statement" -Duseithreads
  [stdio] -Dcc="ccache gcc" -Accflags="-Werror=declaration-after-statement" -Duseithreads DEBUGGING
~~ ../cpan/IPC-Cmd/t/01_IPC-Cmd.t .............................. FAILED No plan found in TAP output
  [stdio] -Dcc="ccache gcc" -Accflags="-Werror=declaration-after-statement" -Duseithreads
  [stdio] -Dcc="ccache gcc" -Accflags="-Werror=declaration-after-statement" -Duseithreads DEBUGGING
~~ ../ext/Sys-Hostname/t/Hostname.t ............................ FAILED Non-zero exit status: 255 No plan found in TAP output
  [stdio] -Dcc="ccache gcc" -Accflags="-Werror=declaration-after-statement" -Duseithreads
  [stdio] -Dcc="ccache gcc" -Accflags="-Werror=declaration-after-statement" DEBUGGING
  [stdio] -Dcc="ccache gcc" -Accflags="-Werror=declaration-after-statement"
  [stdio] -Dcc="ccache gcc" -Accflags="-Werror=declaration-after-statement" -Duseithreads DEBUGGING
~~ ../ext/Fcntl/t/fcntl.t ...................................... FAILED Non-zero exit status: 2 No plan found in TAP output
  [stdio] -Dcc="ccache gcc" -Accflags="-Werror=declaration-after-statement" -Duseithreads
  [stdio] -Dcc="ccache gcc" -Accflags="-Werror=declaration-after-statement" DEBUGGING
  [stdio] -Dcc="ccache gcc" -Accflags="-Werror=declaration-after-statement"
  [stdio] -Dcc="ccache gcc" -Accflags="-Werror=declaration-after-statement" -Duseithreads DEBUGGING
~~ ../cpan/Test-Simple/t/Legacy/harness_active.t ............... FAILED Non-zero exit status: 255 No plan found in TAP output
  [stdio] -Dcc="ccache gcc" -Accflags="-Werror=declaration-after-statement" -Duseithreads
  [stdio] -Dcc="ccache gcc" -Accflags="-Werror=declaration-after-statement" DEBUGGING
  [stdio] -Dcc="ccache gcc" -Accflags="-Werror=declaration-after-statement"
  [stdio] -Dcc="ccache gcc" -Accflags="-Werror=declaration-after-statement" -Duseithreads DEBUGGING
~~ ../cpan/ExtUtils-MakeMaker/t/build_man.t .................... FAILED Bad plan.  You planned 50 tests but ran 0.
  [stdio] -Dcc="ccache gcc" -Accflags="-Werror=declaration-after-statement" -Duseithreads
  [stdio] -Dcc="ccache gcc" -Accflags="-Werror=declaration-after-statement" -Duseithreads DEBUGGING
~~ ../cpan/ExtUtils-MakeMaker/t/prereq.t ....................... FAILED Bad plan.  You planned 21 tests but ran 0.
  [stdio] -Dcc="ccache gcc" -Accflags="-Werror=declaration-after-statement" -Duseithreads
  [stdio] -Dcc="ccache gcc" -Accflags="-Werror=declaration-after-statement" -Duseithreads DEBUGGING
~~ ../cpan/Test-Simple/t/Legacy/subtest/predicate.t ............ FAILED Non-zero exit status: 255 Bad plan.  You planned 5 tests but ran 0.
  [stdio] -Dcc="ccache gcc" -Accflags="-Werror=declaration-after-statement" -Duseithreads
  [stdio] -Dcc="ccache gcc" -Accflags="-Werror=declaration-after-statement" DEBUGGING
  [stdio] -Dcc="ccache gcc" -Accflags="-Werror=declaration-after-statement"
  [stdio] -Dcc="ccache gcc" -Accflags="-Werror=declaration-after-statement" -Duseithreads DEBUGGING
~~ ../t/uni/upper.t ............................................ FAILED No plan found in TAP output
  [stdio] -Dcc="ccache gcc" -Accflags="-Werror=declaration-after-statement" -Duseithreads
  [stdio] -Dcc="ccache gcc" -Accflags="-Werror=declaration-after-statement" -Duseithreads DEBUGGING
~~ ../cpan/ExtUtils-MakeMaker/t/PL_FILES.t ..................... FAILED No plan found in TAP output
  [stdio] -Dcc="ccache gcc" -Accflags="-Werror=declaration-after-statement" -Duseithreads
  [stdio] -Dcc="ccache gcc" -Accflags="-Werror=declaration-after-statement" -Duseithreads DEBUGGING
~~ ../lib/croak.t .............................................. FAILED 88
  [stdio] -Dcc="ccache gcc" -Accflags="-Werror=declaration-after-statement" -Duseithreads
  [stdio] -Dcc="ccache gcc" -Accflags="-Werror=declaration-after-statement" DEBUGGING
  [stdio] -Dcc="ccache gcc" -Accflags="-Werror=declaration-after-statement"
  [stdio] -Dcc="ccache gcc" -Accflags="-Werror=declaration-after-statement" -Duseithreads DEBUGGING
~~ ../cpan/Test-Simple/t/Legacy/diag.t ......................... FAILED Non-zero exit status: 255 No plan found in TAP output
  [stdio] -Dcc="ccache gcc" -Accflags="-Werror=declaration-after-statement" -Duseithreads
  [stdio] -Dcc="ccache gcc" -Accflags="-Werror=declaration-after-statement" -Duseithreads DEBUGGING
~~ ../dist/ExtUtils-CBuilder/t/04-base.t ....................... FAILED Bad plan.  You planned 65 tests but ran 0.
  [stdio] -Dcc="ccache gcc" -Accflags="-Werror=declaration-after-statement" -Duseithreads
  [stdio] -Dcc="ccache gcc" -Accflags="-Werror=declaration-after-statement" -Duseithreads DEBUGGING
~~ ../lib/locale_threads.t ..................................... FAILED 2
  [stdio] -Dcc="ccache gcc" -Accflags="-Werror=declaration-after-statement" -Duseithreads
  [stdio] -Dcc="ccache gcc" -Accflags="-Werror=declaration-after-statement" -Duseithreads DEBUGGING
~~ ../ext/B/t/optree_sort.t .................................... FAILED Non-zero exit status: 255 No plan found in TAP output
  [stdio] -Dcc="ccache gcc" -Accflags="-Werror=declaration-after-statement" -Duseithreads
  [stdio] -Dcc="ccache gcc" -Accflags="-Werror=declaration-after-statement" DEBUGGING
  [stdio] -Dcc="ccache gcc" -Accflags="-Werror=declaration-after-statement"
  [stdio] -Dcc="ccache gcc" -Accflags="-Werror=declaration-after-statement" -Duseithreads DEBUGGING
~~ ../t/porting/regen.t ........................................ FAILED Non-zero exit status: 255 Bad plan.  You planned 48 tests but ran 10.
  [stdio] -Dcc="ccache gcc" -Accflags="-Werror=declaration-after-statement" -Duseithreads
  [stdio] -Dcc="ccache gcc" -Accflags="-Werror=declaration-after-statement" -Duseithreads DEBUGGING
~~ ../ext/Hash-Util-FieldHash/t/04_thread.t .................... FAILED Non-zero exit status: 255 Bad plan.  You planned 30 tests but ran 6.
  [stdio] -Dcc="ccache gcc" -Accflags="-Werror=declaration-after-statement" -Duseithreads
  [stdio] -Dcc="ccache gcc" -Accflags="-Werror=declaration-after-statement" -Duseithreads DEBUGGING
~~ ../ext/File-Glob/t/threads.t ................................ FAILED Non-zero exit status: 2 No plan found in TAP output
  [stdio] -Dcc="ccache gcc" -Accflags="-Werror=declaration-after-statement" -Duseithreads
  [stdio] -Dcc="ccache gcc" -Accflags="-Werror=declaration-after-statement" DEBUGGING
  [stdio] -Dcc="ccache gcc" -Accflags="-Werror=declaration-after-statement"
  [stdio] -Dcc="ccache gcc" -Accflags="-Werror=declaration-after-statement" -Duseithreads DEBUGGING
~~ ../dist/threads/t/stack.t ................................... FAILED Non-zero exit status: 255 Bad plan.  You planned 18 tests but ran 0.
  [stdio] -Dcc="ccache gcc" -Accflags="-Werror=declaration-after-statement" -Duseithreads
  [stdio] -Dcc="ccache gcc" -Accflags="-Werror=declaration-after-statement" -Duseithreads DEBUGGING
~~ ../cpan/Encode/t/fallback.t ................................. FAILED Bad plan.  You planned 58 tests but ran 0.
  [stdio] -Dcc="ccache gcc" -Accflags="-Werror=declaration-after-statement" -Duseithreads
  [stdio] -Dcc="ccache gcc" -Accflags="-Werror=declaration-after-statement" -Duseithreads DEBUGGING
~~ ../dist/Data-Dumper/t/bugs.t ................................ FAILED Bad plan.  You planned 24 tests but ran 6.
  [stdio] -Dcc="ccache gcc" -Accflags="-Werror=declaration-after-statement" -Duseithreads
  [stdio] -Dcc="ccache gcc" -Accflags="-Werror=declaration-after-statement" -Duseithreads DEBUGGING
~~ ../cpan/ExtUtils-MakeMaker/t/MakeMaker_Parameters.t ......... FAILED No plan found in TAP output
  [stdio] -Dcc="ccache gcc" -Accflags="-Werror=declaration-after-statement" -Duseithreads
  [stdio] -Dcc="ccache gcc" -Accflags="-Werror=declaration-after-statement" -Duseithreads DEBUGGING
~~ ../cpan/CPAN/t/11mirroredby.t ............................... FAILED Bad plan.  You planned 6 tests but ran 0.
  [stdio] -Dcc="ccache gcc" -Accflags="-Werror=declaration-after-statement" -Duseithreads
  [stdio] -Dcc="ccache gcc" -Accflags="-Werror=declaration-after-statement" -Duseithreads DEBUGGING
~~ ../cpan/Pod-Perldoc/t/00_load.t ............................. FAILED Bad plan.  You planned 12 tests but ran 0.
  [stdio] -Dcc="ccache gcc" -Accflags="-Werror=declaration-after-statement" -Duseithreads
  [stdio] -Dcc="ccache gcc" -Accflags="-Werror=declaration-after-statement" -Duseithreads DEBUGGING
~~ ../ext/File-Glob/t/basic.t .................................. FAILED Non-zero exit status: 2 No plan found in TAP output
  [stdio] -Dcc="ccache gcc" -Accflags="-Werror=declaration-after-statement" -Duseithreads
  [stdio] -Dcc="ccache gcc" -Accflags="-Werror=declaration-after-statement" DEBUGGING
  [stdio] -Dcc="ccache gcc" -Accflags="-Werror=declaration-after-statement"
  [stdio] -Dcc="ccache gcc" -Accflags="-Werror=declaration-after-statement" -Duseithreads DEBUGGING
~~ ../cpan/Test-Simple/t/Test2/legacy/TAP.t .................... FAILED Non-zero exit status: 255 No plan found in TAP output
  [stdio] -Dcc="ccache gcc" -Accflags="-Werror=declaration-after-statement" -Duseithreads
  [stdio] -Dcc="ccache gcc" -Accflags="-Werror=declaration-after-statement" DEBUGGING
  [stdio] -Dcc="ccache gcc" -Accflags="-Werror=declaration-after-statement"
  [stdio] -Dcc="ccache gcc" -Accflags="-Werror=declaration-after-statement" -Duseithreads DEBUGGING
~~ ../cpan/podlators/t/text/snippets.t ......................... FAILED Bad plan.  You planned 53 tests but ran 0.
  [stdio] -Dcc="ccache gcc" -Accflags="-Werror=declaration-after-statement" -Duseithreads
  [stdio] -Dcc="ccache gcc" -Accflags="-Werror=declaration-after-statement" -Duseithreads DEBUGGING
~~ ../ext/File-Glob/t/global.t ................................. FAILED Non-zero exit status: 2 No plan found in TAP output
  [stdio] -Dcc="ccache gcc" -Accflags="-Werror=declaration-after-statement" -Duseithreads
  [stdio] -Dcc="ccache gcc" -Accflags="-Werror=declaration-after-statement" DEBUGGING
  [stdio] -Dcc="ccache gcc" -Accflags="-Werror=declaration-after-statement"
  [stdio] -Dcc="ccache gcc" -Accflags="-Werror=declaration-after-statement" -Duseithreads DEBUGGING
~~ ../cpan/Text-Balanced/t/07_exttag.t ......................... FAILED Non-zero exit status: 255 Bad plan.  You planned 53 tests but ran 0.
  [stdio] -Dcc="ccache gcc" -Accflags="-Werror=declaration-after-statement" -Duseithreads
  [stdio] -Dcc="ccache gcc" -Accflags="-Werror=declaration-after-statement" DEBUGGING
  [stdio] -Dcc="ccache gcc" -Accflags="-Werror=declaration-after-statement"
  [stdio] -Dcc="ccache gcc" -Accflags="-Werror=declaration-after-statement" -Duseithreads DEBUGGING
~~ ../dist/autouse/t/autouse.t ................................. FAILED Non-zero exit status: 255 Bad plan.  You planned 15 tests but ran 0.
  [stdio] -Dcc="ccache gcc" -Accflags="-Werror=declaration-after-statement" -Duseithreads
  [stdio] -Dcc="ccache gcc" -Accflags="-Werror=declaration-after-statement" DEBUGGING
  [stdio] -Dcc="ccache gcc" -Accflags="-Werror=declaration-after-statement"
  [stdio] -Dcc="ccache gcc" -Accflags="-Werror=declaration-after-statement" -Duseithreads DEBUGGING
~~ ../ext/XS-APItest/t/handy02.t ............................... FAILED No plan found in TAP output
  [stdio] -Dcc="ccache gcc" -Accflags="-Werror=declaration-after-statement" -Duseithreads
  [stdio] -Dcc="ccache gcc" -Accflags="-Werror=declaration-after-statement" -Duseithreads DEBUGGING
~~ ../dist/Storable/t/integer.t ................................ FAILED No plan found in TAP output
  [stdio] -Dcc="ccache gcc" -Accflags="-Werror=declaration-after-statement" -Duseithreads
  [stdio] -Dcc="ccache gcc" -Accflags="-Werror=declaration-after-statement" -Duseithreads DEBUGGING
~~ ../cpan/ExtUtils-MakeMaker/t/split_command.t ................ FAILED Non-zero exit status: 255 Bad plan.  You planned 7 tests but ran 0.
  [stdio] -Dcc="ccache gcc" -Accflags="-Werror=declaration-after-statement" DEBUGGING
  [stdio] -Dcc="ccache gcc" -Accflags="-Werror=declaration-after-statement"
~~ ../lib/feature.t ............................................ FAILED 7-8 58-65
  [stdio] -Dcc="ccache gcc" -Accflags="-Werror=declaration-after-statement" -Duseithreads
  [stdio] -Dcc="ccache gcc" -Accflags="-Werror=declaration-after-statement" DEBUGGING
  [stdio] -Dcc="ccache gcc" -Accflags="-Werror=declaration-after-statement"
  [stdio] -Dcc="ccache gcc" -Accflags="-Werror=declaration-after-statement" -Duseithreads DEBUGGING
~~ ../cpan/ExtUtils-MakeMaker/t/metafile_file.t ................ FAILED Bad plan.  You planned 16 tests but ran 0.
  [stdio] -Dcc="ccache gcc" -Accflags="-Werror=declaration-after-statement" -Duseithreads
  [stdio] -Dcc="ccache gcc" -Accflags="-Werror=declaration-after-statement" -Duseithreads DEBUGGING
~~ ../t/uni/variables.t ........................................ FAILED 44
  [stdio] -Dcc="ccache gcc" -Accflags="-Werror=declaration-after-statement" -Duseithreads
  [stdio] -Dcc="ccache gcc" -Accflags="-Werror=declaration-after-statement" DEBUGGING
  [stdio] -Dcc="ccache gcc" -Accflags="-Werror=declaration-after-statement"
  [stdio] -Dcc="ccache gcc" -Accflags="-Werror=declaration-after-statement" -Duseithreads DEBUGGING
~~ ../lib/perl7db.t ............................................ FAILED 1-2 74 116-120
  [stdio] -Dcc="ccache gcc" -Accflags="-Werror=declaration-after-statement" -Duseithreads
  [stdio] -Dcc="ccache gcc" -Accflags="-Werror=declaration-after-statement" DEBUGGING
  [stdio] -Dcc="ccache gcc" -Accflags="-Werror=declaration-after-statement"
  [stdio] -Dcc="ccache gcc" -Accflags="-Werror=declaration-after-statement" -Duseithreads DEBUGGING
~~ ../cpan/Pod-Simple/t/corpus.t ............................... FAILED Bad plan.  You planned 61 tests but ran 1.
  [stdio] -Dcc="ccache gcc" -Accflags="-Werror=declaration-after-statement" -Duseithreads
  [stdio] -Dcc="ccache gcc" -Accflags="-Werror=declaration-after-statement" -Duseithreads DEBUGGING
~~ ../cpan/Test-Simple/t/Test2/modules/Hub.t ................... FAILED No plan found in TAP output
  [stdio] -Dcc="ccache gcc" -Accflags="-Werror=declaration-after-statement" -Duseithreads
  [stdio] -Dcc="ccache gcc" -Accflags="-Werror=declaration-after-statement" -Duseithreads DEBUGGING
~~ ../cpan/Tie-RefHash/t/storable.t ............................ FAILED No plan found in TAP output
  [stdio] -Dcc="ccache gcc" -Accflags="-Werror=declaration-after-statement" -Duseithreads
  [stdio] -Dcc="ccache gcc" -Accflags="-Werror=declaration-after-statement" -Duseithreads DEBUGGING
~~ ../t/re/fold_grind_u.t ...................................... FAILED No plan found in TAP output
  [stdio] -Dcc="ccache gcc" -Accflags="-Werror=declaration-after-statement" -Duseithreads
  [stdio] -Dcc="ccache gcc" -Accflags="-Werror=declaration-after-statement" -Duseithreads DEBUGGING
~~ ../cpan/Pod-Simple/t/JustPod_corpus.t ....................... FAILED Bad plan.  You planned 19 tests but ran 17.
  [stdio] -Dcc="ccache gcc" -Accflags="-Werror=declaration-after-statement" -Duseithreads
  [stdio] -Dcc="ccache gcc" -Accflags="-Werror=declaration-after-statement" -Duseithreads DEBUGGING
~~ ../cpan/Encode/t/xml.t ...................................... FAILED No plan found in TAP output
  [stdio] -Dcc="ccache gcc" -Accflags="-Werror=declaration-after-statement" -Duseithreads
  [stdio] -Dcc="ccache gcc" -Accflags="-Werror=declaration-after-statement" -Duseithreads DEBUGGING
~~ ../cpan/podlators/t/man/devise-date.t ....................... FAILED No plan found in TAP output
  [stdio] -Dcc="ccache gcc" -Accflags="-Werror=declaration-after-statement" -Duseithreads
  [stdio] -Dcc="ccache gcc" -Accflags="-Werror=declaration-after-statement" -Duseithreads DEBUGGING
~~ ../ext/XS-APItest/t/handy00.t ............................... FAILED No plan found in TAP output
  [stdio] -Dcc="ccache gcc" -Accflags="-Werror=declaration-after-statement" -Duseithreads
  [stdio] -Dcc="ccache gcc" -Accflags="-Werror=declaration-after-statement" -Duseithreads DEBUGGING
~~ ../cpan/podlators/t/general/filehandle.t .................... FAILED Bad plan.  You planned 4 tests but ran 0.
  [stdio] -Dcc="ccache gcc" -Accflags="-Werror=declaration-after-statement" -Duseithreads
  [stdio] -Dcc="ccache gcc" -Accflags="-Werror=declaration-after-statement" -Duseithreads DEBUGGING
~~ ../dist/threads-shared/t/av_refs.t .......................... FAILED Non-zero exit status: 255 Bad plan.  You planned 14 tests but ran 0.
  [stdio] -Dcc="ccache gcc" -Accflags="-Werror=declaration-after-statement" -Duseithreads
  [stdio] -Dcc="ccache gcc" -Accflags="-Werror=declaration-after-statement" -Duseithreads DEBUGGING
~~ ../dist/Storable/t/tied_items.t ............................. FAILED No plan found in TAP output
  [stdio] -Dcc="ccache gcc" -Accflags="-Werror=declaration-after-statement" -Duseithreads
  [stdio] -Dcc="ccache gcc" -Accflags="-Werror=declaration-after-statement" -Duseithreads DEBUGGING
~~ ../cpan/Test-Simple/t/Legacy/subtest/threads.t .............. FAILED Non-zero exit status: 255 No plan found in TAP output
  [stdio] -Dcc="ccache gcc" -Accflags="-Werror=declaration-after-statement" -Duseithreads
  [stdio] -Dcc="ccache gcc" -Accflags="-Werror=declaration-after-statement" -Duseithreads DEBUGGING
~~ ../cpan/ExtUtils-MakeMaker/t/problems.t ..................... FAILED Bad plan.  You planned 5 tests but ran 0.
  [stdio] -Dcc="ccache gcc" -Accflags="-Werror=declaration-after-statement" -Duseithreads
  [stdio] -Dcc="ccache gcc" -Accflags="-Werror=declaration-after-statement" -Duseithreads DEBUGGING
~~ ../cpan/Test-Simple/t/Test2/modules/Tools/Tiny.t ............ FAILED No plan found in TAP output
  [stdio] -Dcc="ccache gcc" -Accflags="-Werror=declaration-after-statement" -Duseithreads
  [stdio] -Dcc="ccache gcc" -Accflags="-Werror=declaration-after-statement" -Duseithreads DEBUGGING
~~ ../cpan/Encode/t/rt113164.t ................................. FAILED Bad plan.  You planned 2 tests but ran 0.
  [stdio] -Dcc="ccache gcc" -Accflags="-Werror=declaration-after-statement" -Duseithreads
  [stdio] -Dcc="ccache gcc" -Accflags="-Werror=declaration-after-statement" -Duseithreads DEBUGGING
~~ ../cpan/version/t/02derived.t ............................... FAILED Non-zero exit status: 255
  [stdio] -Dcc="ccache gcc" -Accflags="-Werror=declaration-after-statement" -Duseithreads
  [stdio] -Dcc="ccache gcc" -Accflags="-Werror=declaration-after-statement" DEBUGGING
  [stdio] -Dcc="ccache gcc" -Accflags="-Werror=declaration-after-statement"
  [stdio] -Dcc="ccache gcc" -Accflags="-Werror=declaration-after-statement" -Duseithreads DEBUGGING
~~ ../cpan/IO-Compress/t/110encode-rawdeflate.t ................ FAILED No plan found in TAP output
  [stdio] -Dcc="ccache gcc" -Accflags="-Werror=declaration-after-statement" -Duseithreads
  [stdio] -Dcc="ccache gcc" -Accflags="-Werror=declaration-after-statement" -Duseithreads DEBUGGING
~~ ../cpan/podlators/t/general/basic.t ......................... FAILED Bad plan.  You planned 15 tests but ran 0.
  [stdio] -Dcc="ccache gcc" -Accflags="-Werror=declaration-after-statement" -Duseithreads
  [stdio] -Dcc="ccache gcc" -Accflags="-Werror=declaration-after-statement" -Duseithreads DEBUGGING
~~ ../cpan/Archive-Tar/t/08_ptargrep.t ......................... FAILED 1 Non-zero exit status: 1
  [stdio] -Dcc="ccache gcc" -Accflags="-Werror=declaration-after-statement" -Duseithreads
  [stdio] -Dcc="ccache gcc" -Accflags="-Werror=declaration-after-statement" -Duseithreads DEBUGGING
~~ ../cpan/Test-Simple/t/Test2/acceptance/try_it_no_plan.t ..... FAILED Non-zero exit status: 255 No plan found in TAP output
  [stdio] -Dcc="ccache gcc" -Accflags="-Werror=declaration-after-statement" -Duseithreads
  [stdio] -Dcc="ccache gcc" -Accflags="-Werror=declaration-after-statement" DEBUGGING
  [stdio] -Dcc="ccache gcc" -Accflags="-Werror=declaration-after-statement"
  [stdio] -Dcc="ccache gcc" -Accflags="-Werror=declaration-after-statement" -Duseithreads DEBUGGING
~~ ../cpan/podlators/t/man/devise-title.t ...................... FAILED Bad plan.  You planned 5 tests but ran 0.
  [stdio] -Dcc="ccache gcc" -Accflags="-Werror=declaration-after-statement" -Duseithreads
  [stdio] -Dcc="ccache gcc" -Accflags="-Werror=declaration-after-statement" -Duseithreads DEBUGGING
~~ ../ext/File-DosGlob/t/DosGlob.t ............................. FAILED Non-zero exit status: 255 Bad plan.  You planned 21 tests but ran 0.
  [stdio] -Dcc="ccache gcc" -Accflags="-Werror=declaration-after-statement" -Duseithreads
  [stdio] -Dcc="ccache gcc" -Accflags="-Werror=declaration-after-statement" DEBUGGING
  [stdio] -Dcc="ccache gcc" -Accflags="-Werror=declaration-after-statement"
  [stdio] -Dcc="ccache gcc" -Accflags="-Werror=declaration-after-statement" -Duseithreads DEBUGGING

Test todo-passed:
~~ ../t/perf/optree.t .......................................... PASSED 51-2285
  [stdio] -Dcc="ccache gcc" -Accflags="-Werror=declaration-after-statement" -Duseithreads
  [stdio] -Dcc="ccache gcc" -Accflags="-Werror=declaration-after-statement" DEBUGGING
  [stdio] -Dcc="ccache gcc" -Accflags="-Werror=declaration-after-statement"
  [stdio] -Dcc="ccache gcc" -Accflags="-Werror=declaration-after-statement" -Duseithreads DEBUGGING
~~ ../dist/Safe/t/safesort.t ................................... PASSED 10
  [stdio] -Dcc="ccache gcc" -Accflags="-Werror=declaration-after-statement" -Duseithreads
  [stdio] -Dcc="ccache gcc" -Accflags="-Werror=declaration-after-statement" DEBUGGING
  [stdio] -Dcc="ccache gcc" -Accflags="-Werror=declaration-after-statement"
  [stdio] -Dcc="ccache gcc" -Accflags="-Werror=declaration-after-statement" -Duseithreads DEBUGGING
~~ ../t/run/runenv.t ........................................... PASSED 65
  [stdio] -Dcc="ccache gcc" -Accflags="-Werror=declaration-after-statement" DEBUGGING
  [stdio] -Dcc="ccache gcc" -Accflags="-Werror=declaration-after-statement"
  [stdio] -Dcc="ccache gcc" -Accflags="-Werror=declaration-after-statement" -Duseithreads DEBUGGING

MANIFEST messages:
  MANIFEST did not declare '.mailmap'

Compiler messages:
  Opcode.xs: In function ‘XS_Opcode_invert_opset’:
  Opcode.xs:363:25: warning: overflow in conversion from ‘int’ to ‘char’ changes value from ‘(int)*(bitmap + ((sizetype)my_cxt.x_opset_len + 4294967295)) & -256’ to ‘0’ [-Woverflow]
  re_exec.c: In function ‘S_dump_exec_pos’:
  re_exec.c:4162:21: warning: format ‘%u’ expects argument of type ‘unsigned int’, but argument 12 has type ‘U32’ {aka ‘const long unsigned int’} [-Wformat=]
  re_exec.c:4162:55: note: format string is defined here
  ./const-xs.inc: In function ‘boot_Socket’:
  ./const-xs.inc:131:13: warning: AI_IDN_ALLOW_UNASSIGNED is deprecated
  ./const-xs.inc:134:13: warning: AI_IDN_USE_STD3_ASCII_RULES is deprecated
  ./const-xs.inc:386:13: warning: NI_IDN_ALLOW_UNASSIGNED is deprecated
  ./const-xs.inc:389:13: warning: NI_IDN_USE_STD3_ASCII_RULES is deprecated
  APItest.xs: In function ‘XS_XS__APItest__HvMacro_u8_to_u16_le’:
  APItest.xs:6895:13: warning: unused variable ‘u64’ [-Wunused-variable]
  regexec.c: In function ‘S_dump_exec_pos’:
  regexec.c:4162:21: warning: format ‘%u’ expects argument of type ‘unsigned int’, but argument 12 has type ‘U32’ {aka ‘const long unsigned int’} [-Wformat=]
  regexec.c:4162:55: note: format string is defined here
  Storable.xs: In function ‘store_scalar’:
  Storable.xs:2585:22: warning: format ‘%f’ expects argument of type ‘double’, but argument 2 has type ‘NV_bytes’ {aka ‘union ’} [-Wformat=]
  Storable.xs:131:30: note: in definition of macro ‘TRACEME’
  time64.c: In function ‘Perl_localtime64_r’:
  time64.c:573:30: warning: ‘orig_year’ may be used uninitialized in this function [-Wmaybe-uninitialized]
  Opcode.xs: In function ‘opmask_addlocal’:
  Opcode.xs:240:17: warning: cast between incompatible function types from ‘void (*)(PerlInterpreter *, const char *, ...)’ {aka ‘void (*)(struct interpreter *, const char *, ...)’} to ‘void (*)(void *)’ [-Wcast-function-type]
  ../../embed.h:496:57: note: in definition of macro ‘save_destructor’
  Opcode.xs:240:2: note: in expansion of macro ‘SAVEDESTRUCTOR’
  Opcode.xs:363:25: warning: overflow in conversion from ‘int’ to ‘char’ changes value from ‘(int)*(bitmap + ((sizetype)my_cxtp->x_opset_len + 4294967295)) & -256’ to ‘0’ [-Woverflow]
  re_exec.c:4162:21: warning: format ‘%u’ expects argument of type ‘unsigned int’, but argument 13 has type ‘U32’ {aka ‘const long unsigned int’} [-Wformat=]
  Storable.xs: In function ‘store_hash’:
  ../../thread.h:314:38: warning: request for implicit conversion from ‘void *’ to ‘PerlInterpreter *’ {aka ‘struct interpreter *’} not permitted in C++ [-Wc++-compat]
  ../../thread.h:314:38: note: in definition of macro ‘PTHREAD_GETSPECIFIC’
  Storable.xs:1363:38: note: in expansion of macro ‘PERL_GET_CONTEXT’
  Storable.xs:2921:9: note: in expansion of macro ‘STORE_HASH_SORT’
  shared.xs:1221:5: warning: initialization of ‘int (*)(PerlInterpreter *, SV *, MAGIC *, SV *, const char *, I32)’ {aka ‘int (*)(struct interpreter *, struct sv *, struct magic *, struct sv *, const char *, long int)’} from incompatible pointer type ‘int (*)(PerlInterpreter *, SV *, MAGIC *, SV *, const char *, int)’ {aka ‘int (*)(struct interpreter *, struct sv *, struct magic *, struct sv *, const char *, int)’} [-Wincompatible-pointer-types]
  shared.xs:1221:5: note: (near initialization for ‘sharedsv_array_vtbl.svt_copy’)
  regexec.c:4162:21: warning: format ‘%u’ expects argument of type ‘unsigned int’, but argument 13 has type ‘U32’ {aka ‘const long unsigned int’} [-Wformat=]
  ListUtil.c: In function ‘XS_List__Util_reduce’:
  ../../embed.h:59:23: warning: ‘retvals’ may be used uninitialized in this function [-Wmaybe-uninitialized]
  ListUtil.xs:534:9: note: ‘retvals’ was declared here

About this smoke:
    smoking-perl: 5.28.1
  smoker-version: 1.72/0.046
       timestamp: 2020-07-11 15:03:10+00
          tester: perl

Smoke logs available at http://m-l.org/~perl/smoke/perl/arm-linux-gnueabihf-thread-multi-64int/smoke-me_gcc_quick/James%20E%20Keenan/log39568decb91df7e01426bdd32a20f626e3953186.log.gz
-- 
Report generated by Test::Smoke::Gateway v0.09_01