Show logfile
Automated smoke report for branch blead 5.33.0 patch 0382c61de115275c09bf1fbe39aa02e6118da28c v5.32.0-3-g0382c61de1
cjg-netbsd8: Intel 686-class (amd64/1 cpus)
    on        netbsd 8.2
    using     gcc version 5.5.0 (*1)
    smoketime 8 hours 38 minutes (average 43 minutes 13 seconds)

Summary: FAIL(F)

O = OK  F = Failure(s), extended report at the bottom
X = Failure(s) under TEST but not under harness
? = still running or test results not (yet) available
Build failures during:       - = unknown or N/A
c = Configure, m = make, M = make (after miniperl), t = make test-prep

v5.32.0-3-g0382c61de1
---------------------- ----------------------------------------------------
O  O                    -Dcc=gcc (*1)
O  O                    -Dcc=gcc -Duse64bitall (*1)
F  F                    -Dcc=gcc -Duselongdouble (*1)
O  O                    -Dcc=gcc -Duseithreads (*1)
O  O                    -Dcc=gcc -Duseithreads -Duse64bitall (*1)
F  F                    -Dcc=gcc -Duseithreads -Duselongdouble (*1)
|  |
|  +------------------  stdio DEBUGGING
+---------------------  stdio

Applied patches:
  SMOKE0382c61de115275c09bf1fbe39aa02e6118da28c

Skipped tests:
      # One test name on a line

Test failures:
~~ ../cpan/ExtUtils-MakeMaker/t/03-xsstatic.t .................. FAILED 5 Non-zero exit status: 6
  [stdio] -Dcc=gcc -Duseithreads -Duselongdouble
  [stdio] -Dcc=gcc -Duselongdouble DEBUGGING
  [stdio] -Dcc=gcc -Duseithreads -Duselongdouble DEBUGGING
  [stdio] -Dcc=gcc -Duselongdouble
~~ ../cpan/ExtUtils-MakeMaker/t/basic.t ........................ FAILED 22-28 Non-zero exit status: 7
  [stdio] -Dcc=gcc -Duseithreads -Duselongdouble
  [stdio] -Dcc=gcc -Duselongdouble DEBUGGING
  [stdio] -Dcc=gcc -Duseithreads -Duselongdouble DEBUGGING
  [stdio] -Dcc=gcc -Duselongdouble
~~ ../ext/POSIX/t/math.t ....................................... FAILED Non-zero exit status: 1 No plan found in TAP output
  [stdio] -Dcc=gcc -Duseithreads -Duselongdouble
  [stdio] -Dcc=gcc -Duselongdouble DEBUGGING
  [stdio] -Dcc=gcc -Duseithreads -Duselongdouble DEBUGGING
  [stdio] -Dcc=gcc -Duselongdouble
~~ ../cpan/ExtUtils-MakeMaker/t/02-xsdynamic.t ................. FAILED 5 71 Non-zero exit status: 12
  [stdio] -Dcc=gcc -Duseithreads -Duselongdouble
  [stdio] -Dcc=gcc -Duselongdouble DEBUGGING
  [stdio] -Dcc=gcc -Duseithreads -Duselongdouble DEBUGGING
  [stdio] -Dcc=gcc -Duselongdouble

Test todo-passed:

MANIFEST messages:
  MANIFEST did not declare '.mailmap'

Compiler messages:
  /usr/include/sys/cdefs_elf.h:67:20: error: missing binary operator before token "("
  /usr/include/sys/cdefs_elf.h:73:20: error: missing binary operator before token "("
  /usr/include/sys/cdefs_elf.h:79:20: error: missing binary operator before token "("
  DB_File.xs: In function 'ParseOpenInfo':
  DB_File.xs:476:44: warning: suggest braces around empty body in an 'if' statement [-Wempty-body]
  DB_File.xs:1044:13: note: in expansion of macro 'croak_and_free'
  DB_File.xs:1050:13: note: in expansion of macro 'croak_and_free'
  DB_File.xs:1056:17: note: in expansion of macro 'croak_and_free'
  DB_File.xs:1091:17: note: in expansion of macro 'croak_and_free'
  DB_File.xs:1140:17: note: in expansion of macro 'croak_and_free'
  DB_File.xs:1229:13: note: in expansion of macro 'croak_and_free'
  Socket.c: In function 'XS_Socket_pack_ip_mreq_source':
  Socket.c:1673:7: warning: variable 'interface' set but not used [-Wunused-but-set-variable]
  const-c.inc: In function 'constant_19':
  const-c.inc:351:42: warning: unused parameter 'iv_return' [-Wunused-parameter]
  re_exec.c: In function 'S_regtry':
  re_exec.c:6539:30: warning: 'fold_array' may be used uninitialized in this function [-Wmaybe-uninitialized]
  re_exec.c:6443:17: note: 'fold_array' was declared here
  re_exec.c:6545:22: warning: 'folder' may be used uninitialized in this function [-Wmaybe-uninitialized]
  re_exec.c:6442:16: note: 'folder' was declared here
  regexec.c: In function 'S_regtry':
  regexec.c:6539:30: warning: 'fold_array' may be used uninitialized in this function [-Wmaybe-uninitialized]
  regexec.c:6443:17: note: 'fold_array' was declared here
  regexec.c:6545:22: warning: 'folder' may be used uninitialized in this function [-Wmaybe-uninitialized]
  regexec.c:6442:16: note: 'folder' was declared here
  time64.c: In function 'Perl_localtime64_r':
  time64.c:573:30: warning: 'orig_year' may be used uninitialized in this function [-Wmaybe-uninitialized]
  ListUtil.c: In function 'XS_List__Util_reduce':
  ../../embed.h:59:23: warning: 'retvals' may be used uninitialized in this function [-Wmaybe-uninitialized]
  ListUtil.xs:530:9: note: 'retvals' was declared here

About this smoke:
    smoking-perl: 5.26.1
  smoker-version: 1.71/0.046
       timestamp: 2020-06-28 17:24:04+00
          tester: core

-- 
Report generated by Test::Smoke::Gateway v0.09_01