Show logfile
Automated smoke report for branch smoke-me/siphash13_chaskey 5.32.0 patch 5ac0a42f0a9da4c3acc4fea5f79ffcd03291b1cf v5.32.0-RC1-20-g5ac0a42f0a
cjg-dragonfly5: Intel(R) Xeon(R) CPU E5-2620 v2 @ 2.10GHz (x86_64/1 cpus)
    on        dragonfly 5.8-RELEASE
    using     gcc version 8.3 [DragonFly] Release/2019-02-22 (*1)
    smoketime 8 hours 18 minutes (average 41 minutes 32 seconds)

Summary: FAIL(F)

O = OK  F = Failure(s), extended report at the bottom
X = Failure(s) under TEST but not under harness
? = still running or test results not (yet) available
Build failures during:       - = unknown or N/A
c = Configure, m = make, M = make (after miniperl), t = make test-prep

v5.32.0-RC1-20-g5ac0a42f0a
---------------------- ----------------------------------------------------
F  F                    -Dcc=gcc (*1)
F  F                    -Dcc=gcc -Duse64bitall (*1)
F  F                    -Dcc=gcc -Duselongdouble (*1)
F  F                    -Dcc=gcc -Duseithreads (*1)
F  F                    -Dcc=gcc -Duseithreads -Duse64bitall (*1)
F  F                    -Dcc=gcc -Duseithreads -Duselongdouble (*1)
|  |
|  +------------------  stdio DEBUGGING
+---------------------  stdio

Applied patches:
  SMOKE5ac0a42f0a9da4c3acc4fea5f79ffcd03291b1cf

Skipped tests:
      # One test name on a line

Test failures:
~~ ../ext/POSIX/t/termios.t .................................... FAILED 74 Non-zero exit status: 6
  [stdio] -Dcc=gcc
  [stdio] -Dcc=gcc -Duselongdouble DEBUGGING
  [stdio] -Dcc=gcc -Duse64bitall
  [stdio] -Dcc=gcc -Duseithreads -Duse64bitall DEBUGGING
  [stdio] -Dcc=gcc -Duseithreads DEBUGGING
  [stdio] -Dcc=gcc -Duseithreads
  [stdio] -Dcc=gcc -Duseithreads -Duselongdouble
  [stdio] -Dcc=gcc -Duseithreads -Duselongdouble DEBUGGING
  [stdio] -Dcc=gcc DEBUGGING
  [stdio] -Dcc=gcc -Duse64bitall DEBUGGING
  [stdio] -Dcc=gcc -Duselongdouble
  [stdio] -Dcc=gcc -Duseithreads -Duse64bitall
~~ ../dist/Time-HiRes/t/utime.t ................................ FAILED 2-3 Non-zero exit status: 8
  [stdio] -Dcc=gcc
  [stdio] -Dcc=gcc -Duselongdouble DEBUGGING
  [stdio] -Dcc=gcc -Duse64bitall
  [stdio] -Dcc=gcc -Duseithreads -Duse64bitall DEBUGGING
  [stdio] -Dcc=gcc -Duseithreads DEBUGGING
  [stdio] -Dcc=gcc -Duseithreads
  [stdio] -Dcc=gcc -Duseithreads -Duselongdouble
  [stdio] -Dcc=gcc -Duseithreads -Duselongdouble DEBUGGING
  [stdio] -Dcc=gcc DEBUGGING
  [stdio] -Dcc=gcc -Duse64bitall DEBUGGING
  [stdio] -Dcc=gcc -Duselongdouble
  [stdio] -Dcc=gcc -Duseithreads -Duse64bitall
~~ ../t/io/fs.t ................................................ FAILED 30-31
  [stdio] -Dcc=gcc
  [stdio] -Dcc=gcc -Duselongdouble DEBUGGING
  [stdio] -Dcc=gcc -Duse64bitall
  [stdio] -Dcc=gcc -Duseithreads -Duse64bitall DEBUGGING
  [stdio] -Dcc=gcc -Duseithreads DEBUGGING
  [stdio] -Dcc=gcc -Duseithreads
  [stdio] -Dcc=gcc -Duseithreads -Duselongdouble
  [stdio] -Dcc=gcc -Duseithreads -Duselongdouble DEBUGGING
  [stdio] -Dcc=gcc DEBUGGING
  [stdio] -Dcc=gcc -Duse64bitall DEBUGGING
  [stdio] -Dcc=gcc -Duselongdouble
  [stdio] -Dcc=gcc -Duseithreads -Duse64bitall

Test todo-passed:

MANIFEST messages:
  MANIFEST did not declare '.mailmap'

Compiler messages:
  sv.c: In function 'Perl_sv_vcatpvfn_flags':
  config.h:909:39: warning: '%.*g' directive writing between 1 and 133 bytes into a region of size 127 [-Wformat-overflow=]
  perl.h:6826:13: note: in definition of macro 'WITH_LC_NUMERIC_SET_TO_NEEDED_IN'
  sv.c:48:5: note: in expansion of macro 'PERL_UNUSED_RESULT'
  sv.c:48:24: note: in expansion of macro 'Gconvert'
  sv.c:13128:21: note: in expansion of macro 'SNPRINTF_G'
  config.h:909:39: note: assuming directive output of 132 bytes
  config.h:909:27: note: 'sprintf' output between 2 and 134 bytes into a destination of size 127
  DB_File.xs: In function 'ParseOpenInfo':
  DB_File.xs:476:44: warning: suggest braces around empty body in an 'if' statement [-Wempty-body]
  DB_File.xs:1044:13: note: in expansion of macro 'croak_and_free'
  DB_File.xs:1050:13: note: in expansion of macro 'croak_and_free'
  DB_File.xs:1056:17: note: in expansion of macro 'croak_and_free'
  DB_File.xs:1091:17: note: in expansion of macro 'croak_and_free'
  DB_File.xs:1140:17: note: in expansion of macro 'croak_and_free'
  DB_File.xs:1229:13: note: in expansion of macro 'croak_and_free'
  Socket.c: In function 'XS_Socket_pack_ip_mreq_source':
  Socket.c:1673:7: warning: variable 'interface' set but not used [-Wunused-but-set-variable]
  APItest.c: In function 'XS_XS__APItest__Magic_test_Gconvert':
  ../../config.h:909:39: warning: '%.*g' directive writing between 1 and 106 bytes into a region of size 100 [-Wformat-overflow=]
  ../../perl.h:496:67: note: in definition of macro 'PERL_UNUSED_RESULT'
  APItest.xs:6801:28: note: in expansion of macro 'Gconvert'
  ../../config.h:909:39: note: assuming directive output of 105 bytes
  ../../config.h:909:27: note: 'sprintf' output between 2 and 107 bytes into a destination of size 100
  config.h:909:39: warning: '%.*Lg' directive writing between 1 and 137 bytes into a region of size 130 [-Wformat-overflow=]
  config.h:909:40: note: format string is defined here
  config.h:909:39: note: assuming directive output of 136 bytes
  config.h:909:27: note: 'sprintf' output between 2 and 138 bytes into a destination of size 130
  ../../config.h:909:39: warning: '%.*Lg' directive writing between 1 and 107 bytes into a region of size 100 [-Wformat-overflow=]
  ../../config.h:909:39: note: assuming directive output of 106 bytes
  ../../config.h:909:27: note: 'sprintf' output between 2 and 108 bytes into a destination of size 100
  time64.c: In function 'Perl_localtime64_r':
  time64.c:573:30: warning: 'orig_year' may be used uninitialized in this function [-Wmaybe-uninitialized]
  Opcode.xs: In function 'opmask_addlocal':
  Opcode.xs:240:17: warning: cast between incompatible function types from 'void (*)(PerlInterpreter *, const char *, ...)' {aka 'void (*)(struct interpreter *, const char *, ...)'} to 'void (*)(void *)' [-Wcast-function-type]
  ../../embed.h:496:57: note: in definition of macro 'save_destructor'
  Opcode.xs:240:2: note: in expansion of macro 'SAVEDESTRUCTOR'
  ListUtil.c: In function 'XS_List__Util_reduce':
  ../../embed.h:59:23: warning: 'retvals' may be used uninitialized in this function [-Wmaybe-uninitialized]
  ListUtil.xs:530:9: note: 'retvals' was declared here

About this smoke:
    smoking-perl: 5.26.1
  smoker-version: 1.71/0.046
       timestamp: 2020-06-23 01:55:56+00
          tester: core

-- 
Report generated by Test::Smoke::Gateway v0.09_01