Show logfile
Automated smoke report for branch smoke-me/jkeenan/tonyc/gh-17866-netbsd 5.32.0 patch ecc70a9e8e3bd37b42b485af3acab6bf59f7d776 v5.32.0-RC1-9-gecc70a9e8e
cjg-stretch: Intel(R) Xeon(R) CPU E5-2620 v2 @ 2.10GHz (GenuineIntel 2065MHz) (x86_64/1 cpus)
    on        linux 4.9.0-12-amd64 [Debian GNU/Linux 9.12 (stretch)]
    using     g++ version 6.3.0 20170516 (*1)
    smoketime 6 hours 59 minutes (average 34 minutes 58 seconds)

Summary: FAIL(F)

O = OK  F = Failure(s), extended report at the bottom
X = Failure(s) under TEST but not under harness
? = still running or test results not (yet) available
Build failures during:       - = unknown or N/A
c = Configure, m = make, M = make (after miniperl), t = make test-prep

v5.32.0-RC1-9-gecc70a9e8e
---------------------- ----------------------------------------------------
O  O                    -Dcc=g++ (*1)
O  O                    -Dcc=g++ -Duse64bitall (*1)
F  F                    -Dcc=g++ -Dusequadmath (*1)
F  O                    -Dcc=g++ -Duseithreads (*1)
F  O                    -Dcc=g++ -Duseithreads -Duse64bitall (*1)
O  O                    -Dcc=g++ -Duseithreads -Dusequadmath (*1)
|  |
|  +------------------  stdio DEBUGGING
+---------------------  stdio

Applied patches:
  SMOKEecc70a9e8e3bd37b42b485af3acab6bf59f7d776

Skipped tests:
      # One test name on a line

Test failures:
~~ ../dist/Time-HiRes/t/usleep.t ............................... FAILED 5 Non-zero exit status: 1
  [stdio] -Dcc=g++ -Duseithreads
~~ ../cpan/ExtUtils-Constant/t/Constant.t ...................... FAILED 96 Bad plan.  You planned 302 tests but ran 96.
  [stdio] -Dcc=g++ -Duseithreads -Duse64bitall
~~ ../cpan/ExtUtils-MakeMaker/t/eu_command.t ................... FAILED 8 Non-zero exit status: 1
  [stdio] -Dcc=g++ -Duseithreads -Duse64bitall
~~ ../dist/Time-HiRes/t/usleep.t ............................... FAILED 3 Non-zero exit status: 1
  [stdio] -Dcc=g++ -Dusequadmath
~~ ../dist/Time-HiRes/t/usleep.t ............................... FAILED 6 Non-zero exit status: 1
  [stdio] -Dcc=g++ -Dusequadmath DEBUGGING

Test todo-passed:

MANIFEST messages:
  MANIFEST did not declare '.mailmap'

Compiler messages:
  HiRes.xs: In function 'void XS_Time__HiRes_setitimer(CV*)':
  HiRes.xs:1436:42: warning: option '-Wc++-compat' is valid for C/ObjC but not for C++ [-Wpragmas]
  HiRes.xs: In function 'void XS_Time__HiRes_getitimer(CV*)':
  HiRes.xs:1456:42: warning: option '-Wc++-compat' is valid for C/ObjC but not for C++ [-Wpragmas]
  time64.c: In function 'TM64* Perl_localtime64_r(const Time64_T*, TM64*)':
  time64.c:573:32: warning: 'orig_year' may be used uninitialized in this function [-Wmaybe-uninitialized]
  HiRes.xs: In function 'void XS_Time__HiRes_setitimer(PerlInterpreter*, CV*)':
  HiRes.xs: In function 'void XS_Time__HiRes_getitimer(PerlInterpreter*, CV*)':
  ListUtil.xs: In function 'void XS_List__Util_reduce(PerlInterpreter*, CV*)':
  ListUtil.xs:576:47: warning: 'retvals' may be used uninitialized in this function [-Wmaybe-uninitialized]
  ListUtil.xs:530:9: note: 'retvals' was declared here

About this smoke:
    smoking-perl: 5.26.1
  smoker-version: 1.71/0.046
       timestamp: 2020-06-16 07:25:21+00
          tester: core

-- 
Report generated by Test::Smoke::Gateway v0.09_01