Show logfile
Automated smoke report for branch blead 5.32.0 patch 61147c7ca9e5023e2385fa36c04c7094749d2030 v5.32.0-RC0-13-g61147c7ca9
cjg-dragonfly5: Intel(R) Xeon(R) CPU E5-2620 v2 @ 2.10GHz (x86_64/1 cpus)
    on        dragonfly 5.8-RELEASE
    using     g++ version 8.3 [DragonFly] Release/2019-02-22 (*1)
    smoketime 8 hours 28 minutes (average 42 minutes 24 seconds)

Summary: FAIL(F)

O = OK  F = Failure(s), extended report at the bottom
X = Failure(s) under TEST but not under harness
? = still running or test results not (yet) available
Build failures during:       - = unknown or N/A
c = Configure, m = make, M = make (after miniperl), t = make test-prep

v5.32.0-RC0-13-g61147c7ca9
---------------------- ----------------------------------------------------
F  F                    -Dcc=g++ (*1)
F  F                    -Dcc=g++ -Duse64bitall (*1)
F  F                    -Dcc=g++ -Duselongdouble (*1)
F  F                    -Dcc=g++ -Duseithreads (*1)
F  F                    -Dcc=g++ -Duseithreads -Duse64bitall (*1)
F  F                    -Dcc=g++ -Duseithreads -Duselongdouble (*1)
|  |
|  +------------------  stdio DEBUGGING
+---------------------  stdio

Applied patches:
  SMOKE61147c7ca9e5023e2385fa36c04c7094749d2030

Skipped tests:
      # One test name on a line

Test failures:
~~ ../ext/POSIX/t/termios.t .................................... FAILED 74 Non-zero exit status: 6
  [stdio] -Dcc=g++ -Duseithreads -Duselongdouble
  [stdio] -Dcc=g++ -Duseithreads -Duse64bitall DEBUGGING
  [stdio] -Dcc=g++ -Duseithreads
  [stdio] -Dcc=g++ -Duse64bitall
  [stdio] -Dcc=g++ -Duseithreads -Duse64bitall
  [stdio] -Dcc=g++
  [stdio] -Dcc=g++ -Duselongdouble
  [stdio] -Dcc=g++ -Duse64bitall DEBUGGING
  [stdio] -Dcc=g++ -Duselongdouble DEBUGGING
  [stdio] -Dcc=g++ DEBUGGING
  [stdio] -Dcc=g++ -Duseithreads -Duselongdouble DEBUGGING
  [stdio] -Dcc=g++ -Duseithreads DEBUGGING
~~ ../dist/Time-HiRes/t/utime.t ................................ FAILED 2-3 Non-zero exit status: 8
  [stdio] -Dcc=g++ -Duseithreads -Duselongdouble
  [stdio] -Dcc=g++ -Duseithreads -Duse64bitall DEBUGGING
  [stdio] -Dcc=g++ -Duseithreads
  [stdio] -Dcc=g++ -Duse64bitall
  [stdio] -Dcc=g++ -Duseithreads -Duse64bitall
  [stdio] -Dcc=g++
  [stdio] -Dcc=g++ -Duselongdouble
  [stdio] -Dcc=g++ -Duse64bitall DEBUGGING
  [stdio] -Dcc=g++ -Duselongdouble DEBUGGING
  [stdio] -Dcc=g++ DEBUGGING
  [stdio] -Dcc=g++ -Duseithreads -Duselongdouble DEBUGGING
  [stdio] -Dcc=g++ -Duseithreads DEBUGGING
~~ ../t/io/fs.t ................................................ FAILED 30-31
  [stdio] -Dcc=g++ -Duseithreads -Duselongdouble
  [stdio] -Dcc=g++ -Duseithreads -Duse64bitall DEBUGGING
  [stdio] -Dcc=g++ -Duseithreads
  [stdio] -Dcc=g++ -Duse64bitall
  [stdio] -Dcc=g++ -Duseithreads -Duse64bitall
  [stdio] -Dcc=g++
  [stdio] -Dcc=g++ -Duselongdouble
  [stdio] -Dcc=g++ -Duse64bitall DEBUGGING
  [stdio] -Dcc=g++ -Duselongdouble DEBUGGING
  [stdio] -Dcc=g++ DEBUGGING
  [stdio] -Dcc=g++ -Duseithreads -Duselongdouble DEBUGGING
  [stdio] -Dcc=g++ -Duseithreads DEBUGGING

Test todo-passed:

MANIFEST messages:
  MANIFEST did not declare '.mailmap'

Compiler messages:
  mg.c: In function 'int Perl_magic_set(SV*, MAGIC*)':
  mg.c:2818:50: warning: type qualifiers ignored on cast result type [-Wignored-qualifiers]
  regexp.h:528:43: note: in definition of macro 'RXp_ENGINE'
  regexp.h:529:53: note: in expansion of macro 'ReANY'
  perl.h:250:5: note: in expansion of macro 'RX_ENGINE'
  mg.c:2818:13: note: in expansion of macro 'CALLREG_NUMBUF_STORE'
  perl.h:250:47: note: in definition of macro 'CALLREG_NUMBUF_STORE'
  sv.c: In function 'void Perl_sv_vcatpvfn_flags(SV*, const char*, STRLEN, __va_list_tag (*)[1], SV**, size_t, bool*, U32)':
  config.h:909:39: warning: '%.*g' directive writing between 1 and 133 bytes into a region of size 127 [-Wformat-overflow=]
  perl.h:6826:13: note: in definition of macro 'WITH_LC_NUMERIC_SET_TO_NEEDED_IN'
  sv.c:48:5: note: in expansion of macro 'PERL_UNUSED_RESULT'
  sv.c:48:24: note: in expansion of macro 'Gconvert'
  sv.c:13128:21: note: in expansion of macro 'SNPRINTF_G'
  config.h:909:39: note: assuming directive output of 132 bytes
  config.h:909:34: note: 'sprintf' output between 2 and 134 bytes into a destination of size 127
  inflate.c: In function 'int inflate(z_streamp, int)':
  inflate.c:724:25: warning: this statement may fall through [-Wimplicit-fallthrough=]
  inflate.c:725:9: note: here
  inflate.c:732:25: warning: this statement may fall through [-Wimplicit-fallthrough=]
  inflate.c:733:9: note: here
  inflate.c:947:25: warning: this statement may fall through [-Wimplicit-fallthrough=]
  inflate.c:948:9: note: here
  inflate.c:968:25: warning: this statement may fall through [-Wimplicit-fallthrough=]
  inflate.c:969:9: note: here
  DB_File.xs: In function 'DB_File_type* ParseOpenInfo(int, char*, int, int, SV*)':
  DB_File.xs:476:44: warning: suggest braces around empty body in an 'if' statement [-Wempty-body]
  DB_File.xs:1044:13: note: in expansion of macro 'croak_and_free'
  DB_File.xs:1050:13: note: in expansion of macro 'croak_and_free'
  DB_File.xs:1056:17: note: in expansion of macro 'croak_and_free'
  DB_File.xs:1091:17: note: in expansion of macro 'croak_and_free'
  DB_File.xs:1140:17: note: in expansion of macro 'croak_and_free'
  DB_File.xs:1229:13: note: in expansion of macro 'croak_and_free'
  MD5.xs: In function 'MD5_CTX* get_md5_ctx(SV*)':
  MD5.xs:470:50: warning: type qualifiers ignored on cast result type [-Wignored-qualifiers]
  MD5.xs: In function 'SV* new_md5_ctx(MD5_CTX*, const char*)':
  MD5.xs:492:63: warning: type qualifiers ignored on cast result type [-Wignored-qualifiers]
  ../../embed.h:610:63: note: in definition of macro 'sv_magicext'
  Socket.c: In function 'void XS_Socket_pack_ip_mreq_source(CV*)':
  Socket.c:1673:7: warning: variable 'interface' set but not used [-Wunused-but-set-variable]
  HiRes.xs: In function 'void XS_Time__HiRes_setitimer(CV*)':
  HiRes.xs:1436:42: warning: option '-Wc++-compat' is valid for C/ObjC but not for C++ [-Wpragmas]
  HiRes.xs: In function 'void XS_Time__HiRes_getitimer(CV*)':
  HiRes.xs:1456:42: warning: option '-Wc++-compat' is valid for C/ObjC but not for C++ [-Wpragmas]
  APItest.xs: In function 'void XS_XS__APItest__Magic_test_Gconvert(CV*)':
  ../../config.h:909:39: warning: '%.*g' directive writing between 1 and 106 bytes into a region of size 100 [-Wformat-overflow=]
  ../../perl.h:496:67: note: in definition of macro 'PERL_UNUSED_RESULT'
  APItest.xs:6801:28: note: in expansion of macro 'Gconvert'
  ../../config.h:909:39: note: assuming directive output of 105 bytes
  ../../config.h:909:34: note: 'sprintf' output between 2 and 107 bytes into a destination of size 100
  config.h:909:39: warning: '%.*Lg' directive writing between 1 and 137 bytes into a region of size 130 [-Wformat-overflow=]
  config.h:909:39: note: assuming directive output of 136 bytes
  config.h:909:34: note: 'sprintf' output between 2 and 138 bytes into a destination of size 130
  ../../config.h:909:39: warning: '%.*Lg' directive writing between 1 and 107 bytes into a region of size 100 [-Wformat-overflow=]
  ../../config.h:909:39: note: assuming directive output of 106 bytes
  ../../config.h:909:34: note: 'sprintf' output between 2 and 108 bytes into a destination of size 100
  mg.c: In function 'int Perl_magic_set(PerlInterpreter*, SV*, MAGIC*)':
  sv.c: In function 'void Perl_sv_vcatpvfn_flags(PerlInterpreter*, SV*, const char*, STRLEN, __va_list_tag (*)[1], SV**, size_t, bool*, U32)':
  time64.c: In function 'TM64* Perl_localtime64_r(const Time64_T*, TM64*)':
  time64.c:573:30: warning: 'orig_year' may be used uninitialized in this function [-Wmaybe-uninitialized]
  DB_File.xs: In function 'DB_File_type* ParseOpenInfo(PerlInterpreter*, int, char*, int, int, SV*)':
  MD5.xs: In function 'MD5_CTX* get_md5_ctx(PerlInterpreter*, SV*)':
  MD5.xs: In function 'SV* new_md5_ctx(PerlInterpreter*, MD5_CTX*, const char*)':
  Opcode.xs: In function 'void opmask_addlocal(PerlInterpreter*, SV*, char*)':
  Opcode.xs:240:33: warning: cast between incompatible function types from 'void (*)(PerlInterpreter*, const char*, ...)' {aka 'void (*)(interpreter*, const char*, ...)'} to 'void (*)(void*)' [-Wcast-function-type]
  ../../embed.h:496:57: note: in definition of macro 'save_destructor'
  Opcode.xs:240:2: note: in expansion of macro 'SAVEDESTRUCTOR'
  Socket.c: In function 'void XS_Socket_pack_ip_mreq_source(PerlInterpreter*, CV*)':
  HiRes.xs: In function 'void XS_Time__HiRes_setitimer(PerlInterpreter*, CV*)':
  HiRes.xs: In function 'void XS_Time__HiRes_getitimer(PerlInterpreter*, CV*)':
  APItest.xs: In function 'void XS_XS__APItest__Magic_test_Gconvert(PerlInterpreter*, CV*)':

About this smoke:
    smoking-perl: 5.26.1
  smoker-version: 1.71/0.046
       timestamp: 2020-05-31 08:48:57+00
          tester: core

-- 
Report generated by Test::Smoke::Gateway v0.09_01