Show logfile
Automated smoke report for branch smoke-me/khw-TEST 5.32.0 patch e4a2c38990ddccc6f761b17fd8ff89cb7c3481da v5.31.10-46-ge4a2c38990
Dell-Latitude-E6530: Intel(R) Core(TM) i7-3740QM CPU @ 2.70GHz(~2691 MHz) (Intel64/8 cpus)
    on        MSWin32 Win10 Business
    using     cl version 19.24.28316 (*1)
    smoketime 6 hours 20 minutes (average 47 minutes 34 seconds)

Summary: FAIL(F)

O = OK  F = Failure(s), extended report at the bottom
X = Failure(s) under TEST but not under harness
? = still running or test results not (yet) available
Build failures during:       - = unknown or N/A
c = Configure, m = make, M = make (after miniperl), t = make test-prep

v5.31.10-46-ge4a2c38990
---------------------- ----------------------------------------------------
F  F                     (*1)
F  F                    -Duselargefiles (*1)
F  F                    -Duseithreads (*1)
F  F                    -Duseithreads -Duselargefiles (*1)
|  |
|  +------------------  stdio DEBUGGING
+---------------------  stdio

Applied patches:
  RC0
  uncommitted-changes
  SMOKEe4a2c38990ddccc6f761b17fd8ff89cb7c3481da

Skipped tests:
  None

Test failures:
~~ ../cpan/ExtUtils-MakeMaker/t/02-xsdynamic.t ................. FAILED 17 Non-zero exit status: 4
  [stdio] 
  [stdio] -Duselargefiles
  [stdio]  DEBUGGING
  [stdio] -Duselargefiles DEBUGGING
~~ ../dist/Net-Ping/t/450_service.t ............................ FAILED 9 Non-zero exit status: 1
  [stdio] 
  [stdio] -Duseithreads -Duselargefiles
  [stdio] -Duseithreads DEBUGGING
  [stdio] -Duselargefiles
  [stdio] -Duseithreads -Duselargefiles DEBUGGING
  [stdio]  DEBUGGING
  [stdio] -Duseithreads
  [stdio] -Duselargefiles DEBUGGING

Test todo-passed:
~~ ../ext/IPC-Open3/t/IPC-Open3.t .............................. PASSED 25
  [stdio] 
  [stdio] -Duseithreads -Duselargefiles
  [stdio] -Duseithreads DEBUGGING
  [stdio] -Duselargefiles
  [stdio] -Duseithreads -Duselargefiles DEBUGGING
  [stdio]  DEBUGGING
  [stdio] -Duseithreads
  [stdio] -Duselargefiles DEBUGGING

MANIFEST messages:
  MANIFEST did not declare '.MAILMAP'

Compiler messages:
  [2020-04-12 00:47:09Z] perlio.obj : warning LNK4197: export 'PerlIO_pending' specified multiple times; using first specification
  [2020-04-12 00:47:09Z] perlio.obj : warning LNK4197: export 'PerlIO_perlio' specified multiple times; using first specification
  # Test.obj : error LNK2001: unresolved external symbol PL_curpad
  # Test.obj : error LNK2001: unresolved external symbol PL_op
  # Test.obj : error LNK2001: unresolved external symbol PL_stack_base
  # Test.obj : error LNK2001: unresolved external symbol PL_tainted
  # Test.obj : error LNK2001: unresolved external symbol PL_markstack_ptr
  # Test.obj : error LNK2001: unresolved external symbol PL_stack_sp
  # blib\arch\auto\XS\Test\Test.dll : fatal error LNK1120: 6 unresolved externals
  # NMAKE : fatal error U1077: '"C:\Program Files (x86)\Microsoft Visual Studio\2019\Community\VC\Tools\MSVC\14.24.28314\bin\HostX64\x64\link.EXE"' : return code '0x460'
  # Other.obj : error LNK2001: unresolved external symbol PL_curpad
  # Other.obj : error LNK2001: unresolved external symbol PL_op
  # Other.obj : error LNK2001: unresolved external symbol PL_stack_base
  # Other.obj : error LNK2001: unresolved external symbol PL_tainted
  # Other.obj : error LNK2001: unresolved external symbol PL_markstack_ptr
  # Other.obj : error LNK2001: unresolved external symbol PL_stack_sp
  # blib\arch\auto\XS\Other\Other.dll : fatal error LNK1120: 6 unresolved externals
  [2020-04-12 01:20:55Z] perlio.obj : warning LNK4197: export 'PerlIO_perlio' specified multiple times; using first specification
  [2020-04-12 01:20:55Z] perlio.obj : warning LNK4197: export 'PerlIO_pending' specified multiple times; using first specification
  [2020-04-12 01:20:55Z] c:\perl\smoke\perl\mswin32-win10-smoke-me\build\ext\POSIX\POSIX.xs(1090) : warning C4715: 'my_rint': not all control paths return a value
  # Test.obj : error LNK2001: unresolved external symbol PL_markstack
  # Test.obj : error LNK2001: unresolved external symbol PL_debug
  # blib\arch\auto\XS\Test\Test.dll : fatal error LNK1120: 7 unresolved externals
  # Other.obj : error LNK2001: unresolved external symbol PL_markstack
  # Other.obj : error LNK2001: unresolved external symbol PL_debug
  # blib\arch\auto\XS\Other\Other.dll : fatal error LNK1120: 7 unresolved externals
  [2020-04-12 02:12:41Z] perlio.obj : warning LNK4197: export 'PerlIO_pending' specified multiple times; using first specification
  [2020-04-12 02:12:41Z] perlio.obj : warning LNK4197: export 'PerlIO_perlio' specified multiple times; using first specification
  [2020-04-12 02:46:05Z] perlio.obj : warning LNK4197: export 'PerlIO_perlio' specified multiple times; using first specification
  [2020-04-12 02:46:05Z] perlio.obj : warning LNK4197: export 'PerlIO_pending' specified multiple times; using first specification
  [2020-04-12 02:46:05Z] c:\perl\smoke\perl\mswin32-win10-smoke-me\build\ext\POSIX\POSIX.xs(1090) : warning C4715: 'my_rint': not all control paths return a value
  [2020-04-12 03:38:10Z] perlio.obj : warning LNK4197: export 'PerlIO_pending' specified multiple times; using first specification
  [2020-04-12 03:38:10Z] perlio.obj : warning LNK4197: export 'PerlIO_perlio' specified multiple times; using first specification
  [2020-04-12 04:17:34Z] perlio.obj : warning LNK4197: export 'PerlIO_perlio' specified multiple times; using first specification
  [2020-04-12 04:17:34Z] perlio.obj : warning LNK4197: export 'PerlIO_pending' specified multiple times; using first specification
  [2020-04-12 04:17:34Z] c:\perl\smoke\perl\mswin32-win10-smoke-me\build\ext\POSIX\POSIX.xs(1090) : warning C4715: 'my_rint': not all control paths return a value
  [2020-04-12 05:22:49Z] perlio.obj : warning LNK4197: export 'PerlIO_pending' specified multiple times; using first specification
  [2020-04-12 05:22:49Z] perlio.obj : warning LNK4197: export 'PerlIO_perlio' specified multiple times; using first specification
  [2020-04-12 06:01:53Z] perlio.obj : warning LNK4197: export 'PerlIO_perlio' specified multiple times; using first specification
  [2020-04-12 06:01:53Z] perlio.obj : warning LNK4197: export 'PerlIO_pending' specified multiple times; using first specification
  [2020-04-12 06:01:53Z] c:\perl\smoke\perl\mswin32-win10-smoke-me\build\ext\POSIX\POSIX.xs(1090) : warning C4715: 'my_rint': not all control paths return a value

About this smoke:
    smoking-perl: 5.28.1
  smoker-version: 1.72/0.046
       timestamp: 2020-04-12 00:42:09+00
          tester: greer

[smoke setup in testing; ignore for now] Smoke logs available at http://m-l.org/~perl/smoke/perl/mswin32-x64-multi-thread-win10/mswin32-win10-smoke-me/Karl%20Williamson/loge4a2c38990ddccc6f761b17fd8ff89cb7c3481da.log.gz
-- 
Report generated by Test::Smoke::Gateway v0.09_01