Show logfile
Automated smoke report for branch blead 5.32.0 patch d013a11f9dc825647426729265e15c3f0ca70aa9 v5.31.10-35-gd013a11f9d
cjg-stretch: Intel(R) Xeon(R) CPU E5-2620 v2 @ 2.10GHz (GenuineIntel 2074MHz) (x86_64/1 cpus)
    on        linux 4.9.0-12-amd64 [Debian GNU/Linux 9.12 (stretch)]
    using     gcc version 6.3.0 20170516 (*1)
    smoketime 6 hours 45 minutes (average 33 minutes 46 seconds)

Summary: FAIL(F)

O = OK  F = Failure(s), extended report at the bottom
X = Failure(s) under TEST but not under harness
? = still running or test results not (yet) available
Build failures during:       - = unknown or N/A
c = Configure, m = make, M = make (after miniperl), t = make test-prep

v5.31.10-35-gd013a11f9d
---------------------- ----------------------------------------------------
O  F                    -Dcc=gcc (*1)
O  O                    -Dcc=gcc -Duse64bitall (*1)
O  O                    -Dcc=gcc -Dusequadmath (*1)
F  F                    -Dcc=gcc -Duseithreads (*1)
O  O                    -Dcc=gcc -Duseithreads -Duse64bitall (*1)
O  F                    -Dcc=gcc -Duseithreads -Dusequadmath (*1)
|  |
|  +------------------  stdio DEBUGGING
+---------------------  stdio

Applied patches:
  RC0
  uncommitted-changes
  SMOKEd013a11f9dc825647426729265e15c3f0ca70aa9

Skipped tests:
      # One test name on a line

Test failures:
~~ ../cpan/ExtUtils-Constant/t/Constant.t ...................... FAILED 96 Bad plan.  You planned 302 tests but ran 96.
  [stdio] -Dcc=gcc -Duseithreads DEBUGGING
~~ ../dist/Time-HiRes/t/usleep.t ............................... FAILED 4 Non-zero exit status: 1
  [stdio] -Dcc=gcc -Duseithreads
~~ ../cpan/ExtUtils-Constant/t/Constant.t ...................... FAILED 33 Bad plan.  You planned 302 tests but ran 33.
  [stdio] -Dcc=gcc DEBUGGING
~~ ../dist/Time-HiRes/t/usleep.t ............................... FAILED 3 Non-zero exit status: 1
  [stdio] -Dcc=gcc -Duseithreads -Dusequadmath DEBUGGING
~~ ../dist/IO/t/io_poll.t ...................................... FAILED 12
  [stdio] -Dcc=gcc DEBUGGING

Test todo-passed:

MANIFEST messages:
  MANIFEST did not declare '.mailmap'

Compiler messages:
  time64.c: In function 'Perl_localtime64_r':
  time64.c:573:30: warning: 'orig_year' may be used uninitialized in this function [-Wmaybe-uninitialized]

About this smoke:
    smoking-perl: 5.26.1
  smoker-version: 1.71/0.046
       timestamp: 2020-04-03 23:14:56+00
          tester: core

-- 
Report generated by Test::Smoke::Gateway v0.09_01