Show logfile
Automated smoke report for branch blead 5.32.0 patch 5de22a40933c620b62e1f431457593777b99793d v5.31.10-25-g5de22a4
r9: PA8900 (PA-RISC2.0/64/1 cpus)
    on        HP-UX B.11.11/64
    using     cc version B.11.11.18 (*1)
    smoketime 2 days 12 hours 8 minutes (average 7 hours 31 minutes)

Summary: FAIL(F)

O = OK  F = Failure(s), extended report at the bottom
X = Failure(s) under TEST but not under harness
? = still running or test results not (yet) available
Build failures during:       - = unknown or N/A
c = Configure, m = make, M = make (after miniperl), t = make test-prep

v5.31.10-25-g5de22a4
---------------------- ----------------------------------------------------
F  F  F  F  F  F         (*1)
F  F  F  F  F  F        -Duse64bitall (*1)
F  F  F  F  F  F        -Duseithreads (*1)
F  F  F  F  F  F        -Duseithreads -Duse64bitall (*1)
|  |  |  |  |  |
|  |  |  |  |  +------  locale:univ.utf8 DEBUGGING
|  |  |  |  +---------  perlio DEBUGGING
|  |  |  +------------  stdio DEBUGGING
|  |  +---------------  locale:univ.utf8
|  +------------------  perlio
+---------------------  stdio

Applied patches:
  RC0
  uncommitted-changes
  SMOKE5de22a40933c620b62e1f431457593777b99793d

Skipped tests:
  None

Test failures:
~~ ../t/re/pat_psycho.t ........................................ FAILED Bad plan.  You planned 15 tests but ran 10.
  [stdio/perlio/locale:univ.utf8] -Duseithreads DEBUGGING
  [stdio/perlio/locale:univ.utf8]  DEBUGGING
~~ ../t/re/fold_grind_8.t ...................................... FAILED No plan found in TAP output
  [stdio/perlio/locale:univ.utf8] -Duseithreads DEBUGGING
  [perlio/locale:univ.utf8]  DEBUGGING
~~ ../ext/XS-APItest/t/hv_macro.t .............................. FAILED 2-49 60-61 Non-zero exit status: 52 Bad plan.  You planned 63 tests but ran 61.
  [stdio/perlio/locale:univ.utf8] -Duseithreads -Duse64bitall DEBUGGING
  [stdio/perlio/locale:univ.utf8] -Duseithreads -Duse64bitall
  [stdio/perlio/locale:univ.utf8] -Duse64bitall DEBUGGING
  [stdio/perlio/locale:univ.utf8] -Duse64bitall
~~ ../ext/XS-APItest/t/hv_macro.t .............................. FAILED 2-33 Non-zero exit status: 32
  [stdio/perlio/locale:univ.utf8] 
  [stdio/perlio/locale:univ.utf8] -Duseithreads DEBUGGING
  [stdio/perlio/locale:univ.utf8]  DEBUGGING
  [stdio/perlio/locale:univ.utf8] -Duseithreads
~~ ../lib/warnings.t ........................................... FAILED 779-780
  [stdio/perlio/locale:univ.utf8] 
  [stdio/perlio/locale:univ.utf8] -Duseithreads DEBUGGING
  [stdio/perlio/locale:univ.utf8]  DEBUGGING
  [stdio/perlio/locale:univ.utf8] -Duseithreads
~~ ../lib/warnings.t ........................................... FAILED 366 779-780
  [stdio/perlio/locale:univ.utf8] -Duseithreads -Duse64bitall DEBUGGING
  [stdio/perlio/locale:univ.utf8] -Duseithreads -Duse64bitall
  [stdio/perlio/locale:univ.utf8] -Duse64bitall DEBUGGING
  [stdio/perlio/locale:univ.utf8] -Duse64bitall
~~ ../ext/File-Glob/t/threads.t ................................ FAILED No plan found in TAP output
  [perlio] -Duseithreads -Duse64bitall
~~ ../t/re/pat_psycho.t ........................................ FAILED Bad plan.  You planned 15 tests but ran 13.
  [perlio] -Duse64bitall DEBUGGING
~~ ../t/io/nargv.t ............................................. FAILED Bad plan.  You planned 7 tests but ran 6.
  [stdio] -Duseithreads -Duse64bitall DEBUGGING
~~ ../t/re/pat_psycho.t ........................................ FAILED Bad plan.  You planned 15 tests but ran 12.
  [stdio/locale:univ.utf8] -Duse64bitall DEBUGGING
~~ ../t/re/speed.t ............................................. FAILED 58
  [stdio] -Duse64bitall DEBUGGING
~~ ../t/re/pat_psycho_thr.t .................................... FAILED Non-zero exit status: 1 Bad plan.  You planned 15 tests but ran 10.
  [stdio/perlio/locale:univ.utf8] -Duseithreads DEBUGGING
~~ ../t/re/fold_grind_d.t ...................................... FAILED No plan found in TAP output
  [locale:univ.utf8] -Duseithreads DEBUGGING
~~ ../t/run/switches.t ......................................... FAILED 110-111
  [stdio/perlio] -Duseithreads -Duse64bitall DEBUGGING
~~ ../lib/locale.t ............................................. FAILED 431-432 498
  [stdio/perlio/locale:univ.utf8] 
  [stdio/perlio/locale:univ.utf8] -Duseithreads DEBUGGING
  [stdio/perlio/locale:univ.utf8] -Duseithreads -Duse64bitall DEBUGGING
  [stdio/perlio/locale:univ.utf8] -Duse64bitall DEBUGGING
  [stdio/perlio/locale:univ.utf8]  DEBUGGING
  [stdio/perlio/locale:univ.utf8] -Duseithreads
  [stdio/perlio/locale:univ.utf8] -Duse64bitall
  [stdio/perlio/locale:univ.utf8] -Duseithreads -Duse64bitall
~~ ../cpan/Socket/t/Socket.t ................................... FAILED Non-zero exit status: 255 Bad plan.  You planned 6 tests but ran 2.
  [locale:univ.utf8] 
  [locale:univ.utf8] -Duseithreads DEBUGGING
  [locale:univ.utf8] -Duseithreads -Duse64bitall DEBUGGING
  [locale:univ.utf8] -Duse64bitall DEBUGGING
  [locale:univ.utf8]  DEBUGGING
  [locale:univ.utf8] -Duseithreads
  [locale:univ.utf8] -Duse64bitall
  [locale:univ.utf8] -Duseithreads -Duse64bitall
~~ ../dist/Time-HiRes/t/alarm.t ................................ FAILED 8-9 Non-zero exit status: 2
  [locale:univ.utf8] -Duseithreads -Duse64bitall DEBUGGING
~~ ../t/op/filetest.t .......................................... FAILED 394
  [perlio] -Duseithreads DEBUGGING
~~ ../t/re/fold_grind_u.t ...................................... FAILED No plan found in TAP output
  [stdio/perlio/locale:univ.utf8] -Duseithreads DEBUGGING
  [stdio/perlio/locale:univ.utf8]  DEBUGGING

Test todo-passed:
~~ ../dist/Net-Ping/t/450_service.t ............................ PASSED 9 18
  [stdio/perlio/locale:univ.utf8] 
  [stdio/perlio/locale:univ.utf8] -Duseithreads DEBUGGING
  [stdio/perlio/locale:univ.utf8] -Duseithreads -Duse64bitall DEBUGGING
  [stdio/perlio/locale:univ.utf8] -Duse64bitall DEBUGGING
  [stdio/perlio/locale:univ.utf8]  DEBUGGING
  [stdio/perlio/locale:univ.utf8] -Duseithreads
  [stdio/perlio/locale:univ.utf8] -Duse64bitall
  [stdio/perlio/locale:univ.utf8] -Duseithreads -Duse64bitall

MANIFEST messages:
  MANIFEST did not declare '.mailmap'

Compiler messages:
  cc: "sv.c", line 894: warning 558: Empty declaration.
  cc: "sv.c", line 895: warning 558: Empty declaration.
  cc: "sv.c", line 896: warning 558: Empty declaration.
  cc: "sv.c", line 897: warning 558: Empty declaration.
  cc: "sv.c", line 898: warning 558: Empty declaration.
  cc: "sv.c", line 899: warning 558: Empty declaration.
  cc: "sv.c", line 900: warning 558: Empty declaration.
  cc: "sv.c", line 901: warning 558: Empty declaration.
  cc: "regcomp.c", line 23173: warning 562: Redeclaration of "S_handle_user_defined_property" with a different storage class specifier: "S_handle_user_defined_property" will have internal linkage.
  cc: "re_comp.c", line 23173: warning 562: Redeclaration of "S_handle_user_defined_property" with a different storage class specifier: "S_handle_user_defined_property" will have internal linkage.

About this smoke:
    smoking-perl: 5.14.2
  smoker-version: 1.72_06/0.046
       timestamp: 2020-03-30 20:00:10+00
          tester: merijn

Status overview available here: https://tux.nl/perl5/smoke/
-- 
Report generated by Test::Smoke::Gateway v0.09_01