Show logfile
Automated smoke report for branch blead 5.32.0 patch 5de22a40933c620b62e1f431457593777b99793d v5.31.10-25-g5de22a4
x2: ia64 (ia64/4 cpus)
    on        HP-UX B.11.31/64
    using     ccache cc version B3910B A.06.28.02 (*1)
    smoketime 9 hours 39 minutes (average 1 hour 12 minutes)

Summary: FAIL(F)

O = OK  F = Failure(s), extended report at the bottom
X = Failure(s) under TEST but not under harness
? = still running or test results not (yet) available
Build failures during:       - = unknown or N/A
c = Configure, m = make, M = make (after miniperl), t = make test-prep

v5.31.10-25-g5de22a4
---------------------- ----------------------------------------------------
F  F  F  F  F  F         (*1)
F  F  F  F  F  F        -Duse64bitall (*1)
F  F  F  F  F  F        -Duseithreads (*1)
F  F  F  F  F  F        -Duseithreads -Duse64bitall (*1)
|  |  |  |  |  |
|  |  |  |  |  +------  locale:en_US.utf8 DEBUGGING
|  |  |  |  +---------  perlio DEBUGGING
|  |  |  +------------  stdio DEBUGGING
|  |  +---------------  locale:en_US.utf8
|  +------------------  perlio
+---------------------  stdio

Applied patches:
  RC0
  uncommitted-changes
  SMOKE5de22a40933c620b62e1f431457593777b99793d

Skipped tests:
  None

Test failures:
~~ ../lib/locale.t ............................................. FAILED 448
  [perlio] -Duseithreads -Duse64bitall DEBUGGING
~~ ../ext/XS-APItest/t/hv_macro.t .............................. FAILED 2-49 60-61 Non-zero exit status: 52 Bad plan.  You planned 63 tests but ran 61.
  [stdio/perlio/locale:en_US.utf8] -Duseithreads -Duse64bitall DEBUGGING
  [stdio/perlio/locale:en_US.utf8] -Duseithreads -Duse64bitall
  [stdio/perlio/locale:en_US.utf8] -Duse64bitall DEBUGGING
  [stdio/perlio/locale:en_US.utf8] -Duse64bitall
~~ ../ext/XS-APItest/t/hv_macro.t .............................. FAILED 2-33 Non-zero exit status: 32
  [stdio/perlio/locale:en_US.utf8] 
  [stdio/perlio/locale:en_US.utf8] -Duseithreads DEBUGGING
  [stdio/perlio/locale:en_US.utf8]  DEBUGGING
  [stdio/perlio/locale:en_US.utf8] -Duseithreads
~~ ../cpan/Socket/t/Socket.t ................................... FAILED Non-zero exit status: 255 Bad plan.  You planned 6 tests but ran 2.
  [locale:en_US.utf8] 
  [locale:en_US.utf8] -Duseithreads DEBUGGING
  [locale:en_US.utf8] -Duseithreads -Duse64bitall DEBUGGING
  [locale:en_US.utf8] -Duse64bitall DEBUGGING
  [locale:en_US.utf8]  DEBUGGING
  [locale:en_US.utf8] -Duseithreads
  [locale:en_US.utf8] -Duse64bitall
  [locale:en_US.utf8] -Duseithreads -Duse64bitall

Test todo-passed:
~~ ../dist/Net-Ping/t/450_service.t ............................ PASSED 9 18
  [stdio/perlio/locale:en_US.utf8] 
  [stdio/perlio/locale:en_US.utf8] -Duseithreads DEBUGGING
  [stdio/perlio/locale:en_US.utf8] -Duseithreads -Duse64bitall DEBUGGING
  [stdio/perlio/locale:en_US.utf8] -Duse64bitall DEBUGGING
  [stdio/perlio/locale:en_US.utf8]  DEBUGGING
  [stdio/perlio/locale:en_US.utf8] -Duseithreads
  [stdio/perlio/locale:en_US.utf8] -Duse64bitall
  [stdio/perlio/locale:en_US.utf8] -Duseithreads -Duse64bitall

MANIFEST messages:
  MANIFEST did not declare '.mailmap'

Compiler messages:

About this smoke:
    smoking-perl: 5.26.2
  smoker-version: 1.72_06/0.046
       timestamp: 2020-03-31 20:45:10+00
          tester: merijn

Status overview available here: https://tux.nl/perl5/smoke/
-- 
Report generated by Test::Smoke::Gateway v0.09_01