Show logfile
Automated smoke report for branch blead 5.32.0 patch f12bbb761071acfd5663d673ad891ffbb2ffdbd9 v5.31.10-15-gf12bbb7
x2: ia64 (ia64/4 cpus)
    on        HP-UX B.11.31/64
    using     gcc version 4.7.2 (*1)
    smoketime 12 hours 32 minutes (average 1 hour 34 minutes)

Summary: FAIL(F)

O = OK  F = Failure(s), extended report at the bottom
X = Failure(s) under TEST but not under harness
? = still running or test results not (yet) available
Build failures during:       - = unknown or N/A
c = Configure, m = make, M = make (after miniperl), t = make test-prep

v5.31.10-15-gf12bbb7
---------------------- ----------------------------------------------------
F  F  F  F  F  F        -Dcc=gcc (*1)
F  F  F  F  F  F        -Dcc=gcc -Duse64bitall (*1)
F  F  F  F  F  F        -Dcc=gcc -Duseithreads (*1)
F  F  F  F  F  F        -Dcc=gcc -Duseithreads -Duse64bitall (*1)
|  |  |  |  |  |
|  |  |  |  |  +------  locale:en_US.utf8 DEBUGGING
|  |  |  |  +---------  perlio DEBUGGING
|  |  |  +------------  stdio DEBUGGING
|  |  +---------------  locale:en_US.utf8
|  +------------------  perlio
+---------------------  stdio

Applied patches:
  RC0
  uncommitted-changes
  SMOKEf12bbb761071acfd5663d673ad891ffbb2ffdbd9

Skipped tests:
  None

Test failures:
~~ ../ext/XS-APItest/t/exception.t ............................. FAILED Bad plan.  You planned 12 tests but ran 5.
  [stdio/perlio/locale:en_US.utf8] -Dcc=gcc -Duseithreads -Duse64bitall DEBUGGING
  [stdio/perlio/locale:en_US.utf8] -Dcc=gcc -Duseithreads DEBUGGING
~~ ../lib/locale.t ............................................. FAILED 448
  [perlio] -Dcc=gcc -Duseithreads
  [perlio] -Dcc=gcc -Duseithreads DEBUGGING
~~ ../dist/Devel-PPPort/t/exception.t .......................... FAILED Bad plan.  You planned 7 tests but ran 4.
  [stdio/perlio/locale:en_US.utf8] -Dcc=gcc -Duseithreads -Duse64bitall DEBUGGING
  [stdio/perlio/locale:en_US.utf8] -Dcc=gcc -Duseithreads DEBUGGING
~~ ../dist/IO/t/cachepropagate-unix.t .......................... FAILED 2 10 Non-zero exit status: 2
  [stdio/perlio/locale:en_US.utf8] -Dcc=gcc
  [stdio/perlio/locale:en_US.utf8] -Dcc=gcc -Duse64bitall
  [stdio/perlio/locale:en_US.utf8] -Dcc=gcc -Duseithreads -Duse64bitall DEBUGGING
  [stdio/perlio/locale:en_US.utf8] -Dcc=gcc -Duseithreads DEBUGGING
  [stdio/perlio/locale:en_US.utf8] -Dcc=gcc -Duseithreads
  [stdio/perlio/locale:en_US.utf8] -Dcc=gcc DEBUGGING
  [stdio/perlio/locale:en_US.utf8] -Dcc=gcc -Duse64bitall DEBUGGING
  [stdio/perlio/locale:en_US.utf8] -Dcc=gcc -Duseithreads -Duse64bitall
~~ ../ext/XS-APItest/t/hv_macro.t .............................. FAILED 2-49 60-61 Non-zero exit status: 52 Bad plan.  You planned 63 tests but ran 61.
  [stdio/perlio/locale:en_US.utf8] -Dcc=gcc -Duse64bitall
  [stdio/perlio/locale:en_US.utf8] -Dcc=gcc -Duseithreads -Duse64bitall DEBUGGING
  [stdio/perlio/locale:en_US.utf8] -Dcc=gcc -Duse64bitall DEBUGGING
  [stdio/perlio/locale:en_US.utf8] -Dcc=gcc -Duseithreads -Duse64bitall
~~ ../ext/XS-APItest/t/hv_macro.t .............................. FAILED 2-33 Non-zero exit status: 32
  [stdio/perlio/locale:en_US.utf8] -Dcc=gcc -Duseithreads
  [stdio/perlio/locale:en_US.utf8] -Dcc=gcc
  [stdio/perlio/locale:en_US.utf8] -Dcc=gcc DEBUGGING
  [stdio/perlio/locale:en_US.utf8] -Dcc=gcc -Duseithreads DEBUGGING
~~ ../cpan/Socket/t/Socket.t ................................... FAILED Non-zero exit status: 255 Bad plan.  You planned 6 tests but ran 2.
  [locale:en_US.utf8] -Dcc=gcc
  [locale:en_US.utf8] -Dcc=gcc -Duse64bitall
  [locale:en_US.utf8] -Dcc=gcc -Duseithreads -Duse64bitall DEBUGGING
  [locale:en_US.utf8] -Dcc=gcc -Duseithreads DEBUGGING
  [locale:en_US.utf8] -Dcc=gcc -Duseithreads
  [locale:en_US.utf8] -Dcc=gcc DEBUGGING
  [locale:en_US.utf8] -Dcc=gcc -Duse64bitall DEBUGGING
  [locale:en_US.utf8] -Dcc=gcc -Duseithreads -Duse64bitall

Test todo-passed:
~~ ../dist/Net-Ping/t/450_service.t ............................ PASSED 9 18
  [stdio/perlio/locale:en_US.utf8] -Dcc=gcc
  [stdio/perlio/locale:en_US.utf8] -Dcc=gcc -Duse64bitall
  [stdio/perlio/locale:en_US.utf8] -Dcc=gcc -Duseithreads -Duse64bitall DEBUGGING
  [stdio/perlio/locale:en_US.utf8] -Dcc=gcc -Duseithreads DEBUGGING
  [stdio/perlio/locale:en_US.utf8] -Dcc=gcc -Duseithreads
  [stdio/perlio/locale:en_US.utf8] -Dcc=gcc DEBUGGING
  [stdio/perlio/locale:en_US.utf8] -Dcc=gcc -Duse64bitall DEBUGGING
  [stdio/perlio/locale:en_US.utf8] -Dcc=gcc -Duseithreads -Duse64bitall

MANIFEST messages:

Compiler messages:
  op.c: In function 'Perl_ck_eval':
  op.c:12772:9: warning: value computed is not used [-Wunused-value]
  op.c: In function 'Perl_pmruntime':
  op.c:7444:15: warning: 't_cp' may be used uninitialized in this function [-Wmaybe-uninitialized]
  op.c:7038:14: note: 't_cp' was declared here
  op.c:7481:28: warning: 'r_cp' may be used uninitialized in this function [-Wmaybe-uninitialized]
  op.c:7038:8: note: 'r_cp' was declared here
  pp.c: In function 'Perl_pp_argelem':
  pp.c:7025:13: warning: value computed is not used [-Wunused-value]
  RealPPPort.xs: In function 'XS_Devel__PPPort_check_HeUTF8':
  RealPPPort.xs:1990:17: warning: value computed is not used [-Wunused-value]
  Opcode.xs: In function 'XS_Opcode_invert_opset':
  Opcode.xs:363:2: warning: overflow in implicit constant conversion [-Woverflow]
  ./const-xs.inc: In function 'boot_Socket':
  ./const-xs.inc:986:20: warning: missing braces around initializer [-Wmissing-braces]
  ./const-xs.inc:986:20: warning: (near initialization for 'ip6_address._s6_un') [-Wmissing-braces]
  ./const-xs.inc:995:20: warning: missing braces around initializer [-Wmissing-braces]
  ./const-xs.inc:995:20: warning: (near initialization for 'ip6_address._s6_un') [-Wmissing-braces]
  const-c.inc: In function 'constant_19':
  const-c.inc:351:42: warning: unused parameter 'iv_return' [-Wunused-parameter]
  APItest.xs: In function 'XS_XS__APItest__HvMacro_u8_to_u16_le':
  APItest.xs:6895:13: warning: unused variable 'u64' [-Wunused-variable]
  re_exec.c: In function 'S_dump_exec_pos':
  re_exec.c:4170:21: warning: format '%u' expects argument of type 'unsigned int', but argument 12 has type 'U32' [-Wformat]
  re_exec.c: In function 'S_regtry':
  re_exec.c:6539:30: warning: 'fold_array' may be used uninitialized in this function [-Wmaybe-uninitialized]
  re_exec.c:6443:17: note: 'fold_array' was declared here
  re_exec.c:6545:28: warning: 'folder' may be used uninitialized in this function [-Wmaybe-uninitialized]
  re_exec.c:6442:16: note: 'folder' was declared here
  op.c: In function 'S_pmtrans':
  toke.c: In function 'Perl_scan_num':
  toke.c:11631:54: warning: 'b' may be used uninitialized in this function [-Wmaybe-uninitialized]
  regexec.c: In function 'S_dump_exec_pos':
  regexec.c:4170:21: warning: format '%u' expects argument of type 'unsigned int', but argument 12 has type 'U32' [-Wformat]
  regexec.c: In function 'S_regtry':
  regexec.c:6539:30: warning: 'fold_array' may be used uninitialized in this function [-Wmaybe-uninitialized]
  regexec.c:6443:17: note: 'fold_array' was declared here
  regexec.c:6545:28: warning: 'folder' may be used uninitialized in this function [-Wmaybe-uninitialized]
  regexec.c:6442:16: note: 'folder' was declared here
  time64.c: In function 'Perl_localtime64_r':
  time64.c:573:30: warning: 'orig_year' may be used uninitialized in this function [-Wmaybe-uninitialized]
  Storable.xs: In function 'store_hook':
  Storable.xs:4087:17: warning: format '%d' expects argument of type 'int', but argument 3 has type 'I32' [-Wformat]
  Storable.xs: In function 'store':
  Storable.xs:4462:6: warning: format '%d' expects argument of type 'int', but argument 3 has type 'I32' [-Wformat]
  re_exec.c:4170:21: warning: format '%u' expects argument of type 'unsigned int', but argument 13 has type 'U32' [-Wformat]
  shared.xs: In function 'sharedsv_scalar_store':
  shared.xs:830:13: warning: value computed is not used [-Wunused-value]
  regexec.c:4170:21: warning: format '%u' expects argument of type 'unsigned int', but argument 13 has type 'U32' [-Wformat]

About this smoke:
    smoking-perl: 5.26.2
  smoker-version: 1.72_06/0.046
       timestamp: 2020-03-27 07:22:55+00
          tester: merijn

Status overview available here: https://tux.nl/perl5/smoke/
-- 
Report generated by Test::Smoke::Gateway v0.09_01