Show logfile
Automated smoke report for branch blead 5.32.0 patch afd41ae4e769eb6f4f106977edabdca9ab36b497 v5.31.10-14-gafd41ae
i3: PPC_POWER5 (PPC/1 cpus)
    on        AIX 5.3.0.0/TL12-05
    using     gcc -maix32 version 4.2.4 (*1)
    using     gcc -maix64 version 4.2.4 (*2)
    smoketime 1 day 2 hours 12 minutes (average 3 hours 16 minutes)

Summary: FAIL(F)

O = OK  F = Failure(s), extended report at the bottom
X = Failure(s) under TEST but not under harness
? = still running or test results not (yet) available
Build failures during:       - = unknown or N/A
c = Configure, m = make, M = make (after miniperl), t = make test-prep

v5.31.10-14-gafd41ae
---------------------- ----------------------------------------------------
F  F  F  F  F  F        -Dcc=gcc (*1)
-  -  -  -  -  -        -Dcc=gcc -Duse64bitall (*1)
F  F  F  F  F  F        -Dcc=gcc -Duseithreads (*1)
-  -  -  -  -  -        -Dcc=gcc -Duseithreads -Duse64bitall (*1)
-  -  -  -  -  -        -Dcc=gcc (*2)
F  F  F  F  F  F        -Dcc=gcc -Duse64bitall (*2)
-  -  -  -  -  -        -Dcc=gcc -Duseithreads (*2)
F  F  F  F  F  F        -Dcc=gcc -Duseithreads -Duse64bitall (*2)
|  |  |  |  |  |
|  |  |  |  |  +------  locale:EN_US.UTF-8 DEBUGGING
|  |  |  |  +---------  perlio DEBUGGING
|  |  |  +------------  stdio DEBUGGING
|  |  +---------------  locale:EN_US.UTF-8
|  +------------------  perlio
+---------------------  stdio

Applied patches:
  RC0
  uncommitted-changes
  SMOKEafd41ae4e769eb6f4f106977edabdca9ab36b497

Skipped tests:
  None

Test failures:
~~ ../cpan/ExtUtils-MakeMaker/t/03-xsstatic.t .................. FAILED 5 11 17 23 29 35 Non-zero exit status: 6
  [stdio/perlio/locale:EN_US.UTF-8] -Dcc=gcc
  [stdio/perlio/locale:EN_US.UTF-8] -Dcc=gcc -Duse64bitall
  [stdio/perlio/locale:EN_US.UTF-8] -Dcc=gcc -Duseithreads -Duse64bitall DEBUGGING
  [stdio/perlio/locale:EN_US.UTF-8] -Dcc=gcc -Duseithreads DEBUGGING
  [stdio/perlio/locale:EN_US.UTF-8] -Dcc=gcc -Duseithreads
  [stdio/perlio/locale:EN_US.UTF-8] -Dcc=gcc DEBUGGING
  [stdio/perlio/locale:EN_US.UTF-8] -Dcc=gcc -Duse64bitall DEBUGGING
  [stdio/perlio/locale:EN_US.UTF-8] -Dcc=gcc -Duseithreads -Duse64bitall
~~ ../ext/XS-APItest/t/hv_macro.t .............................. FAILED 2-49 60-61 Non-zero exit status: 52 Bad plan.  You planned 63 tests but ran 61.
  [stdio/perlio/locale:EN_US.UTF-8] -Dcc=gcc -Duse64bitall
  [stdio/perlio/locale:EN_US.UTF-8] -Dcc=gcc -Duseithreads -Duse64bitall DEBUGGING
  [stdio/perlio/locale:EN_US.UTF-8] -Dcc=gcc -Duse64bitall DEBUGGING
  [stdio/perlio/locale:EN_US.UTF-8] -Dcc=gcc -Duseithreads -Duse64bitall
~~ ../ext/XS-APItest/t/hv_macro.t .............................. FAILED 2-33 Non-zero exit status: 32
  [stdio/perlio/locale:EN_US.UTF-8] -Dcc=gcc -Duseithreads
  [stdio/perlio/locale:EN_US.UTF-8] -Dcc=gcc
  [stdio/perlio/locale:EN_US.UTF-8] -Dcc=gcc DEBUGGING
  [stdio/perlio/locale:EN_US.UTF-8] -Dcc=gcc -Duseithreads DEBUGGING
~~ ../cpan/Socket/t/Socket.t ................................... FAILED Non-zero exit status: 255 Bad plan.  You planned 6 tests but ran 2.
  [locale:EN_US.UTF-8] -Dcc=gcc
  [locale:EN_US.UTF-8] -Dcc=gcc -Duse64bitall
  [locale:EN_US.UTF-8] -Dcc=gcc -Duseithreads -Duse64bitall DEBUGGING
  [locale:EN_US.UTF-8] -Dcc=gcc -Duseithreads DEBUGGING
  [locale:EN_US.UTF-8] -Dcc=gcc -Duseithreads
  [locale:EN_US.UTF-8] -Dcc=gcc DEBUGGING
  [locale:EN_US.UTF-8] -Dcc=gcc -Duse64bitall DEBUGGING
  [locale:EN_US.UTF-8] -Dcc=gcc -Duseithreads -Duse64bitall

Test todo-passed:

MANIFEST messages:
  MANIFEST did not declare 'rm.sh'
  MANIFEST did not declare 'rmf.sh'

Compiler messages:
  op.c: In function 'Perl_ck_eval':
  op.c:12772: warning: value computed is not used
  op.c: In function 'Perl_report_redefined_cv':
  op.c:18387: warning: passing argument 1 of 'Perl_CvGV' discards qualifiers from pointer target type
  op.c: In function 'Perl_pmruntime':
  op.c:7038: warning: 't_cp' may be used uninitialized in this function
  op.c:7038: note: 't_cp' was declared here
  op.c:7038: warning: 'r_cp' may be used uninitialized in this function
  op.c:7038: note: 'r_cp' was declared here
  intrpvar.h: In function 'S_init_interp':
  intrpvar.h:813: warning: 'Perl_sv_nounlocking' is deprecated (declared at proto.h:3526)
  proto.h:6470: warning: 'S_parse_ident' declared inline after being called
  proto.h:6470: warning: previous declaration of 'S_parse_ident' was here
  toke.c: In function 'Perl_scan_num':
  toke.c:11604: warning: 'b' may be used uninitialized in this function
  regcomp.c: In function 'S_study_chunk':
  regcomp.c:5573: warning: comparison between signed and unsigned
  regcomp.c: In function 'S_regpiece':
  regcomp.c:12752: warning: comparison between signed and unsigned
  regcomp.c: In function 'S_regtail':
  regcomp.c:20628: warning: comparison between signed and unsigned
  dump.c: In function 'Perl_do_sv_dump':
  dump.c:2308: warning: passing argument 1 of 'Perl_CvGV' discards qualifiers from pointer target type
  sv.c: In function 'Perl_sv_setpviv_mg':
  sv.c:10751: warning: 'Perl_sv_setpviv' is deprecated (declared at sv.c:10721)
  pp.c: In function 'Perl_pp_argelem':
  pp.c:7025: warning: value computed is not used
  pp_sys.c: In function 'Perl_pp_stat':
  pp_sys.c:2945: warning: comparison of unsigned expression < 0 is always false
  regexec.c: In function 'S_regmatch':
  regexec.c:8250: warning: comparison between signed and unsigned
  regexec.c:8273: warning: comparison between signed and unsigned
  universal.c: In function 'Perl_croak_xs_usage':
  universal.c:413: warning: passing argument 1 of 'Perl_CvGV' discards qualifiers from pointer target type
  mathoms.c: In function 'Perl_sv_pvbyten':
  mathoms.c:470: warning: 'Perl_sv_pvn' is deprecated (declared at mathoms.c:387)
  mathoms.c: In function 'Perl_sv_pvutf8n':
  mathoms.c:506: warning: 'Perl_sv_pvn' is deprecated (declared at mathoms.c:387)
  time64.c: In function 'Perl_localtime64_r':
  time64.c:482: warning: 'orig_year' may be used uninitialized in this function
  B.c: In function 'XS_B__PADNAME_TYPE':
  B.xs:2210: warning: 'ret' may be used uninitialized in this function
  B.xs:2210: note: 'ret' was declared here
  RealPPPort.xs: In function 'XS_Devel__PPPort_check_HeUTF8':
  RealPPPort.xs:1990: warning: value computed is not used
  ODBM_File.c: In function 'XS_ODBM_File_FETCH':
  ODBM_File.c:387: warning: request for implicit conversion from 'void *' to 'const char * const' not permitted in C++
  ODBM_File.xs: In function 'XS_ODBM_File_STORE':
  ODBM_File.xs:176: warning: format '%s' expects type 'char *', but argument 4 has type 'void *'
  ODBM_File.c: In function 'XS_ODBM_File_FIRSTKEY':
  ODBM_File.c:524: warning: request for implicit conversion from 'void *' to 'const char * const' not permitted in C++
  ODBM_File.c: In function 'XS_ODBM_File_NEXTKEY':
  ODBM_File.c:566: warning: request for implicit conversion from 'void *' to 'const char * const' not permitted in C++
  Opcode.xs: In function 'XS_Opcode_invert_opset':
  Opcode.xs:363: warning: overflow in implicit constant conversion
  ./const-xs.inc: In function 'boot_Socket':
  ./const-xs.inc:986: warning: missing braces around initializer
  ./const-xs.inc:986: warning: (near initialization for 'ip6_address.u6_addr')
  ./const-xs.inc:995: warning: missing braces around initializer
  ./const-xs.inc:995: warning: (near initialization for 'ip6_address.u6_addr')
  const-c.inc: In function 'constant_19':
  const-c.inc:351: warning: unused parameter 'iv_retu[2020-03-25 00:22:55MET] Skip tests from '/pro/3gl/CPAN/smoke/p59.skip'
  APItest.xs: In function 'XS_XS__APItest__HvMacro_u8_to_u16_le':
  APItest.xs:6895: warning: unused variable 'u64'
  re_exec.c: In function 'S_dump_exec_pos':
  re_exec.c:4170: warning: format '%4u' expects type 'unsigned int', but argument 12 has type 'U32'
  re_exec.c: In function 'S_regmatch':
  re_exec.c:8250: warning: comparison between signed and unsigned
  re_exec.c:8273: warning: comparison between signed and unsigned
  re_exec.c: In function 'S_regtry':
  re_exec.c:6443: warning: 'fold_array' may be used uninitialized in this function
  re_exec.c:6443: note: 'fold_array' was declared here
  re_exec.c:6442: warning: 'folder' may be used uninitialized in this function
  re_exec.c:6442: note: 'folder' was declared here
  re_comp.c: In function 'S_study_chunk':
  re_comp.c:5573: warning: comparison between signed and unsigned
  re_comp.c: In function 'S_regpiece':
  re_comp.c:12752: warning: comparison between signed and unsigned
  re_comp.c: In function 'S_regtail':
  re_comp.c:20628: warning: comparison between signed and unsigned
  re_comp.c: In function 'S_regtail_study':
  re_comp.c:20742: warning: comparison between signed and unsigned
  op.c:18390: warning: passing argument 1 of 'Perl_CvGV' discards qualifiers from pointer target type
  op.c:18391: warning: passing argument 1 of 'Perl_CvGV' discards qualifiers from pointer target type
  op.c:18392: warning: passing argument 1 of 'Perl_CvGV' discards qualifiers from pointer target type
  pad.c: In function 'S_cv_dump':
  pad.c:1859: warning: passing argument 1 of 'Perl_CvGV' discards qualifiers from pointer target type
  pad.c:1867: warning: passing argument 1 of 'Perl_CvGV' discards qualifiers from pointer target type
  pad.c:1873: warning: passing argument 1 of 'Perl_CvGV' discards qualifiers from pointer target type
  regcomp.c: In function 'S_regtail_study':
  regcomp.c:20742: warning: comparison between signed and unsigned
  dump.c:2315: warning: passing argument 1 of 'Perl_CvGV' discards qualifiers from pointer target type
  regexec.c: In function 'S_dump_exec_pos':
  regexec.c:4170: warning: format '%4u' expects type 'unsigned int', but argument 12 has type 'U32'
  regexec.c: In function 'S_regtry':
  regexec.c:6443: warning: 'fold_array' may be used uninitialized in this function
  regexec.c:6443: note: 'fold_array' was declared here
  regexec.c:6442: warning: 'folder' may be used uninitialized in this function
  regexec.c:6442: note: 'folder' was declared here
  DynaLoader.xs: In function 'XS_DynaLoader_dl_load_file':
  DynaLoader.xs:704: warning: format '%x' expects type 'unsigned int', but argument 3 has type 'void *'
  DynaLoader.xs: In function 'XS_DynaLoader_dl_unload_file':
  DynaLoader.xs:716: warning: format '%lx' expects type 'long unsigned int', but argument 3 has type 'void *'
  DynaLoader.xs: In function 'XS_DynaLoader_dl_find_symbol':
  DynaLoader.xs:732: warning: format '%x' expects type 'unsigned int', but argument 3 has type 'void *'
  DynaLoader.xs:735: warning: format '%x' expects type 'unsigned int', but argument 3 has type 'void *'
  DynaLoader.xs: In function 'XS_DynaLoader_dl_install_xsub':
  DynaLoader.xs:758: warning: format '%x' expects type 'unsigned int', but argument 4 has type 'void *'
  Storable.xs: In function 'store_hook':
  Storable.xs:4087: warning: format '%d' expects type 'int', but argument 3 has type 'I32'
  Storable.xs: In function 'store':
  Storable.xs:4462: warning: format '%d' expects type 'int', but argument 3 has type 'I32'
  const-c.inc:351: warning: unused parameter 'iv_return'
  const-c.inc: In function '_constant_8':
  const-c.inc:583: warning: cast from pointer to integer of different size
  op.c:18387: warning: passing argument 2 of 'Perl_CvGV' discards qualifiers from pointer target type
  perl.c: In function 'S_init_tls_and_interp':
  perl.c:90: warning: implicit declaration of function 'pthread_init'
  dump.c:2308: warning: passing argument 2 of 'Perl_CvGV' discards qualifiers from pointer target type
  pp_sys.c: In function 'Perl_pp_gprotoent':
  pp_sys.c:5160: warning: left-hand operand of comma expression has no effect
  pp_sys.c:5168: warning: left-hand operand of comma expression has no effect
  pp_sys.c:5175: warning: left-hand operand of comma expression has no effect
  pp_sys.c: In function 'Perl_pp_gservent':
  pp_sys.c:5224: warning: left-hand operand of comma expression has no effect
  pp_sys.c:5234: warning: left-hand operand of comma expression has no effect
  pp_sys.c:5241: warning: left-hand operand of comma expression has no effect
  pp_sys.c: In function 'Perl_pp_shostent':
  pp_sys.c:5289: warning: value computed is not used
  pp_sys.c:5296: warning: value computed is not used
  pp_sys.c:5303: warning: value computed is not used
  universal.c:413: warning: passing argument 2 of 'Perl_CvGV' discards qualifiers from pointer target type
  B.xs:2210: note: 'ret' was declared [2020-03-25 12:18:36MET] Skip tests from '/pro/3gl/CPAN/smoke/p59.skip'
  re_exec.c:4170: warning: format '%4u' expects type 'unsigned int', but argument 13 has type 'U32'
  shared.xs: In function 'sharedsv_scalar_store':
  shared.xs:830: warning: value computed is not used
  shared.xs: In function 'sharedsv_array_mg_CLEAR':
  shared.xs:1149: warning: 'iter' may be used uninitialized in this function
  op.c:18390: warning: passing argument 2 of 'Perl_CvGV' discards qualifiers from pointer target type
  op.c:18391: warning: passing argument 2 of 'Perl_CvGV' discards qualifiers from pointer target type
  op.c:18392: warning: passing argument 2 of 'Perl_CvGV' discards qualifiers from pointer target type
  pad.c:1859: warning: passing argument 2 of 'Perl_CvGV' discards qualifiers from pointer target type
  pad.c:1867: warning: passing argument 2 of 'Perl_CvGV' discards qualifiers from pointer target type
  pad.c:1873: warning: passing argument 2 of 'Perl_CvGV' discards qualifiers from pointer target type
  dump.c:2315: warning: passing argument 2 of 'Perl_CvGV' discards qualifiers from pointer target type
  regexec.c:4170: warning: format '%4u' expects type 'unsigned int', but argument 13 has type 'U32'
  nst-c.inc: In function '_constant_8':

About this smoke:
    smoking-perl: 5.14.2
  smoker-version: 1.72_06/0.046
       timestamp: 2020-03-24 23:09:43+00
          tester: merijn

Status overview available here: https://tux.nl/perl5/smoke/
-- 
Report generated by Test::Smoke::Gateway v0.09_01